{"text_format":"1","workbook":"xlsx","n_sheets":15,"sheets":["Obsah","B1","B2","B3","B4","B5","B6","B7","B8","B9","B10","B11","B12","Paragrafy","Komentáře"],"not_rendered":{"charts":0,"images":0,"macros":1,"external_links":1,"defined_names":33,"comments":0,"pivot_tables":0},"unopened":[],"bounds":{"document_bytes":16777216,"sheet_cells":100000,"rows_first":2000,"rows_last":500,"rows_between":2000,"halvings":0,"cell_chars":16384,"cell_head_chars":4096},"cells_cut":0,"cells_raw":0,"read":"whole","date_system":"1900"}

{"sheet":"Obsah","index":0,"n_rows":30,"n_cols":5,"rows_kept":30,"cut":false,"hidden":false,"merged":[]}
[null,null,null,null,100]
[]
[null,null,"B. Příjmy a výdaje"]
[null,null,"Zdroje dat jsou uvedeny v zápatí jednotlivých tabulek"]
[null,null,null,"   "]
[null,null,"Text",null,"Obsah"]
[]
[null,null,"Tabulka 1",null,"Veřejné výdaje a příjmy v oblasti školství "]
[]
[null,null,"Tabulka 2",null,"Přehled běžných a kapitálových výdajů, příjmů a plnění rozpočtu kapitoly 333-MŠMT"]
[]
[null,null,"Tabulka 3",null,"Přehled výdajů kapitoly 333-MŠMT – státní správa a vzdělávání "]
[]
[null,null,"Tabulka 4",null,"Příjmy kapitoly 333-MŠMT – podle položek "]
[]
[null,null,"Tabulka 5",null,"Příjmy kapitoly 700-Obce a DSO; KÚ (část: vzdělávání) – podle položek "]
[]
[null,null,"Tabulka 6",null,"Výdaje kapitoly 333-MŠMT – podle položek "]
[]
[null,null,"Tabulka 7",null,"Výdaje kapitoly 700-Obce a DSO; KÚ (část: 31–32– vzdělávání) – podle položek "]
[]
[null,null,"Tabulka 8",null,"Běžné a kapitálové výdaje kapitoly 333-MŠMT – podle paragrafů "]
[]
[null,null,"Tabulka 9",null,"Běžné a kapitálové výdaje kapitoly 700-Obce a DSO; KÚ (část: 31–32–vzdělávání) – podle paragrafů "]
[]
[null,null,"Tabulka 10",null,"Výdaje kapitol 333-MŠMT a 700-Obce a DSO; KÚ  (vzdělávání) – podle paragrafů "]
[]
[null,null,"Tabulka 11",null,"Poskytnuté dotace církevním školám – podle paragrafů "]
[]
[null,null,"Tabulka 12",null,"Porovnání čerpaných dotací církevním školám v letech 20017 a 2018 – vybrané oblasti"]

{"sheet":"B1","index":1,"n_rows":25,"n_cols":25,"rows_kept":25,"cut":false,"hidden":false,"merged":[[23,21,23,24],[8,35,12,35],[8,36,12,41],[8,42,11,44],[8,20,11,22],[8,23,12,23],[8,24,12,24],[8,25,12,30],[8,31,11,33],[8,12,12,12],[8,13,12,13],[8,9,11,11],[8,3,12,8],[8,34,12,34]]}
[{"$f":"IF(#REF!=\"\",\"ŠABLONA\",IF(#REF!=\"T\",\"TISK\",\"ELEKTRO\"))","v":{"$error":"#REF!"}},0,{"$f":"CONCATENATE(D1,F1,IF(G1<>\"\",\".\",\"\"),G1,IF(H1<>\"\",\".\",\"\"),H1,IF(I1<>\"\",\".\",\"\"),I1,\"\")","v":{"$error":"#REF!"}},{"$f":"IF(#REF!=\"\",\" ?\",#REF!)","v":{"$error":"#REF!"}},{"$f":"CONCATENATE(C1,N1)","v":{"$error":"#REF!"}},1]
["konst"]
["konst","9x5",null,"Tab. B1:",null,null,null,"Veřejné výdaje a příjmy v oblasti školství",null,null,null,null,null,3843471,"Tab. B1:",null,"Veřejné výdaje a příjmy v oblasti vzdělávání a školských služeb "]
["konst",{"$f":"COUNTA(Datova_oblast)","v":45},null,{"$f":"IF(D1=\" ?\",\"\",CONCATENATE(\"Tab. \",E1,\":\"))","v":{"$error":"#REF!"}},null,null,null,{"$f":"IF(H3=\"Zadejte název tabulky\",\"\",H3)","v":"Veřejné výdaje a příjmy v oblasti školství"}]
[{"$f":"IF(D5=\"\",\"odstr\",\"OK\")","v":"odstr"},0]
[{"$f":"IF(COUNTBLANK(C6:IV6)=254,\"odstr\",\"OK\")","v":"odstr"},"Řádky pro"]
[{"$f":"IF(COUNTBLANK(C7:IV7)=254,\"odstr\",\"OK\")","v":"odstr"},"ročenku PaM"]
["konst",null,null,"(podle stavu k: 31. 12. 2017)",null,null,null,null,null,null,null,null,null,"v tis. Kč","(podle stavu k: 31. 12. 2018)",null,null,null,null,null,null,null,null,null,"v tis. Kč"]
["konst",null,null,null,null,null,null,null,null,"Výdaje",null,null,"Podíl výdajů na HDP","Příjmy celkem",null,null,null,null,null,null,"Výdaje",null,null,"Podíl výdajů na HDP","Příjmy celkem"]
["konst"]
["konst"]
["konst"]
["konst","nebo odstr",null,null,null,null,null,null,null,"běžné","kapitálové","celkem",null,null,null,null,null,null,null,null,"běžné","kapitálové","celkem"]
["konst","OK",null,null,"Kapitola 333-MŠMT",null,null,null,null,151878791.01672998,5632649.0073900009,157511440.02411997,3.115935438236259E-2,3274552.8891199999,"Kapitola 333-MŠMT",null,null,null,null,null,164364833.41688001,10605088.26169,174969921.67857,3.2800000000000003E-2,8248802.8099999996]
["konst","OK",null,null,"Kapitola 700-Obce a DSO1)",null,null,null,null,33100413.150529996,10117079.32487,43217492.475399993,8.5494054485938647E-3,783585.08624999993,"Kapitola 700-Obce a DSO1)",null,null,null,null,null,{"$f":"'B9'!X15","v":35676406.316289999},{"$f":"'B9'!Y15","v":14056598.283980001},{"$f":"'B9'!Z15","v":49733004.600270003},9.2999999999999992E-3,400380.2]
["konst","OK",null,null,"Kapitola 700-Krajské úřady1)",null,null,null,null,97280924.71187003,2068752.5878400004,99349677.299710035,1.9653631522135687E-2,472146.35280999995,"Kapitola 700-Krajské úřady1)",null,null,null,null,null,{"$f":"'B9'!AA15","v":109788985.34161},{"$f":"'B9'!AB15","v":6192138.7592900004},{"$f":"'B9'!AC15","v":115981124.10089999},2.1760000000000002E-2,623200.74879999994]
["konst","OK",null,null,"Transfery z MŠMT veřejným rozpočtům místní úrovně",null,null,null,null,-106016383.94771999,-420092.31105000002,-106436476.25876999,-2.1055561948065973E-2,"(neuvedeno)","Transfery z MŠMT veřejným rozpočtům místní úrovně",null,null,null,null,null,-120275674.01342,-1141995.75171,{"$f":"U17+V17","v":-121417669.76513},-2.2780000000000002E-2,"(neuvedeno)"]
["konst","OK",null,null,"Celkem",null,null,null,null,176243744.93141001,17398388.609050002,193642133.54045999,3.8306829405026159E-2,4530284.3281800002,"Celkem",null,null,null,null,null,189554551,29711829.600000001,219266380.59999999,4.1099999999999998E-2,9272383.6999999993]
["konst","OK",null,null,"Ministerstvo obrany (kapitola 307)",null,null,null,null,1106057.17243,74874.33064,1180931.5030700001,2.3361517868047843E-4,"(neuvedeno)","Ministerstvo obrany (kapitola 307)",null,null,null,null,null,1233907.07822,87736.506160000004,1321643.5843799999,2.4800000000000001E-4,"(neuvedeno)"]
["konst","OK",null,null,null,"z toho transfer krajským úřadům",null,null,null,0,0,0,0,"(neuvedeno)",null,"z toho transfer krajským úřadům",null,null,null,null,-12426.407999999999,0,-12426.407999999999,0,"(neuvedeno)"]
["konst","OK",null,null,"Ministerstvo spravedlnosti (kapitola 336)",null,null,null,null,"x ","x ","x ","x ","x ","Ministerstvo spravedlnosti (kapitola 336)",null,null,null,null,null,"x","x","x","x","x"]
["konst","OK",null,null,"Ministerstvo vnitra (kapitola 314)",null,null,null,null,".",".",".",".",".","Ministerstvo vnitra (kapitola 314)",null,null,null,null,null,".",".",".",".","."]
["konst","OK",null,null,"Celkem oblast školství",null,null,null,null,177349802.10384002,17473262.939690001,194823065.04352999,3.8540444583706639E-2,4530284.3281800002,"Celkem oblast školství",null,null,null,null,null,190776031.69999999,{"$f":"V18+V19","v":29799566.10616},220575597.80000001,null,{"$f":"Y18","v":9272383.6999999993}]
["konst","stop",null,"Komentáře:",null,null,null,null,null,null,null,null,null,"Zdroj: Závěrečný účet – kapitola 333-MŠMT, 700-Obce a DSO; KÚ, 307-MO",null,null,null,null,null,null,null,"Zdroj: Závěrečný účet kapitoly 333-MŠMT; monitor.statnipokladna.cz"]
["stop"]

{"sheet":"B2","index":2,"n_rows":19,"n_cols":23,"rows_kept":19,"cut":false,"hidden":false,"merged":[[8,12,12,12],[8,9,11,11],[8,3,12,8],[8,39,11,39],[8,13,12,18],[8,19,11,21],[8,22,12,22],[8,23,12,28],[8,29,11,31],[8,32,12,32],[8,33,12,38]]}
[{"$f":"IF(#REF!=\"\",\"ŠABLONA\",IF(#REF!=\"T\",\"TISK\",\"ELEKTRO\"))","v":{"$error":"#REF!"}},0,{"$f":"CONCATENATE(D1,F1,IF(G1<>\"\",\".\",\"\"),G1,IF(H1<>\"\",\".\",\"\"),H1,IF(I1<>\"\",\".\",\"\"),I1,\"\")","v":{"$error":"#REF!"}},{"$f":"IF(#REF!=\"\",\" ?\",#REF!)","v":{"$error":"#REF!"}},{"$f":"CONCATENATE(C1,M1)","v":{"$error":"#REF!"}},2]
["konst"]
["konst","3x4",null,"Tab. B2:",null,null,null,"Přehled běžných a kapitálových výdajů, příjmů a plnění rozpočtu kapitoly 333-MŠMT",null,null,null,null,null,"Tab. B2:",null,null,null,"Přehled běžných a kapitálových výdajů, příjmů a plnění rozpočtu kapitoly 333-MŠMT"]
["konst",{"$f":"COUNTA(Datova_oblast)","v":12},null,{"$f":"IF(D1=\" ?\",\"\",CONCATENATE(\"Tab. \",E1,\":\"))","v":{"$error":"#REF!"}},null,null,null,{"$f":"IF(H3=\"Zadejte název tabulky\",\"\",H3)","v":"Přehled běžných a kapitálových výdajů, příjmů a plnění rozpočtu kapitoly 333-MŠMT"}]
[{"$f":"IF(D5=\"\",\"odstr\",\"OK\")","v":"odstr"},0]
[{"$f":"IF(COUNTBLANK(C6:IV6)=254,\"odstr\",\"OK\")","v":"odstr"},"Řádky pro"]
[{"$f":"IF(COUNTBLANK(C7:IV7)=254,\"odstr\",\"OK\")","v":"odstr"},"ročenku PaM"]
["konst",null,null,"(podle stavu k: 31. 12. 2017)",null,null,null,null,null,null,null,null,null,"(podle stavu k: 31. 12. 2018)",null,null,null,null,null,null,null,null,"v tis. Kč"]
["konst",null,null,null,null,null,null,null,null,"Výdaje",null,null,"Příjmy celkem",null,null,null,null,null,null,"Výdaje",null,null,"Příjmy celkem"]
["konst"]
["konst"]
["konst"]
["konst","nebo odstr",null,null,null,null,null,null,null,"běžné","kapitálové","celkem",null,null,null,null,null,null,null,"běžné","kapitálové","celkem"]
["konst","OK",null,null,"Schválený rozpočet",null,null,null,null,148332711.70199999,8193150.466,156525862.16799998,8645045.5140000004,null,"Schválený rozpočet",null,null,null,null,168608031.97999999,7503677.926,{"$f":"T14+U14","v":176111709.90599999},7192982.1600000001]
["konst","OK",null,null,"Rozpočet po změnách",null,null,null,null,151760634.234,7741115.0270000007,159501749.26100001,8645045.5140000004,null,"Rozpočet po změnách",null,null,null,null,172905173.93200001,10647505.995000001,{"$f":"T15+U15","v":183552679.92700002},13900115.199999999]
["konst","OK",null,null,"Skutečnost",null,null,null,null,151878791.01672998,5632649.0073899999,157511440.02411997,3274552.8891199999,null,"Skutečnost",null,null,null,null,174693824.50187999,13022564.07,187415570.88,8248802.8099999996]
["konst","OK",null,null,"Plnění rozpočtu v procentech",null,null,null,null,1.0007785733324479,0.72762760761777268,0.98752170903390413,0.37877798142498015,null,"Plnění rozpočtu v procentech",null,null,null,null,1.0103446908453035,1.2230623843851613,1.0226839981118003,0.59340000000000004]
["konst","stop",null,"",null,null,null,null,null,null,null,null,null,null,null,null,null,null,null,null,null,null,"Zdroj: Závěrečný účet – kapitola 333-MŠMT; monitor.statnipokladna.cz"]
["stop"]

{"sheet":"B3","index":3,"n_rows":23,"n_cols":29,"rows_kept":23,"cut":false,"hidden":false,"merged":[[8,38,11,40],[20,17,20,28],[20,30,20,40],[21,17,21,28],[21,30,21,40],[8,16,12,21],[8,22,11,24],[8,25,11,27],[8,28,12,28],[8,29,12,34],[8,35,11,37],[19,18,19,28],[21,4,21,15],[8,15,12,15],[20,4,20,15],[8,3,12,8],[8,9,11,11],[8,12,11,14]]}
[{"$f":"IF(#REF!=\"\",\"ŠABLONA\",IF(#REF!=\"T\",\"TISK\",\"ELEKTRO\"))","v":{"$error":"#REF!"}},0,{"$f":"CONCATENATE(D1,F1,IF(G1<>\"\",\".\",\"\"),G1,IF(H1<>\"\",\".\",\"\"),H1,IF(I1<>\"\",\".\",\"\"),I1,\"\")","v":{"$error":"#REF!"}},{"$f":"IF(#REF!=\"\",\" ?\",#REF!)","v":{"$error":"#REF!"}},{"$f":"CONCATENATE(C1,P1)","v":{"$error":"#REF!"}},3]
["konst"]
["konst","3x7",null,"Tab. B3:",null,null,null,"Přehled výdajů kapitoly 333-MŠMT – státní správa a vzdělávání",null,null,null,null,null,null,null,null,"Tab. B3:",null,null,null,"Přehled výdajů kapitoly 333-MŠMT – státní správa a vzdělávání"]
["konst",{"$f":"COUNTA(Datova_oblast)","v":21},null,{"$f":"IF(D1=\" ?\",\"\",CONCATENATE(\"Tab. \",E1,\":\"))","v":{"$error":"#REF!"}},null,null,null,{"$f":"IF(H3=\"Zadejte název tabulky\",\"\",H3)","v":"Přehled výdajů kapitoly 333-MŠMT – státní správa a vzdělávání"}]
[{"$f":"IF(D5=\"\",\"odstr\",\"OK\")","v":"odstr"},0]
[{"$f":"IF(COUNTBLANK(C6:IV6)=254,\"odstr\",\"OK\")","v":"odstr"},"Řádky pro"]
[{"$f":"IF(COUNTBLANK(C7:IV7)=254,\"odstr\",\"OK\")","v":"odstr"},"ročenku PaM"]
["konst",null,null,"(podle stavu k: 31. 12. 2017)",null,null,null,null,null,null,null,null,null,null,null,"v tis. Kč","(podle stavu k: 31. 12. 2018)",null,null,null,null,null,null,null,null,null,null,null,"v tis. Kč"]
["konst",null,null,null,null,null,null,null,null,"Běžné výdaje",null,null,"Kapitálové výdaje",null,null,"Výdaje         celkem",null,null,null,null,null,null,"Běžné výdaje",null,null,"Kapitálové výdaje",null,null,"Výdaje         celkem"]
["konst"]
["konst"]
["konst"]
["konst","nebo odstr",null,null,null,null,null,null,null,"státní správa","vzdělávání","ostatní","státní správa ","vzdělávání","ostatní",null,null,null,null,null,null,null,"státní správa 1)","vzdělávání 2)","ostatní 3)","státní správa 1)","vzdělávání 2)","ostatní 3)"]
["konst","OK",null,null,"Schválený rozpočet",null,null,null,null,842175.071,134134545.154,13355991.476999993,12869.07,3652457.9190000002,4527823.477,156525862.16799998,null,"Schválený rozpočet",null,null,null,null,910931.45,160779210.66,155146.69,125469.07,4059136.4509999999,1618657.199,176111709.90799999]
["konst","OK",null,null,"Rozpočet po změnách",null,null,null,null,850712.34,137712361.28600001,13197560.607999984,13171.572,3774579.227,3953364.2280000006,159501749.26100001,null,"Rozpočet po změnách",null,null,null,null,908081.94,170377927,161733.07,35046.978999999999,8151432.6600000001,1054503.304,183552679.92700002]
["konst","OK",null,null,"Skutečnost",null,null,null,null,827390.06492999999,141528772.13253999,9522628.8192599937,22710.560409999998,3405327.1045300001,2204611.3424499999,157511440.02411997,null,"Skutečnost",null,null,null,null,845264.4,174969921.68000001,164044.12,105594.239,10594528.837789999,910491.71725999995,187716388.57187998]
["konst","OK",null,null,"Plnění rozpočtu v procentech",null,null,null,null,0.97258500438585394,1.0277129141560073,0.72154461738085507,1.7242103228073307,0.90217396423190777,0.55765449761387365,0.98752170903390413,null,"Plnění rozpočtu v procentech",null,null,null,null,0.93079999999999996,1.0269999999999999,1.0143,3.0129299999999999,1.2997099999999999,0.86343000000000003,1.0226839981118003]
["konst","stop",null,null,null,null,null,null,null,null,null,null,null,null,null,"Zdroj: Závěrečný účet – kapitola 333-MŠMT",null,null,null,null,null,null,null,null,null,null,null,null,"Zdroj: Závěrečný účet – kapitola 333-MŠMT"]
[null,null,null,null,null,null,null,null,null,null,null,null,null,null,null,null,null,"Komentáře:"]
[null,null,null,null,null,null,null,null,null,null,null,null,null,null,null,null,null,"1)","§ 326x"]
[{"$f":"IF(COUNTBLANK(D21:E21)=2,\"odstr\",\"OK\")","v":"odstr"},null,null,null,null,null,null,null,null,null,null,null,null,null,null,null,null,"2) § 3111, 3112, 3113, 3114, 3115, 3117, 3118, 3119, 312x, 313x , 3143, 3141, 3142, 3150, 321x, 322x, 3231"]
[{"$f":"IF(COUNTBLANK(D22:E22)=2,\"odstr\",\"OK\")","v":"odstr"},null,null,null,null,null,null,null,null,null,null,null,null,null,null,null,null,"3) § 3144,3145, 3146,3147,3148,3149,3232,3233,3239,3280,329x"]
["stop"]

{"sheet":"B4","index":4,"n_rows":68,"n_cols":24,"rows_kept":68,"cut":false,"hidden":false,"merged":[[48,27,48,28],[48,37,48,38],[8,16,12,19],[41,27,41,28],[41,37,41,38],[43,27,43,28],[43,37,43,38],[8,34,12,35],[8,37,12,37],[16,17,16,18],[24,27,24,28],[24,37,24,38],[8,24,12,25],[8,27,12,27],[8,30,12,30],[8,31,12,31],[8,40,12,40],[8,3,12,4],[8,6,12,6],[8,9,12,9],[8,10,12,10],[8,32,12,32],[8,33,12,33],[8,20,12,20],[8,21,12,21],[8,22,12,22],[8,23,12,23],[34,6,34,7],[8,13,12,14],[8,15,12,15],[34,13,35,14],[41,6,41,7],[23,6,23,7],[8,11,12,11],[8,12,12,12],[36,6,36,7]]}
[{"$f":"IF(#REF!=\"\",\"ŠABLONA\",IF(#REF!=\"T\",\"TISK\",\"ELEKTRO\"))","v":{"$error":"#REF!"}},0,{"$f":"CONCATENATE(D1,F1,IF(G1<>\"\",\".\",\"\"),G1,IF(H1<>\"\",\".\",\"\"),H1,IF(I1<>\"\",\".\",\"\"),I1,\"\")","v":{"$error":"#REF!"}},{"$f":"IF(#REF!=\"\",\" ?\",#REF!)","v":{"$error":"#REF!"}},{"$f":"CONCATENATE(C1,M1)","v":{"$error":"#REF!"}},4]
["konst"]
["konst","35x3",null,"Tab. B4:",null,null,null,"Příjmy kapitoly 333-MŠMT – podle položek",null,null,null,null,null,"Tab. B4: Příjmy kapitoly 333-MŠMT - podle položek"]
["konst",{"$f":"COUNTA(Datova_oblast)","v":108},null,{"$f":"IF(D1=\" ?\",\"\",CONCATENATE(\"Tab. \",E1,\":\"))","v":{"$error":"#REF!"}},null,null,null,{"$f":"IF(H3=\"Zadejte název tabulky\",\"\",H3)","v":"Příjmy kapitoly 333-MŠMT – podle položek"}]
[{"$f":"IF(D5=\"\",\"odstr\",\"OK\")","v":"odstr"},0]
[{"$f":"IF(COUNTBLANK(C6:IW6)=254,\"odstr\",\"OK\")","v":"OK"},"Řádky pro"]
[{"$f":"IF(COUNTBLANK(C7:IW7)=254,\"odstr\",\"OK\")","v":"OK"},"ročenku PaM"]
["konst",null,null,"(podle stavu k: 31. 12. 2017)",null,null,null,null,null,null,null,null,"v tis. Kč","(podle stavu k: 31. 12. 2018)",null,null,null,null,null,null,null,null,null,"v tis. Kč"]
["konst",null,null,"Položka",null,null,"Popis položky",null,null,"Schválený\nrozpočet","Rozpočet\npo změnách","Skutečnost","% plnění\nrozpočtu",null,"Položka",null,"Popis položky",null,null,null,"Schválený rozpočet","Rozpočet po změnách","Skutečnost","% plnění rozpočtu"]
["konst"]
["konst"]
["konst"]
["konst"]
[null,null,null,null,1361,null,"Správní poplatky",null,null,200,200,796.08622000000003,3.9804311000000001,null,1,null,"Daňové příjmy",null,null,null,200,200,598.38,2.9918999999999998]
[null,null,null,null,1,null,"Daňové příjmy",null,null,200,200,796.08622000000003,3.9804311000000001,null,1361,null,"Správní poplatky",null,null,null,200,200,598.4,2.9918999999999998]
[{"$f":"IF(COUNTBLANK(C16:IW16)=254,\"odstr\",IF(AND($A$1=\"TISK\",SUM(J16:M16)=0),\"odstr\",\"OK\"))","v":{"$error":"#REF!"}},"OK",null,null,2111,null,"Příjmy z poskytování služeb a výrobků",null,null,66,66,73.099999999999994,1.1075757575757574,null,2,null,"Nedaňové příjmy",null,null,null,89752,89752,119976,1.3368]
[{"$error":"#REF!"},"OK",null,null,2119,null,"Ostatní příjmy z vlastní činnosti",null,null,0,0,4,"x ",null,211,null,"Příjmy z vlastní činnosti",null,null,null,null,null,17.5,"x"]
[{"$error":"#REF!"},"OK",null,null,2123,null,"Ostatní odvody příspěvkových organizací",null,null,0,0,9119.1080000000002,"x ",null,212,null,"Odvody přebytků organizací s přímým vztahem",null,null,null,0,0,5657.06,"x"]
[{"$error":"#REF!"},"OK",null,null,2131,null,"Příjmy z pronájmu pozemků",null,null,15,3.6,3.6,1,null,213,null,"Příjmy z pronájmu majetku",null,null,null,0,0,5582.55,"x"]
[{"$error":"#REF!"},"OK",null,null,2132,null,"Příjmy z pronájmu ostatních nemovitostí a jejich částí",null,null,1279,1261.6210000000001,9827.7079400000002,7.7897466354792755,null,2131,null,"Příjmy z pronájmu pozemků",null,null,null,0,0,3.6,"x"]
[{"$error":"#REF!"},"OK",null,null,2133,null,"Příjmy z pronájmu movitých věcí",null,null,0,0,0.59,"x ",null,2132,null,"Příjmy z pronájmu ostatních nemovitostí a jejich částí",null,null,null,0,0,5565.65,"x"]
[{"$error":"#REF!"},"OK",null,null,2141,null,"Příjmy z úroků (část)",null,null,0,0,1.3728800000000001,"x ",null,2133,null,"Příjmy z pronájmu movitých věcí",null,null,null,0,0,13.3,"x"]
[{"$error":"#REF!"},"OK",null,null,2143,null,"Realizované kursové zisky",null,null,0,0,35.327769999999994,"x ",null,214,null,"Výnosy z finančního majetku",null,null,null,0,0,0.83,"x"]
[null,null,null,null,21,null,"Příjmy z vlastní činnosti a odvody přebytků organizací s přímým vztahem",null,null,1360,1331.221,19064.80659,14.321293451650778,null,221,null,"Přijaté sankční platby",null,null,null,0,0,26.5,"x"]
[{"$f":"IF(COUNTBLANK(C25:IW25)=254,\"odstr\",IF(AND($A$1=\"TISK\",SUM(J24:M24)=0),\"odstr\",\"OK\"))","v":{"$error":"#REF!"}},"OK",null,null,2211,null,"Příjmy z poskytování služeb a výrobků",null,null,0,0,163.97262000000001,"x ",null,222,null,"Přijaté vratky transferů a ostatní platby",null,null,null,0,0,9724.76,"x"]
[{"$f":"IF(COUNTBLANK(C26:IW26)=254,\"odstr\",IF(AND($A$1=\"TISK\",SUM(J25:M25)=0),\"odstr\",\"OK\"))","v":{"$error":"#REF!"}},"OK",null,null,2212,null,"Sankční platby přijaté od jiných subjektů",null,null,0,0,6.23719,"x ",null,23,null,"Příjmy z prodeje nekapitálového majetku a ostatní nedaňové příjmy",null,null,null,0,0,10966.8,"x"]
[{"$f":"IF(COUNTBLANK(C27:IW27)=254,\"odstr\",IF(AND($A$1=\"TISK\",SUM(J26:M26)=0),\"odstr\",\"OK\"))","v":{"$error":"#REF!"}},"OK",null,null,2221,null,"Přijaté vratky transferů od jiných veřejných rozpočtů",null,null,0,0,1387.3312900000001,"x ",null,2322,null,"Přijaté pojistné náhrady",null,null,null,0,0,289.82,"x"]
[{"$f":"IF(COUNTBLANK(C28:IW28)=254,\"odstr\",IF(AND($A$1=\"TISK\",SUM(J27:M27)=0),\"odstr\",\"OK\"))","v":{"$error":"#REF!"}},"OK",null,null,2222,null,"Ostatní příjmy z finančního vypořádání předchozích let od jiných veřejných rozpočtů",null,null,0,0,5359.9221399999997,"x ",null,2324,null,"Přijaté nekapitálové příspěvky a náhrady",null,null,null,0,0,5904.76,"x"]
[null,null,null,null,22,null,"Přijaté sankční platby a vratky transferů",null,null,0,0,6917.46324,"x ",null,2328,null,"Neidentifikované příjmy",null,null,null,0,0,4772.22,"x"]
[null,null,null,null,2322,null,"Přijaté pojistné náhrady",null,null,0,0,90.765000000000001,"x ",null,2452,null,"Splátky půjčených prostředků od vysokých škol",null,null,null,88000,88000,88000,1]
[null,null,null,null,2324,null,"Přijaté nekapitálové příspěvky a náhrady",null,null,390,418.779,2370.39743,5.6602585850770932,null,3,null,"Kapitálové příjmy",null,null,null,0,0,170.63,"x"]
[null,null,null,null,2328,null,"Neidentifikované příjmy",null,null,0,0,0,"x ",null,3111,null,"Příjmy z prodeje pozemků",null,null,null,0,0,18.13,"x"]
[null,null,null,null,2329,null,"Ostatní nedaňové příjmy jinde nezařazené",null,null,2,2,4316.2980700000007,2158.1490350000004,null,3113,null,"Příjmy z prodeje ostatního hmotného dlouhodobého majetku",null,null,null,0,0,152.5,"x"]
[null,null,null,null,2391,null,"Dočasné zatřídění příjmů",null,null,0,0,0,"x ",null,4,null,"Přijaté transfery",null,null,null,7103030.1600000001,13810163.199999999,8128057.8099999996,0.58819999999999995]
[{"$f":"IF(COUNTBLANK(C35:IW35)=254,\"odstr\",IF(AND($A$1=\"TISK\",SUM(J28:M28)=0),\"odstr\",\"OK\"))","v":{"$error":"#REF!"}},"OK",null,null,23,null,"Příjmy z prodeje nekapitálového majetku a ostatní nedaňové příjmy",null,null,392,420.779,6777.460500000001,16.106936182651705,"v tom",null,null,"       příjmy z rozpočtu Evropské unie bez SZP",null,null,null,7086030.1600000001,null,8077242.1699999999,"x"]
[{"$error":"#REF!"},"OK",null,null,2452,null,"Splátky půjčených prostředků od vysokých škol",null,null,88000,88000,88000,1,null,null,null,"       příjmy z prostředků finančních mechanizmů",null,null,null,17000,17000,46390.6,"x"]
[{"$error":"#REF!"},"OK",null,null,24,null,"Přijaté splátky půjčených prostředků",null,null,88000,88000,88000,1,null,4118,null,"NIV převody z Národního fondu",null,null,null,4991791.6399999997,11698045.65,5404445.7400000002,0.46200000000000002]
[{"$error":"#REF!"},"OK",null,null,2,null,"Nedaňové příjmy",null,null,89752,89752,120759.73033000001,1.345482332761387,null,4122,null,"NIV přijaté transfery krajů",null,null,null,0,0,3504.5,"x"]
[{"$error":"#REF!"},"OK",null,null,3111,null,"Příjmy z prodeje pozemků",null,null,0,0,107.333,"x ",null,4135,null,"Převody z rezervních fondů (RF) OSS",null,null,null,0,0,733.34,"x"]
[{"$error":"#REF!"},null,null,null,null,null,null,null,null,null,null,null,null,null,4132,null,"Převod z ostatních vlastních fondů",null,null,null,0,0,187.19,"x"]
[{"$error":"#REF!"},null,null,null,3113,null,"Příjmy z prodeje ostatního hmotného dlouhodobého majetku",null,null,0,0,0,"x ",null,4218,null,"INV převody z NF",null,null,null,2098583.1800000002,2098925.9700000002,2717798.17,1.2948999999999999]
[{"$error":"#REF!"},"OK",null,null,31,null,"Příjmy z prodeje dlouhodobého majetku a ostatní kapitálové příjmy",null,null,0,0,107.333,"x ",null,4153,null,"NIV převody přijaté od EU",null,null,null,12655.33,13191.58,1388.86,0.1053]
[{"$error":"#REF!"},"OK",null,null,3,null,"Kapitálové příjmy",null,null,0,0,107.333,"x ",null,4233,null,"INV převody přijaté od EU",null,null,null,0,0,0,"x"]
[{"$error":"#REF!"},"OK",null,null,4118,null,"Neinvestiční převody z Národního fondu",null,null,8543882.7630000003,4916646.1260000002,1995659.5159799999,0.40589854645560874,null,"Příjmy kapitoly 333-MŠMT celkem",null,null,null,null,null,7192982.1600000001,13900115.199999999,8248802.8099999996,0.59340000000000004]
[{"$error":"#REF!"},"OK",null,null,4122,null,"Neinvestiční přijaté transfery od krajů",null,null,0,0,6884.6094899999998,"x ",null,"Příjmy po konsolidaci (- RF)",null,null,null,null,null,null,null,8248069.4699999997]
[null,null,null,null,4132,null,"Převody z ostatních vlastních fondů",null,null,0,0,498.0421,"x ",null,null,null,null,null,null,null,null,null,null,"Zdroj: Závěrečný účet – kapitola 333-MŠMT"]
[{"$f":"IF(COUNTBLANK(C47:IW47)=254,\"odstr\",IF(AND($A$1=\"TISK\",SUM(J39:M39)=0),\"odstr\",\"OK\"))","v":{"$error":"#REF!"}},"OK",null,null,4135,null,"Převody z fondů organizačních složek státu",null,null,0,0,160,"x "]
[{"$f":"IF(COUNTBLANK(C48:IW48)=254,\"odstr\",IF(AND($A$1=\"TISK\",SUM(J41:M41)=0),\"odstr\",\"OK\"))","v":{"$error":"#REF!"}},"OK",null,null,4153,null,"Neinvestiční transfery přijaté od Evropské unie",null,null,11210.751,14781.436,10197.091480000001,0.68985797320368614]
[{"$error":"#REF!"},"OK",null,null,"4159",null,"Neinvestiční transfery přijaté od Evropské unie",null,null,0,0,0,"x "]
[{"$error":"#REF!"},"OK",null,null,41,null,"Neivestiční přijaté dotace",null,null,8555093.5140000004,4931427.5619999999,2013399.2590499998,0.40827919172221228]
[{"$error":"#REF!"},"OK",null,null,4218,null,"Investiční převody z Národního fondu",null,null,0,3623665.952,1139444.65552,0.31444528017024015]
[{"$error":"#REF!"},"OK",null,null,4233,null,"Investiční transfery přijaté od Evropské unie",null,null,0,0,45.825000000000003,"x "]
[{"$error":"#REF!"},null,null,null,42,null,"Investiční přijaté transfery",null,null,0,3623665.952,1139490.48052,0.31445792620345814]
[{"$error":"#REF!"},null,null,null,4,null,"Přijaté dotace",null,null,8555093.5140000004,8555093.5140000004,3152889.7395699997,0.36853948287186422]
[{"$error":"#REF!"},"OK",null,null,"Příjmy kapitoly 333-MŠMT celkem",null,null,null,null,8645045.5140000004,8645045.5140000004,3274552.8891199999,0.37877798142498015]
["odstr","OK",null,null,null,null,null,null,null,null,null,null,"Zdroj: Závěrečný účet – kapitola 333-MŠMT"]
[null,null,null,""]
[]
[]
[]
[{"$f":"IF(COUNTBLANK(C61:IW61)=254,\"odstr\",IF(AND($A$1=\"TISK\",SUM(J50:M50)=0),\"odstr\",\"OK\"))","v":{"$error":"#REF!"}},"OK"]
[]
[]
[{"$f":"IF(COUNTBLANK(C64:IW64)=254,\"odstr\",IF(AND($A$1=\"TISK\",SUM(J51:M51)=0),\"odstr\",\"OK\"))","v":{"$error":"#REF!"}},"OK"]
[{"$f":"IF(COUNTBLANK(C65:IW65)=254,\"odstr\",IF(AND($A$1=\"TISK\",SUM(J52:M52)=0),\"odstr\",\"OK\"))","v":{"$error":"#REF!"}},"OK"]
["konst","stop"]
[{"$f":"IF(COUNTBLANK(D55:E55)=2,\"odstr\",\"OK\")","v":"OK"}]
["stop"]

{"sheet":"B5","index":5,"n_rows":69,"n_cols":39,"rows_kept":69,"cut":false,"hidden":false,"merged":[[59,23,59,25],[63,23,63,38],[54,24,54,25],[55,24,55,25],[56,24,56,25],[57,24,57,25],[58,24,58,25],[49,24,49,25],[50,24,50,25],[51,24,51,25],[52,24,52,25],[53,24,53,25],[62,23,62,34],[44,24,44,25],[45,24,45,25],[47,24,47,25],[48,24,48,25],[39,24,39,25],[40,24,40,25],[41,24,41,25],[42,24,42,25],[43,24,43,25],[34,24,34,25],[35,24,35,25],[36,24,36,25],[37,24,37,25],[38,24,38,25],[29,24,29,25],[30,24,30,25],[31,24,31,25],[32,24,32,25],[33,24,33,25],[24,24,24,25],[25,24,25,25],[26,24,26,25],[27,24,27,25],[28,24,28,25],[19,24,19,25],[20,24,20,25],[21,24,21,25],[22,24,22,25],[23,24,23,25],[10,38,12,38],[15,24,15,25],[16,24,16,25],[17,24,17,25],[18,24,18,25],[13,24,13,25],[14,24,14,25],[8,22,12,23],[8,24,12,24],[8,27,9,30],[8,31,9,34],[8,35,9,38],[10,27,12,27],[10,28,12,28],[10,29,12,29],[10,30,12,30],[10,31,12,31],[10,32,12,32],[10,33,12,33],[10,34,12,34],[10,35,12,35],[10,36,12,36],[10,37,12,37],[62,4,62,7],[34,6,34,7],[35,6,35,7],[36,6,36,7],[58,6,58,7],[59,6,59,7],[60,6,60,7],[37,6,37,7],[41,6,41,7],[49,6,49,7],[44,6,44,7],[57,6,57,7],[50,6,50,7],[51,6,51,7],[52,6,52,7],[53,6,53,7],[54,6,54,7],[55,6,55,7],[56,6,56,7],[42,6,42,7],[43,6,43,7],[15,6,15,7],[16,6,16,7],[40,6,40,7],[38,6,38,7],[39,6,39,7],[27,6,27,7],[32,6,32,7],[29,6,29,7],[30,6,30,7],[33,6,33,7],[31,6,31,7],[17,6,17,7],[18,6,18,7],[19,6,19,7],[20,6,20,7],[26,6,26,7],[21,6,21,7],[22,6,22,7],[23,6,23,7],[24,6,24,7],[25,6,25,7],[64,4,64,20],[65,4,65,20],[8,3,12,4],[8,6,12,6],[10,16,12,16],[10,9,12,9],[10,10,12,10],[46,6,46,7],[47,6,47,7],[48,6,48,7],[8,17,9,20],[8,9,9,12],[8,13,9,16],[10,20,12,20],[10,12,12,12],[10,13,12,13],[10,11,12,11],[10,15,12,15],[10,14,12,14],[10,19,12,19],[10,17,12,17],[10,18,12,18],[13,6,13,7],[14,6,14,7]]}
[{"$f":"IF(#REF!=\"\",\"ŠABLONA\",IF(#REF!=\"T\",\"TISK\",\"ELEKTRO\"))","v":{"$error":"#REF!"}},0,{"$f":"CONCATENATE(D1,F1,IF(G1<>\"\",\".\",\"\"),G1,IF(H1<>\"\",\".\",\"\"),H1,IF(I1<>\"\",\".\",\"\"),I1,\"\")","v":{"$error":"#REF!"}},{"$f":"IF(#REF!=\"\",\" ?\",#REF!)","v":{"$error":"#REF!"}},{"$f":"CONCATENATE(C1,U1)","v":{"$error":"#REF!"}},5]
["konst"]
["konst","47x11",null,"Tab. B5:",null,null,null,"Příjmy kapitoly 700-Obce a DSO; KÚ (část: vzdělávání) – podle položek",null,null,null,null,null,null,null,null,null,null,null,null,null,null,"Tab. B5:",null,null,"Příjmy kapitoly 700-Obce a DSO; KÚ (část: vzdělávání) – podle položek"]
["konst",{"$f":"COUNTA(Datova_oblast)","v":517},null,{"$f":"IF(D1=\" ?\",\"\",CONCATENATE(\"Tab. \",E1,\":\"))","v":{"$error":"#REF!"}},null,null,null,{"$f":"IF(H3=\"Zadejte název tabulky\",\"\",H3)","v":"Příjmy kapitoly 700-Obce a DSO; KÚ (část: vzdělávání) – podle položek"},null,null,null,null,null,null,null,null,null,null,null,null,null,null,{"$f":"IF(W1=\" ?\",\"\",CONCATENATE(\"Tab. \",X1,\":\"))","v":"Tab. :"},null,null,{"$f":"IF(Z3=\"Zadejte název tabulky\",\"\",Z3)","v":"Příjmy kapitoly 700-Obce a DSO; KÚ (část: vzdělávání) – podle položek"}]
[{"$f":"IF(D5=\"\",\"odstr\",\"OK\")","v":"odstr"},0]
[{"$f":"IF(COUNTBLANK(C6:IV6)=254,\"odstr\",\"OK\")","v":"odstr"},"Řádky pro"]
[{"$f":"IF(COUNTBLANK(C7:IV7)=254,\"odstr\",\"OK\")","v":"odstr"},"ročenku PaM"]
["konst",null,null,"(podle stavu k: 31. 12. 2017)",null,null,null,null,null,null,null,null,null,null,null,null,null,null,null,null,"v tis. Kč",null,"(podle stavu k: 31. 12. 2018)",null,null,null,null,null,null,null,null,null,null,null,null,null,null,null,"v tis. Kč"]
["konst",null,null,"Položka",null,null,"Popis položky",null,null,"Celkem 1)",null,null,null,"Obce a DSO1)",null,null,null,"Krajské úřady1)",null,null,null,null,"Položka",null,"Popis položky",null,null,"Celkem 1)",null,null,null,"Obce a DSO1)",null,null,null,"Krajské úřady1)"]
["konst"]
["konst",null,null,null,null,null,null,null,null,"schválený\nrozpočet","rozpočet po\nzměnách","skutečnost","% plnění\nrozpočtu","schválený\nrozpočet","rozpočet po\nzměnách","skutečnost","% plnění\nrozpočtu","schválený\nrozpočet","rozpočet po\nzměnách","skutečnost","% plnění\nrozpočtu",null,null,null,null,null,null,"schválený\nrozpočet","rozpočet po\nzměnách","skutečnost","% plnění\nrozpočtu","schválený\nrozpočet","rozpočet po\nzměnách","skutečnost","% plnění\nrozpočtu","schválený\nrozpočet","rozpočet po\nzměnách","skutečnost","% plnění\nrozpočtu"]
["konst"]
["konst"]
[null,null,null,null,2111,null,"Příjmy z poskytování služeb a výrobků",null,null,31472.244999999999,35823.962650000009,34397.465230000009,0.96018035654132194,31472.244999999999,34668.062650000007,33329.465230000009,0.96138816773483593,0,1155.9000000000001,1068,0.92395535946016083,null,null,2,"Nedaňové příjmy",null,null,{"$f":"AB15+AB31+AB39","v":976181.95479999995},{"$f":"AC15+AC31+AC39","v":1382838.4595900001},1418875.2,{"$f":"AD14/AC14","v":1.026059978416195},{"$f":"AF15+AF31+AF39","v":575801.7548},{"$f":"AG15+AG31+AG39","v":904291.8684700001},934572,{"$f":"AH14/AG14","v":1.033484909668857},{"$f":"AJ15+AJ31+AJ39","v":400380.2},{"$f":"AK15+AK31+AK39","v":478546.59111999994},484303.2,{"$f":"AL14/AK14","v":1.0120293592866834}]
[null,null,null,null,2112,null,"Příjmy z prodeje zboží (jinak nakoupeného za účelem prodeje)",null,null,316.78100000000001,320.161,335.84899999999999,1.0490003467005662,316.78100000000001,320.161,335.84899999999999,1.0490003467005662,0,0,0,"x ",null,null,21,"Příjmy z vlastní činnosti a odvody přebytků organizací s přímým vztahem",null,null,{"$f":"SUM(AB16:AB30)","v":863037.15079999994},{"$f":"SUM(AC16:AC30)","v":1115496.7885900002},1103551.3,{"$f":"AD15/AC15","v":0.98929132857020641},{"$f":"SUM(AF16:AF30)","v":463496.95079999993},{"$f":"SUM(AG16:AG30)","v":654437.84697000007},635268.30000000005,{"$f":"AH15/AG15","v":0.97070837657272779},{"$f":"SUM(AJ16:AJ30)","v":399540.2},{"$f":"SUM(AK16:AK30)","v":461058.94161999994},{"$f":"SUM(AL16:AL30)","v":468282.97667999991},{"$f":"AL15/AK15","v":1.0156683547544207}]
[{"$f":"IF(COUNTBLANK(C16:IV16)=254,\"odstr\",IF(AND($A$1=\"TISK\",SUM(J14:U14)=0),\"odstr\",\"OK\"))","v":{"$error":"#REF!"}},"OK",null,null,2113,null,"Příjmy ze školného",null,null,0,14.5,14.565,1.0044827586206897,0,14.5,14.565,1.0044827586206897,0,0,0,"x ",null,null,2111,"Příjmy z poskytování služeb a výrobků",null,null,42236.71,{"$f":"AG16+AK16","v":53031.910190000002},{"$f":"AH16+AL16","v":48167.852180000002},{"$f":"AD16/AC16","v":0.90828054293022253},42236.71,52239.010190000001,47314.45218,{"$f":"AH16/AG16","v":0.9057302580564075},0,792.9,853.4,{"$f":"AL16/AK16","v":1.0763021818640435}]
[{"$error":"#REF!"},"OK",null,null,2119,null,"Ostatní příjmy z vlastní činnosti",null,null,705.6,2203.8559999999998,2265.5401200000001,1.0279891789663209,705.6,2094.29,2072.75758,0.98971851080795881,0,109.566,192.78254000000001,1.7595106146067212,null,null,2112,"Příjmy z prodeje zboží (jinak nakoupeného za účelem prodeje)",null,null,319.65499999999997,{"$f":"AG17+AK17","v":397.81299999999999},{"$f":"AH17+AL17","v":378.63299000000001},{"$f":"AD17/AC17","v":0.95178636696136132},319.65499999999997,397.81299999999999,378.63299000000001,{"$f":"AH17/AG17","v":0.95178636696136132},0,0,0,"x"]
[{"$error":"#REF!"},"OK",null,null,2122,null,"Odvody příspěvkových organizací",null,null,687422.80403,903579.66990999994,885012.06365999999,0.97945105797715726,305182.80403,474885.21791000001,456173.87004999997,0.96059816740064075,382240,428694.45199999999,428838.19361000002,1.0003353008403291,null,null,2113,"Příjmy ze školného",null,null,36,36,0,"x",36,36,0,"x",0,0,0,"x"]
[{"$error":"#REF!"},"OK",null,null,2123,null,"Ostatní odvody příspěvkových organizací",null,null,2456,3626.3378400000001,10194.34297,2.8111950457434487,2456,2381.2925399999999,2403.4095400000001,1.0092878130798664,0,1245.0453,7790.93343,6.2575501710660646,null,null,2119,"Ostatní příjmy z vlastní činnosti",null,null,1170.6099999999999,4172.5431999999992,4111.7657300000001,{"$f":"AD19/AC19","v":0.98543395068983375},1170.6099999999999,4157.2191999999995,4065.8892300000002,0.97803099485348299,0,15.324,45.8765,{"$f":"AL19/AK19","v":2.993767945706082}]
[{"$error":"#REF!"},"OK",null,null,2124,null,"Odvody školských právnických osob zřízených státem, kraji a obcemi",null,null,2822.0590000000002,3053.0315000000001,3090.7345,1.0123493648853608,2822.0590000000002,3053.0315000000001,3052.9814999999999,0.99998362283520492,0,0,37.753,"x ",null,null,2122,"Odvody příspěvkových organizací",null,null,722232.60560000001,955263.64373999997,940285.65732,0.9843205731546959,339692.4056,512283.70465999999,497240.71765000001,0.97063543721347934,382540.2,442979.93907999998,443044.93966999999,{"$f":"AL20/AK20","v":1.0001467348389073}]
[{"$error":"#REF!"},"OK",null,null,2129,null,"Ostatní odvody přebytků organizací s přímým vztahem",null,null,0,1076.0360000000001,1076.0371499999999,1.000001068737477,0,0,0,"x ",0,1076.0360000000001,1076.0371499999999,1.000001068737477,null,null,2123,"Ostatní odvody příspěvkových organizací",null,null,2305,3827.1323900000002,5368.8018200000006,1.4028262607346071,2305,3705.2323900000001,3648.3583600000002,0.98465034739696855,0,121.9,1720.44346,{"$f":"AL21/AK21","v":14.113564068908941}]
[{"$error":"#REF!"},"OK",null,null,2131,null,"Příjmy z pronájmu pozemků",null,null,602.1,602.1,607.16300000000001,1.0084089021757183,602.1,602.1,607.16300000000001,1.0084089021757183,0,0,0,"x ",null,null,2124,"Odvody školských právnických osob zřízených státem, kraji a obcemi",null,null,2861.49,2954.7750000000001,2954.8094000000001,1.0000116421724159,2861.49,2954.7750000000001,2954.8094000000001,1.0000116421724159,0,0,0,"x"]
[{"$error":"#REF!"},"OK",null,null,2132,null,"Příjmy z pronájmu ostatních nemovitostí a jejich částí",null,null,83254.966,87581.11228999999,87302.194130000018,0.99681531608006513,66614.966,71200.678289999996,71118.311220000018,0.99884317014980539,16640,16380.433999999999,16183.88291,0.98800086188192582,null,null,2129,"Ostatní odvody přebytků organizací s přímým vztahem",null,null,0,219.13151000000002,7151.4,32.635197010233711,0,60.004510000000003,205.51799,3.425042384314112,0,159.12700000000001,6945.8770000000004,{"$f":"AL23/AK23","v":43.649895995022845}]
[{"$error":"#REF!"},"OK",null,null,2133,null,"Příjmy z pronájmu movitých věcí",null,null,1750.021,1770.1210000000001,1456.7352500000002,0.82295800682552211,1750.021,1770.1210000000001,1456.7352500000002,0.82295800682552211,0,0,0,"x ",null,null,2131,"Příjmy z pronájmu pozemků",null,null,665.99519999999995,664.49519999999995,626.11199999999997,0.94223705453402828,665.99519999999995,664.49519999999995,624.19200000000001,0.93934764314324626,0,0,1.92,"x"]
[{"$error":"#REF!"},"OK",null,null,2139,null,"Ostatní příjmy z pronájmu majetku",null,null,134.5,134,66.55,0.49664179104477607,134.5,134,66.55,0.49664179104477607,0,0,0,"x ",null,null,2132,"Příjmy z pronájmu ostatních nemovitostí a jejich částí",null,null,90840.785000000003,94304.66724000001,93381.577669999999,0.99021162369778792,73840.785000000003,77319.991240000003,77716.133189999993,1.0051234091422796,17000,16984.675999999999,15665.44448,{"$f":"AL25/AK25","v":0.92232813154634219}]
[{"$error":"#REF!"},"OK",null,null,2141,null,"Příjmy z úroků (část)",null,null,0.02,0.72,1.1250199999999999,1.5625277777777777,0.02,0.72,0.80220999999999987,1.1141805555555555,0,0,0.32280999999999999,"x ",null,null,2133,"Příjmy z pronájmu movitých věcí",null,null,215.2,440.226,959.18867999999998,2.1788551334996114,215.2,440.226,959.18867999999998,2.1788551334996114,0,0,0,"x"]
[{"$error":"#REF!"},"OK",null,null,2143,null,"Realizované kursové zisky",null,null,0,0,0,"x ",0,0,0,"x ",0,0,0,"x ",null,null,2139,"Ostatní příjmy z pronájmu majetku",null,null,153,179.34,131.08456000000001,0.73092762350841978,153,179.34,131.08456000000001,0.73092762350841978,null,0,0,"x"]
[{"$error":"#REF!"},null,null,null,2149,null,"Ostatní příjmy z výnosů finančního majetku",null,null,0,0,0,"x ",0,0,0,"x ",0,0,0,"x ",null,null,2141,"Příjmy z úroků (část)",null,null,0.1,3.5580000000000001E-2,29.30011,"x",0.1,3.5580000000000001E-2,29.300080000000001,"x",0,0,3.0000000000000001E-5,"x"]
[null,null,null,null,null,null,null,null,null,null,null,null,null,null,null,null,null,null,null,null,null,null,null,2143,"Realizované kursové zisky",null,null,0,5.0755400000000002,5.0757300000000001,{"$f":"AD29/AC29","v":1.0000374344404732},0,0,1.9000000000000001E-4,"x",0,5.0755400000000002,5.0755400000000002,{"$f":"AL29/AK29","v":1}]
[{"$f":"IF(COUNTBLANK(C30:IV30)=254,\"odstr\",IF(AND($A$1=\"TISK\",SUM(J28:U28)=0),\"odstr\",\"OK\"))","v":{"$error":"#REF!"}},"OK",null,null,21,null,"Příjmy z vlastní činnosti a odvody přebytků organizací s přímým vztahem",null,null,810937.09603000002,1039785.6081899999,1025820.36503,0.9865691128536489,412057.09603000002,591124.17488999991,570632.45958000002,0.96533433044958261,398880,448661.43330000003,455187.90544999996,1.0145465414800563,null,null,2149,"Ostatní příjmy z výnosů finančního majetku",null,null,0,0,0,"x",0,0,0,"x",null,0,0,"x"]
[null,null,null,null,2210,null,"Přijaté sankční platby",null,null,0,0,0,"x ",0,0,0,"x ",0,0,0,"x ",null,null,22,"Přijaté sankční platby a vratky transferů",null,null,{"$f":"SUM(AB32:AB38)","v":14981.433000000001},{"$f":"AG31+AK31","v":139759.32713999998},{"$f":"AH31+AL31","v":194089.82675000001},{"$f":"AD31/AC31","v":1.3887432826259674},{"$f":"SUM(AF32:AF38)","v":14141.433000000001},{"$f":"SUM(AG32:AG38)","v":126086.00391999999},{"$f":"AH34+AH35+AH36+AH37+AH38","v":182878.5877},1.4504273433555259,{"$f":"SUM(AJ32:AJ38)","v":840},{"$f":"SUM(AK32:AK38)","v":13673.32322},{"$f":"SUM(AL32:AL38)","v":11211.23905},{"$f":"AL31/AK31","v":0.81993520299449196}]
[{"$f":"IF(COUNTBLANK(C32:IV32)=254,\"odstr\",IF(AND($A$1=\"TISK\",SUM(J30:U30)=0),\"odstr\",\"OK\"))","v":{"$error":"#REF!"}},"OK",null,null,2211,null,"Příjmy z poskytování služeb a výrobků",null,null,0,458.96625,1900.5192500000001,4.1408692904979398,0,0,0,"x ",0,458.96625,1900.5192500000001,4.1408692904979398,null,null,2210,"Přijaté sankční platby",null,null,0,{"$f":"AG32+AK32","v":0},{"$f":"AH32+AL32","v":0},"x",0,0,0,"x",0,0,0,"x"]
[{"$error":"#REF!"},"OK",null,null,2212,null,"Sankční platby přijaté od jiných subjektů",null,null,1349.1,16512.092430000004,19368.23432,1.1729727411657902,509.1,5837.7890800000005,11042.23272,1.891509365734056,840,10674.303350000002,8326.0015999999996,0.78000421451391466,null,null,2211,"Příjmy z poskytování služeb a výrobků",null,null,0,{"$f":"AG33+AK33","v":0},{"$f":"AH33+AL33","v":0},"x",0,0,0,"x",0,0,0,"x"]
[{"$error":"#REF!"},null,null,null,2221,null,"Přijaté vratky transferů od jiných veřejných rozpočtů",null,null,0,219.25239000000002,217.79730000000001,0.99336340187671379,0,219.25239000000002,217.79730000000001,0.99336340187671379,0,0,0,"x ",null,null,2212,"Sankční platby přijaté od jiných subjektů",null,null,1004.333,16577.942569999999,21539.44658,{"$f":"AD34/AC34","v":1.2992834598774943},164.333,10000.726629999999,18933.936740000001,1.8932561043316911,840,6577.21594,2605.5098400000002,{"$f":"AL34/AK34","v":0.39614175112517291}]
[{"$error":"#REF!"},null,null,null,2222,null,"Ostatní příjmy z finančního vypořádání předchozích let od jiných veřejných rozpočtů",null,null,0,88.1,88.045429999999996,0.99938059023836556,0,88.1,88.045429999999996,0.99938059023836556,0,0,0,"x ",null,null,2221,"Přijaté vratky transferů od jiných veřejných rozpočtů",null,null,0,0,365.25603999999998,"x",0,0,365.25603999999998,0,0,0,0,"x"]
[{"$error":"#REF!"},"OK",null,null,2226,null,"Příjmy z finančního vypořádání minulých let mezi obcemi",null,null,43,281.82400000000001,298.03282000000002,1.0575139803565345,43,281.82400000000001,298.03282000000002,1.0575139803565345,0,0,0,"x ",null,null,2222,"Ostatní příjmy z finančního vypořádání předchozích let od jiných veřejných rozpočtů",null,null,0,0,0.96,"x",0,0,0.96,"x",0,0,0,"x"]
[{"$error":"#REF!"},"OK",null,null,2229,null,"Ostatní přijaté vratky transferů",null,null,10561.7269,64597.497010000014,74410.651670000007,1.1519123048758511,10561.7269,61774.056180000014,71344.301879999999,1.1549233819471685,0,2823.4408300000005,3066.3497900000007,1.0860329557534947,null,null,2226,"Příjmy z finančního vypořádání minulých let mezi obcemi",null,null,0,33.24,55.470999999999997,{"$f":"AD37/AC37","v":1.6688026474127555},0,33.24,55.470999999999997,1.6688026474127555,0,0,0,"x"]
[{"$error":"#REF!"},"OK",null,null,22,null,"Přijaté sankční platby a vratky transferů",null,null,11953.8269,82157.732080000016,96283.28078999999,1.1719320671637503,11113.8269,68201.02165000001,82990.410149999996,1.2168499553554706,840,13956.710430000003,13292.870639999999,0.95243579829720637,null,null,2229,"Ostatní přijaté vratky transferů",null,null,13977.1,123148.14456999999,172128.69313,1.397736796855745,13977.1,116052.03728999999,163522.96392000001,1.4090486279993166,0,7096.1072800000002,8605.7292099999995,{"$f":"AL38/AK38","v":1.2127394457880856}]
[{"$error":"#REF!"},"OK",null,null,2310,null,"Příjmy z prodeje krátkodobého a drobného dlouhodobého majetku",null,null,5,478.00063,495.80763000000002,1.0372530889760543,5,65.926000000000002,83.733000000000004,1.2701058762855324,0,412.07463000000001,412.07463000000001,1,null,null,23,"Příjmy z prodeje nekapitálového majetku a ostatní nedaňové příjmy",null,null,{"$f":"SUM(AB40:AB46)","v":98163.370999999999},{"$f":"AG39+AK39","v":127582.34385999999},{"$f":"AH39+AL39","v":121234.13492},0.95024226121001443,{"$f":"SUM(AF40:AF46)","v":98163.370999999999},{"$f":"SUM(AG40:AG46)","v":123768.01758},{"$f":"AH40+AH41+AH42+AH43+AH44+AH45","v":116425.10936},0.94067200587378108,{"$f":"SUM(AJ40:AJ46)","v":0},{"$f":"SUM(AK40:AK46)","v":3814.3262800000002},{"$f":"SUM(AL40:AL46)","v":4809.02556},{"$f":"AL39/AK39","v":1.2607798093245446}]
[{"$error":"#REF!"},"OK",null,null,2321,null,"Přijaté neinvestiční dary",null,null,1902.1,18225.438999999998,18269.126800000002,1.0023970780621527,1902.1,18125.438999999998,18169.126800000002,1.0024103030001097,0,100,100,1,null,null,2310,"Příjmy z prodeje krátkodobého a drobného dlouhodobého majetku",null,null,11,{"$f":"AD40+AK40","v":866.32608000000005},{"$f":"AH40+AL40","v":518.88553999999999},0.5989494625395555,11,159.03,171.44499999999999,1.0780670313777274,0,347.44054,347.44054,{"$f":"AL40/AK40","v":1}]
[{"$error":"#REF!"},"OK",null,null,2322,null,"Přijaté pojistné náhrady",null,null,181.23400000000001,12407.419749999999,12341.138000000001,0.99465789412016969,181.23400000000001,12407.419749999999,12341.138000000001,0.99465789412016969,0,0,0,"x ",null,null,2321,"Přijaté neinvestiční dary",null,null,4075.9,{"$f":"AD41+AK41","v":19684.634730000002},{"$f":"AH41+AL41","v":19334.634730000002},0.98221963451185668,4075.9,19828.438920000001,18984.634730000002,0.95744474926117895,0,350,350,{"$f":"AL41/AK41","v":1}]
[{"$error":"#REF!"},"OK",null,null,2324,null,"Přijaté nekapitálové příspěvky a náhrady",null,null,65155.936000000002,89192.824870000011,80783.549679999996,0.90571803054498312,65155.936000000002,88455.067580000017,79755.631389999995,0.90165135330282653,0,737.75729000000001,1027.9182900000001,1.3933014338631613,null,null,2322,"Přijaté pojistné náhrady",null,null,868.005,20427.89935,20427.89935,1,868.005,19188.501950000002,20427.89935,1.0645906284518474,null,0,0,"x"]
[{"$error":"#REF!"},"OK",null,null,2328,null,"Neidentifikované příjmy",null,null,0,2,2,1,0,2,2,1,0,0,0,"x ",null,null,2324,"Přijaté nekapitálové příspěvky a náhrady",null,null,72978.122000000003,69240.510809999992,68102.038809999998,0.98355771806588732,72978.122000000003,76003.989090000003,65975.434880000001,0.86805226501829125,0,1138.472,2126.6039300000002,{"$f":"AL43/AK43","v":1.8679457465796263}]
[{"$error":"#REF!"},"OK",null,null,2329,null,"Ostatní nedaňové příjmy jinde nezařazené",null,null,4542.7439999999997,14616.954619999999,11545.44253,0.7898664824615842,4542.7439999999997,14359.704619999999,11100.054830000001,0.77300021997249146,0,257.25,445.38769999999994,1.7313418853255587,null,null,2328,"Neidentifikované příjmy",null,null,14900,20.235250000000001,20.235250000000001,1,14900,20.2,20.235250000000001,1.0017450495049505,null,0,0,"x"]
[{"$error":"#REF!"},"OK",null,null,2343,null,"Příjmy z úhrad dobývacího prostoru a z vydobytých nerostů",null,null,290,0,0,"x ",290,0,0,"x ",0,0,0,"x ",null,null,2329,"Ostatní nedaňové příjmy jinde nezařazené",null,null,5330.3440000000001,14808.85498,12830.44124,0.86640332809849696,5330.3440000000001,8567.8576200000007,10845.460150000001,1.2658310433034483,0,1978.41374,1984.98109,{"$f":"AL45/AK45","v":1.0033195028255313}]
[{"$error":"#REF!"},"OK",null,null,null,null,null,null,null,null,null,null,null,null,null,null,null,null,null,null,null,null,null,2343,"Příjmy z úhrad dobývacího prostoru a z vydobytých nerostů",null,null,0,0,0,"x",0,0,0,"x",null,0,0,"x"]
[{"$error":"#REF!"},null,null,null,23,null,"Příjmy z prodeje nekapitálového majetku a ostatní nedaňové příjmy",null,null,72077.01400000001,134922.63887000002,123437.06464000001,0.9148728906713236,72077.01400000001,133415.55695000003,121451.68402000002,0.91032625277362744,0,1507.0819200000001,1985.3806200000001,1.3173674195494296,null,null,3,"Kapitálové příjmy",null,null,{"$f":"AB48+AB57","v":47398.994000000006},{"$f":"AC48+AC57","v":64025.945819999994},{"$f":"AH47+AL47","v":38993.250819999994},{"$f":"AD47/AC47","v":0.6090226441890304},{"$f":"AF48+AF57","v":47398.994000000006},{"$f":"AG48+AG57","v":51963.828999999998},{"$f":"AH48+AH57","v":34487.553999999996},0.66368384823989779,{"$f":"AJ48+AJ57","v":0},{"$f":"AK48+AK57","v":12062.116819999999},{"$f":"AL48","v":4505.6968200000001},{"$f":"AL47/AK47","v":0.37354113604082972}]
[null,null,null,null,2,null,"Nedaňové příjmy",null,null,894967.93693000008,1256865.97914,1245540.71046,0.99098927899397105,495247.93693000003,792740.75348999992,775074.55374999996,0.97771503525935122,399720,464125.22565000004,470466.15670999995,1.0136621125281857,null,null,31,"Příjmy z prodej dlouhodobého majetku a ostatní kapitálové příjmy",null,null,{"$f":"SUM(AB49:AB56)","v":47398.994000000006},{"$f":"AG48+AK48","v":64025.945819999994},{"$f":"AH48+AL48","v":38993.250819999994},{"$f":"AD48/AC48","v":0.6090226441890304},{"$f":"SUM(AF49:AF56)","v":47398.994000000006},{"$f":"SUM(AG49:AG56)","v":51963.828999999998},{"$f":"AH50+AH51+AH54+AH55+AH56","v":34487.553999999996},0.66368384823989779,{"$f":"SUM(AJ49:AJ56)","v":0},{"$f":"SUM(AK49:AK56)","v":12062.116819999999},{"$f":"SUM(AL49:AL56)","v":4505.6968200000001},{"$f":"AL48/AK48","v":0.37354113604082972}]
[{"$f":"IF(COUNTBLANK(C49:IV49)=254,\"odstr\",IF(AND($A$1=\"TISK\",SUM(J47:U47)=0),\"odstr\",\"OK\"))","v":{"$error":"#REF!"}},"OK",null,null,3111,null,"Příjmy z prodeje pozemků",null,null,0,130,323.363,2.4874076923076922,0,0,8.1199999999999992,"x ",0,130,315.24299999999999,2.4249461538461539,null,null,3111,"Příjmy z prodeje pozemků",null,null,0,{"$f":"AG49+AK49","v":1426},{"$f":"AH49+AL49","v":513.58000000000004},{"$f":"AD49/AC49","v":0.3601542776998598},null,0,0,"x",0,1426,513.58000000000004,{"$f":"AL49/AK49","v":0.3601542776998598}]
[{"$error":"#REF!"},"OK",null,null,3112,null,"Příjmy z prodeje ostatních nemovitostí a jejich částí",null,null,0,300,300,1,0,0,0,"x ",0,300,300,1,null,null,3112,"Příjmy z prodeje ostatních nemovitostí a jejich částí",null,null,20,{"$f":"AG50+AK50","v":9470.58},{"$f":"AH50+AL50","v":2815.578},{"$f":"AD50/AC50","v":0.29729731442002494},20,105.78,105.77800000000001,0.99998109283418424,0,9364.7999999999993,2709.8,{"$f":"AL50/AK50","v":0.28936015718434993}]
[{"$error":"#REF!"},"OK",null,null,3113,null,"Příjmy z prodeje ostatního hmotného dlouhodobého majetku",null,null,0,893.90409999999997,2220.7231000000002,2.4842968054403154,0,47.9,1156.32,24.140292275574112,0,846.00409999999999,1064.4031,1.2581535952367133,null,null,3113,"Příjmy z prodeje ostatního hmotného dlouhodobého majetku",null,null,0,1538.6408200000001,1579.97282,{"$f":"AD51/AC51","v":1.026862669612522},0,267.32400000000001,297.65600000000001,1.1134653080157411,0,1271.31682,1282.31682,{"$f":"AL51/AK51","v":1.0086524458946433}]
[{"$error":"#REF!"},"OK",null,null,3114,null,"Příjmy z prodeje nehmotného dlouhodobého majetku",null,null,0,0,0,"x ",0,0,0,"x ",0,0,0,"x ",null,null,3114,"Příjmy z prodeje nehmotného dlouhodobého majetku",null,null,0,0,0,"x",null,0,0,"x",0,0,0,"x"]
[{"$error":"#REF!"},"OK",null,null,3119,null,"Ostatní příjmy z prodeje dlouhodobého majetku",null,null,0,0,0,"x ",0,0,0,"x ",0,0,0,"x ",null,null,3119,"Ostatní příjmy z prodeje dlouhodobého majetku",null,null,0,0,0,"x",null,0,0,"x",0,0,0,"x"]
[{"$error":"#REF!"},"OK",null,null,3121,null,"Přijaté dary na pořízení dlouhodobého majetku",null,null,500,5660,5807.5919999999996,1.0260763250883391,500,5660,5807.5919999999996,1.0260763250883391,0,0,0,"x ",null,null,3121,"Přijaté dary na pořízení dlouhodobého majetku",null,null,2375.1,30591.416000000001,32624.346000000001,{"$f":"AD54/AC54","v":1.0664542628559592},2375.1,30591.416000000001,32624.346000000001,1.0664542628559592,0,0,0,"x"]
[{"$error":"#REF!"},"OK",null,null,3122,null,"Přijaté příspěvky na pořízení dlouhodobého majetku",null,null,1006,1740.1445000000001,1538.5005000000001,0.88412226685772355,1006,1740.1445000000001,1538.5005000000001,0.88412226685772355,0,0,0,"x ",null,null,3122,"Přijaté příspěvky na pořízení dlouhodobého majetku",null,null,12219.494000000001,883.30899999999997,658.30899999999997,{"$f":"AD55/AC55","v":0.74527600194269505},12219.494000000001,883.30899999999997,658.30899999999997,0.74527600194269505,0,0,0,"x"]
[{"$error":"#REF!"},"OK",null,null,3129,null,"Ostatní investiční příjmy jinde nezařazené",null,null,2900,0,0.55000000000000004,"x ",2900,0,0,"x ",0,0,0.55000000000000004,"x ",null,null,3129,"Ostatní investiční příjmy jinde nezařazené",null,null,32784.400000000001,20116,801.46500000000003,{"$f":"AD56/AC56","v":3.9842165440445415E-2},32784.400000000001,20116,801.46500000000003,3.9842165440445415E-2,0,0,0,"x"]
[{"$error":"#REF!"},"OK",null,null,31,null,"Příjmy z prodeje dlouhodobého majetku a ostatní kapitálové příjmy",null,null,4406,8724.0486000000001,10190.728599999999,1.168119191816515,4406,7448.0445,8510.5324999999993,1.1426532830194556,0,1276.0041000000001,1680.1960999999999,1.3167638724671809,null,null,32,"Příjmy z prodeje dlouhodobého finančního majetku",null,null,{"$f":"SUM(AB58:AB59)","v":0},{"$f":"AG57+AK57","v":0},0,"x",{"$f":"SUM(AF58:AF59)","v":0},0,0,"x",{"$f":"SUM(AJ58:AJ59)","v":0},0,0,"x"]
[{"$error":"#REF!"},"OK",null,null,3201,null,"Příjmy z prodeje akcií",null,null,0,0,0,"x ",0,0,0,"x ",0,0,0,"x ",null,null,3201,"Příjmy z prodeje akcií",null,null,0,{"$f":"AG58+AK58","v":0},0,"x",0,0,0,"x",0,0,0,"x"]
[{"$error":"#REF!"},"OK",null,null,3202,null,"Příjmy z prodeje majetkových podílů",null,null,0,0,0,"x ",0,0,0,"x ",0,0,0,"x ",null,null,3202,"Příjmy z prodeje majetkových podílů",null,null,0,{"$f":"AG59+AK59","v":0},0,"x",0,0,0,"x",0,0,0,"x"]
[{"$error":"#REF!"},"OK",null,null,32,null,"Příjmy z prodeje dlouhodobého finančního majetku",null,null,0,0,0,"x ",0,0,0,"x ",0,0,0,"x ",null,null,"Příjmy kap. 700-Obce a DSO; KÚ\n(část vzdělávání)",null,null,null,{"$f":"AB47+AB14","v":1023580.9487999999},{"$f":"AC47+AC14","v":1446864.4054100001},{"$f":"AD47+AD14","v":1457868.4508199999},{"$f":"AD60/AC60","v":1.007605443446431},{"$f":"AF47+AF14","v":623200.74879999994},{"$f":"AG14+AG47","v":956255.69747000013},{"$f":"AH47+AH14","v":969059.554},1.0133895741106438,{"$f":"AJ47+AJ14","v":400380.2},{"$f":"AK14+AK47","v":490608.70793999993},{"$f":"AL47+AL14","v":488808.89682000002},{"$f":"AL60/AK60","v":0.99633147334959249}]
[{"$f":"IF(COUNTBLANK(C61:IV61)=254,\"odstr\",IF(AND($A$1=\"TISK\",SUM(J59:U59)=0),\"odstr\",\"OK\"))","v":{"$error":"#REF!"}},"OK",null,null,3,null,"Kapitálové příjmy",null,null,4406,8724.0486000000001,10190.728599999999,1.168119191816515,4406,7448.0445,8510.5324999999993,1.1426532830194556,0,1276.0041000000001,1680.1960999999999,1.3167638724671809,null,null,null,null,null,null,null,null,null,null,null,null,null,null,null,null,null,"Zdroj: Závěrečný účet – kapitola 700-Obce a DSO; KÚ (část: vzdělávání); monitor.statnipokladna.cz"]
[null,null,null,null,null,null,null,null,null,null,null,null,null,null,null,null,null,null,null,null,null,null,null,"Komentář:"]
[{"$f":"IF(COUNTBLANK(C63:IV63)=254,\"odstr\",IF(AND($A$1=\"TISK\",SUM(J60:U60)=0),\"odstr\",\"OK\"))","v":{"$error":"#REF!"}},"OK",null,null,"Příjmy kap. 700-Obce a DSO; KÚ\n(část vzdělávání)",null,null,null,null,899373.93693000008,1265590.0277399998,1255731.4390599998,0.99221028258447574,499653.93693000003,800188.79798999988,783585.08624999993,0.9792502572121643,399720,465401.22975000006,472146.35280999995,1.0144931354470705,null,"1)","Tabulka neobsahuje z daných tříd následující položky: 2223, 2441, 2442, 2449, 4121, 4122, 4129, 4133, 4134, 4139, 4221, 4222, 4229."]
[{"$f":"IF(COUNTBLANK(C64:IV64)=254,\"odstr\",IF(AND($A$1=\"TISK\",SUM(J61:U61)=0),\"odstr\",\"OK\"))","v":{"$error":"#REF!"}},"OK",null,null,null,null,null,null,null,null,null,null,null,null,null,null,null,null,null,null,"Zdroj: Závěrečný účet – kapitola 700-Obce a DSO; KÚ (část: vzdělávání)"]
[{"$error":"#REF!"},"OK",null,null,"Tabulka neobsahuje z daných tříd následující položky: 2223, 2441, 2442, 2449, 4121, 4122, 4129, 4133, 4134, 4139, 4221, 4222, 4229."]
["konst","stop",null,"Komentáře:"]
[{"$f":"IF(COUNTBLANK(D67:E67)=2,\"odstr\",\"OK\")","v":"OK"},null,null,"1)"]
[{"$f":"IF(COUNTBLANK(D68:E68)=2,\"odstr\",\"OK\")","v":"odstr"}]
["stop"]

{"sheet":"B6","index":6,"n_rows":229,"n_cols":26,"rows_kept":229,"cut":false,"hidden":false,"merged":[[69,6,69,7],[8,11,12,11],[8,12,12,12],[8,13,12,13],[8,3,12,4],[8,6,12,6],[8,9,12,9],[8,10,12,10],[17,6,17,7],[57,6,57,7],[98,17,98,20],[22,18,22,19],[8,24,12,24],[8,25,12,25],[8,15,12,16],[8,18,12,18],[8,21,12,21],[8,22,12,22],[8,23,12,23]]}
[{"$f":"IF(#REF!=\"\",\"ŠABLONA\",IF(#REF!=\"T\",\"TISK\",\"ELEKTRO\"))","v":{"$error":"#REF!"}},0,{"$f":"CONCATENATE(D1,F1,IF(G1<>\"\",\".\",\"\"),G1,IF(H1<>\"\",\".\",\"\"),H1,IF(I1<>\"\",\".\",\"\"),I1,\"\")","v":{"$error":"#REF!"}},{"$f":"IF(#REF!=\"\",\" ?\",#REF!)","v":{"$error":"#REF!"}},{"$f":"CONCATENATE(C1,N1)","v":{"$error":"#REF!"}},6]
["konst"]
["konst","102x4",null,"Tab. B6:",null,null,null,"Výdaje kapitoly 333-MŠMT – podle položek",null,null,null,null,null,null,null,"Tab. B6:",null,null,"Výdaje kapitoly 333-MŠMT - podle položek"]
["konst",{"$f":"COUNTA(Datova_oblast)","v":420},null,{"$f":"IF(D1=\" ?\",\"\",CONCATENATE(\"Tab. \",E1,\":\"))","v":{"$error":"#REF!"}},null,null,null,{"$f":"IF(H3=\"Zadejte název tabulky\",\"\",H3)","v":"Výdaje kapitoly 333-MŠMT – podle položek"},null,null,null,null,null,null,null,{"$f":"IF(P1=\" ?\",\"\",CONCATENATE(\"Tab. \",Q1,\":\"))","v":"Tab. :"}]
[{"$f":"IF(D5=\"\",\"odstr\",\"OK\")","v":"odstr"},0]
[{"$f":"IF(COUNTBLANK(C6:IW6)=254,\"odstr\",\"OK\")","v":"OK"},"Řádky pro"]
[{"$f":"IF(COUNTBLANK(C7:IW7)=254,\"odstr\",\"OK\")","v":"OK"},"ročenku PaM"]
["konst",null,null,"(podle stavu k: 31. 12. 2017)",null,null,null,null,null,null,null,null,null,"v tis. Kč",null,"(podle stavu k: 31. 12. 2018)",null,null,null,null,null,null,null,null,null,"v tis. Kč"]
["konst",null,null,"Položka",null,null,"Popis položky",null,null,"Schválený rozpočet","Rozpočet po změnách","Konečný rozpočet","Skutečnost\n","% plnění rozpočtu",null,"Položka",null,null,"Popis položky",null,null,"Schválený rozpočet","Rozpočet po změnách","Konečný rozpočet","Skutečnost\n","% plnění rozpočtu"]
["konst"]
["konst"]
["konst"]
["konst"]
[null,null,null,null,5011,null,"Platy zaměstnanců v pracovním poměru",null,null,107421.16499999999,111655.406,113405.00599999999,108242.683,0.96943521928530718,null,null,5,null,"Běžné výdaje celkem",null,null,{"$f":"V15+V34+V77+V86+V104+V111+V120","v":168608031.98199999},{"$f":"W15+W34+W77+W86+W104+W111+W120","v":172905173.93200001},{"$f":"X15+X34+X77+X86+X104+X111+X120","v":179369523.76820001},{"$f":"Y15+Y34+Y77+Y86+Y104+Y111+Y120","v":174693824.50187999},{"$f":"Y14/W14","v":1.0103446908453035}]
[null,null,null,null,5013,null,"Platy státních zaměstnanců ve správních úřadech",null,null,659840.39399999997,668565.48300000001,679002.77,645905.53500000003,0.96610661397247155,null,null,50,null,"Platy a podobné související výdaje",null,null,{"$f":"V16+V20+V26+V30+V32","v":1243477.5819999999},{"$f":"W16+W20+W26+W30+W32","v":1243477.5819999999},{"$f":"X16+X20+X26+X30+X32","v":1372635.3960000002},{"$f":"Y16+Y20+Y26+Y30+Y32","v":1222701.2136000001},{"$f":"Y15/W15","v":0.98329172258450914}]
[null,null,null,null,5021,null,"Ostatní osobní výdaje",null,null,102553.765,112732.023,163424.899,102161.11481,0.9062297658758417,null,null,501,null,"Platy",null,null,{"$f":"V17+V18+V19","v":845764.31500000006},{"$f":"W17+W18+W19","v":845764.31500000006},{"$f":"X17+X18","v":890573.73300000001},{"$f":"Y17+Y18+Y19","v":834226.56200000003},{"$f":"Y16/W16","v":0.98635819365351207}]
[null,null,null,null,5022,null,"Platy představitelů státní moci a některých orgánů",null,null,1622.4,1622.4,1639.32,1638.72,1.010059171597633,null,null,5011,null,"Platy zaměstnanců v pracovním poměru vyjma zaměstnanců na služebních místech",null,null,121029.258,121725.258,127583.41,117027.302,{"$f":"Y17/W17","v":0.96140524918829906}]
[null,null,null,null,5024,null,"Odstupné",{"$error":"#N/A"},null,1000,697.077,698.70799999999997,350.70800000000003,0.50311228171349798,null,null,5013,null,"Platy zaměstnanců na služebních místech podle zákona o státní službě ",null,null,724735.05700000003,724039.05700000003,762990.32299999997,717199.26,{"$f":"Y18/W18","v":0.99055327618880096}]
[null,null,null,null,5025,null,"Odbytné",null,null,500,908.73599999999999,908.73599999999999,408.73599999999999,0.44978519614057327,null,null,5019,null,"Ostatní platy",null,null,0,0,0,0,"x "]
[null,null,null,null,5026,null,"Odchodné",null,null,0,406.5,406.5,406.5,1,null,null,502,null,"Ostatní platby za provedenou práci",null,null,{"$f":"SUM(V21:V25)","v":88058.630999999994},{"$f":"SUM(W21:W25)","v":88058.630999999994},{"$f":"SUM(X21:X25)","v":143663.84900000002},{"$f":"SUM(Y21:Y25)","v":85758.257999999987},{"$f":"Y20/W20","v":0.97387680260439202}]
[{"$f":"IF(COUNTBLANK(C21:IW21)=254,\"odstr\",IF(AND($A$1=\"TISK\",SUM(J14:N14)=0),\"odstr\",\"OK\"))","v":{"$error":"#REF!"}},"OK",null,null,5031,null,"Povinné pojistné na sociální zabezpečení a příspěvek na státní politiku zaměstnanosti",null,null,216146.81899999999,219288.94,233924.40100000001,208999.671,0.9530789423306073,null,null,5021,null,"Ostatní osobní výdaje",null,null,84823.430999999997,84720.680999999997,140323.899,83043.217999999993,0.98020007653149055]
[{"$f":"IF(COUNTBLANK(C22:IW22)=254,\"odstr\",IF(AND($A$1=\"TISK\",SUM(J15:N15)=0),\"odstr\",\"OK\"))","v":{"$error":"#REF!"}},"OK",null,null,5032,null,"Povinné pojistné na veřejné zdravotní pojištění",null,null,78017.899999999994,78920.142999999996,84188.316000000006,75443.115000000005,0.95594245185288129,null,null,5022,null,"Platy představitelů státní moci a některých orgánů",null,null,1735.2,1735.2,1737.2,1736.4,1.0006915629322268]
[null,null,null,null,5039,null,"Ostatní povinné pojistné placené zaměstnavatelem",null,null,0,170,170,40.668999999999997,0.23922941176470586,null,null,5024,null,"Odstupné",{"$error":"#N/A"},null,1000,864.5,864.5,363.995,0.42104684788895314]
[{"$f":"IF(COUNTBLANK(C24:IW24)=254,\"odstr\",IF(AND($A$1=\"TISK\",SUM(J16:N16)=0),\"odstr\",\"OK\"))","v":{"$error":"#REF!"}},"OK",null,null,5041,null,"Odměny za užití duševního vlastnictví",null,null,0,0,0,0,"x ",null,null,5025,null,"Odbytné",null,null,500,602.75,602.75,479.14499999999998,0.7949315636665284]
[{"$f":"IF(COUNTBLANK(C25:IW25)=254,\"odstr\",IF(AND($A$1=\"TISK\",SUM(J17:N17)=0),\"odstr\",\"OK\"))","v":{"$error":"#REF!"}},"OK",null,null,50,null,"Výdaje na platby, ostatních platby za provedenou práci a pojistné",null,null,1167102.443,1194966.7080000001,1277768.6560000002,1143597.45181,0.95701197711526531,null,null,5026,null,"Odchodné",null,null,0,135.5,135.5,135.5,1]
[null,null,null,null,5132,null,"Ochranné pomůcky",null,null,45,46,46,27.976869999999998,0.60819282608695646,null,null,503,null,"Povinné pojistné placené zaměstnavatelem",null,null,{"$f":"V27+V28+V29","v":309654.636},{"$f":"W27+W28+W29","v":309654.636},{"$f":"X27+X28+X29","v":338397.81400000001},{"$f":"SUM(Y27:Y29)","v":302712.39360000001},0.97758069283354765]
[{"$f":"IF(COUNTBLANK(C27:IW27)=254,\"odstr\",IF(AND($A$1=\"TISK\",SUM(J18:N18)=0),\"odstr\",\"OK\"))","v":{"$error":"#REF!"}},"OK",null,null,5133,null,"Léky a zdravotnický materiál",null,null,55,28.361000000000001,28.361000000000001,11.77,0.41500652304220581,null,null,5031,null,"Povinné pojistné na sociální zabezpečení a příspěvek na státní politiku zaměstnanosti",null,null,227310.777,227310.777,247185.55799999999,222437.8205,0.97856258042706001]
[{"$f":"IF(COUNTBLANK(C28:IW28)=254,\"odstr\",IF(AND($A$1=\"TISK\",SUM(J19:N19)=0),\"odstr\",\"OK\"))","v":{"$error":"#REF!"}},"OK",null,null,5134,null,"Prádlo, oděv a obuv",null,null,3170,6436.8609999999999,6436.8609999999999,6433.0381200000002,0.99940609561088867,null,null,5032,null,"Povinné pojistné na veřejné zdravotní pojištění",null,null,82343.858999999997,82343.858999999997,91212.255999999994,80274.573099999994,0.97487018552288152]
[{"$f":"IF(COUNTBLANK(C29:IW29)=254,\"odstr\",IF(AND($A$1=\"TISK\",SUM(J20:N20)=0),\"odstr\",\"OK\"))","v":{"$error":"#REF!"}},"OK",null,null,5136,null,"Knihy, učební pomůcky a tisk",null,null,628,752.38199999999995,752.38199999999995,568.66554000000008,0.7558202349338502,null,null,5039,null,"Ostatní povinné pojistné placené zaměstnavatelem",null,null,0,0,0,0,"x "]
[null,null,null,null,5137,null,"Drobný hmotný dlouhodobý majetek",null,null,7139.1170000000002,22071.644,31950.876250000001,14910.871710000001,0.67556688165140766,null,null,504,null,"Odměny za užití duševního vlastnictví",null,null,{"$f":"V31","v":0},0,{"$f":"X31","v":0},{"$f":"Y31","v":4},0]
[{"$f":"IF(COUNTBLANK(C31:IW31)=254,\"odstr\",IF(AND($A$1=\"TISK\",SUM(J21:N21)=0),\"odstr\",\"OK\"))","v":{"$error":"#REF!"}},"OK",null,null,5139,null,"Nákup materiálu jinde nezařazený",null,null,5920,15009.152,16431.776999999998,12732.59662,0.84832218502417722,null,null,5041,null,"Odměny za užití duševního vlastnictví",null,null,0,0,{"$f":"X33","v":0},4,"x "]
[null,null,null,null,5142,null,"Realizované kurzové ztráty",null,null,215,343.27,343.27,324.05953000000005,0.94403685145803617,null,null,505,null,"Mzdové náhrady",null,null,{"$f":"V33","v":0},0,0,{"$f":"Y33","v":0},"x "]
[{"$f":"IF(COUNTBLANK(C33:IW33)=254,\"odstr\",IF(AND($A$1=\"TISK\",SUM(J22:N22)=0),\"odstr\",\"OK\"))","v":{"$error":"#REF!"}},"OK",null,null,5151,null,"Studená voda",null,null,1461,1672.2059999999999,1672.2059999999999,1580.74117,0.94530289330381545,null,null,5051,null,"Mzdové náhrady",null,null,0,0,0,0,"x "]
[{"$f":"IF(COUNTBLANK(C34:IW34)=254,\"odstr\",IF(AND($A$1=\"TISK\",SUM(J23:N23)=0),\"odstr\",\"OK\"))","v":{"$error":"#REF!"}},"OK",null,null,5152,null,"Teplo",null,null,2551,3261.1849999999999,3261.1849999999999,2497.0607,0.76569121346995039,null,null,51,null,"Neinvestiční nákupy a související výdaje",null,null,{"$f":"V36+V43+V45+V52+V61+V68+V71","v":405320.74899999995},{"$f":"W36+W43+W45+W52+W61+W68+W71","v":410837.73300000001},{"$f":"X36+X43+X45+X52+X61+X68+X71","v":455183.16967000003},{"$f":"SUM(Y35:Y71)","v":603573.22133000009},{"$f":"Y34/W34","v":1.469128010522831}]
[{"$f":"IF(COUNTBLANK(C35:IW35)=254,\"odstr\",IF(AND($A$1=\"TISK\",SUM(J24:N24)=0),\"odstr\",\"OK\"))","v":{"$error":"#REF!"}},"OK",null,null,5153,null,"Plyn",null,null,4943,5014.5320000000002,5014.5320000000002,4406.86661,0.87881912210351831,null,null,5123,null,"Podlimitní technické zhodnocení",null,null,0,0,0,41,0]
[null,null,null,null,5154,null,"Elektrická energie",null,null,5767,8303.4779999999992,8303.4779999999992,6363.30429,0.76634204245498094,null,null,513,null,"Nákupy materiálu",null,null,{"$f":"SUM(V37:V42)","v":27394.523000000001},{"$f":"SUM(W37:W42)","v":57574.216},{"$f":"SUM(X37:X42)","v":58096.272190000003},46193,{"$f":"Y36/W36","v":0.80232095561666006}]
[null,null,null,null,5156,null,"Pohonné hmoty a maziva",null,null,6256,6084.14,6084.14,5801.6685900000002,0.95357249997534577,null,null,5132,null,"Ochranné pomůcky",null,null,35,32.999000000000002,32.999000000000002,22.994,0.69680899421194575]
[null,null,null,null,5157,null,"Teplá voda",null,null,290,275,275,255.14293000000001,0.92779247272727272,null,null,5133,null,"Léky a zdravotnický personál",null,null,25,44.164000000000001,44.164000000000001,22.018000000000001,0.49855085590073361]
[null,null,null,null,5161,null,"Služby pošt",null,null,1391.25,2062.5,2062.5,1927.5610099999999,0.93457503515151508,null,null,5134,null,"Prádlo, oděv a obuv",null,null,3250,6378.5,6378.5,6377.8910500000002,0.99990453084581021]
[null,null,null,null,5162,null,"Služby telekomunikací a radiokomunikací",null,null,11851.76,9363.6129999999994,9608.6129999999994,6122.7944000000007,0.65389229563417461,null,null,5136,null,"Knihy, učební pomůcky a tisk",null,null,635,660.28,660.28,470.07380000000001,0.7119309989701339]
[null,null,null,null,5163,null,"Služby peněžních ústavů",null,null,1679,1970.6120000000001,1970.6120000000001,1827.89579,0.92757772204776989,null,null,5137,null,"Drobný hmotný dlouhodobý majetek",null,null,13254.323,36757.101999999999,36866.722000000002,27717.789270000001,0.75407983115752708]
[null,null,null,null,5164,null,"Nájemné",null,null,23586,55612.720999999998,58556.009570000002,52840.722310000005,0.95015531266668296,null,null,5139,null,"Nákup materiálu jinde nezařazený",null,null,10195.200000000001,13701.171,14113.607190000001,11582.462439999999,0.84536295766252378]
[{"$f":"IF(COUNTBLANK(C43:IW43)=254,\"odstr\",IF(AND($A$1=\"TISK\",SUM(J25:N25)=0),\"odstr\",\"OK\"))","v":{"$error":"#REF!"}},"OK",null,null,5166,null,"Konzultační, poradenské a právní služby",null,null,2879.9,2687.5030000000002,3687.5030000000002,1137.9749999999999,0.42343208547116035,null,null,514,null,"Úroky a ostatní finanční výdaje",null,null,{"$f":"V44","v":215},{"$f":"W44","v":390.73599999999999},{"$f":"X44","v":390.73599999999999},{"$f":"Y44","v":260.13098000000002},0.66574613037959141]
[null,null,null,null,5167,null,"Služby školení a vzdělávání",null,null,3300,5604.4489999999996,5604.451,3527.5655200000001,0.62942236069950863,null,null,5142,null,"Kursové rozdíly ve výdajích",null,null,215,390.73599999999999,390.73599999999999,260.13098000000002,0.66574613037959141]
[{"$f":"IF(COUNTBLANK(C45:IW45)=254,\"odstr\",IF(AND($A$1=\"TISK\",SUM(J26:N26)=0),\"odstr\",\"OK\"))","v":{"$error":"#REF!"}},"OK",null,null,5168,null,"Služby zpracování dat",null,null,22992.108,22237.342000000001,23343.980339999998,19930.090260000001,0.89624426606381291,null,null,515,null,"Nákupy vody, paliv a energie",null,null,{"$f":"SUM(V46:V51)","v":19563.215},{"$f":"SUM(W46:W51)","v":22132.353999999999},{"$f":"SUM(X46:X51)","v":22137.353999999999},{"$f":"SUM(Y46:Y51)","v":20079.629779999999},0.90725233203842659]
[null,null,null,null,5169,null,"Nákup ostatních služeb",null,null,218895.046,147032.12700000001,165406.84591,95098.049769999998,0.64678415330276762,null,null,5151,null,"Studená voda",null,null,1400,1754.769,1754.769,1678.00512,0.95625413943373749]
[null,null,null,null,5171,null,"Opravy a udržování",null,null,9222.7549999999992,12832.527,13872.429,10784.204540000001,0.84038042857809692,null,null,5152,null,"Teplo",null,null,2414.1849999999999,2877.68,2877.68,2397.3337200000001,0.83307863278752337]
[null,null,null,null,5172,null,"Programové vybavení",null,null,4720,5483.1970000000001,5816.1210999999994,891.79759999999999,0.16264190398411729,null,null,5153,null,"Plyn",null,null,4716,4566,4566,3985.3623600000001,0.87283450722733247]
[null,null,null,null,5173,null,"Cestovné (tuzemské i zahraniční)",null,null,40496.786999999997,42454.559999999998,44398.621490000005,31604.710920000001,0.74443619060002042,null,null,5154,null,"Elektrická energie",null,null,4987.03,6633.3149999999996,6633.3149999999996,5999.5277999999998,0.90445392688271253]
[null,null,null,null,5175,null,"Pohoštění",null,null,2120.4699999999998,6240.4719999999998,6476.6719999999996,3185.5439799999999,0.51046523083510353,null,null,5156,null,"Pohonné hmoty a maziva",null,null,5756,6026.59,6031.59,5783.5622400000002,0.95967408434952439]
[null,null,null,null,5176,null,"Účastnické poplatky na konference",null,null,165,1510,1510,992.85675000000003,0.65752102649006627,null,null,5157,null,"Teplá voda",null,null,290,274,274,235.83853999999999,0.86072459854014594]
[{"$f":"IF(COUNTBLANK(C52:IW52)=254,\"odstr\",IF(AND($A$1=\"TISK\",SUM(J27:N27)=0),\"odstr\",\"OK\"))","v":{"$error":"#REF!"}},"OK",null,null,5179,null,"Ostatní nákupy jinde nezařazené",null,null,6018,7236.8239999999996,7236.8239999999996,7222.9697999999999,0.99808559666505636,null,null,516,null,"Nákup služeb",null,null,{"$f":"SUM(V53:V60)","v":293797.36699999997},{"$f":"SUM(W53:W60)","v":257240.12400000001},{"$f":"SUM(X53:X60)","v":297164.05619999999},{"$f":"SUM(Y53:Y60)","v":175633.77943},0.68276199178787511]
[null,null,null,null,5181,null,"Poskytnuté zálohy vnitřním organizačním jednotkám",null,null,0,220,220,0,0,null,null,5161,null,"Poštovní služby",null,null,1811.25,2225.308,2285.8449999999998,2193.7520399999999,0.98581950902976123]
[null,null,null,null,5182,null,"Poskytované zálohy vlastní pokladně",null,null,0,0,0,0,"x ",null,null,5162,null,"Služby elektronických komunikací",null,null,11113.791999999999,9693.0669999999991,10509.825999999999,5947.7001600000003,0.61360353332954376]
[null,null,null,null,5189,null,"Ostatní poskytované zálohy a jistiny",null,null,0,0,0,0,"x ",null,null,5163,null,"Služby peněžních ústavů",null,null,1869,2149.643,2149.643,2032.5210999999999,0.94551565073828536]
[null,null,null,null,5191,null,"Zaplacené sankce",null,null,0,29.861000000000001,29.861000000000001,29.77534,0.99713137537255947,null,null,5164,null,"Nájemné",null,null,29799.022000000001,60046.512000000002,60535.30889,53294.124329999999,0.88754737877197587]
[null,null,null,null,5192,null,"Poskytnuté neinvestiční příspěvky a náhrady (část)",null,null,160,749.39400000000001,749.39400000000001,645.28300000000002,0.86107308038228225,null,null,5166,null,"Konzultační, poradenské a právní služby",null,null,2122.3000000000002,3314.2289999999998,3314.2289999999998,778.38989000000004,0.2348630375269784]
[null,null,null,null,5194,null,"Věcné dary",null,null,475,572.48699999999997,572.48699999999997,177.66929999999999,0.31034643581426302,null,null,5167,null,"Služby školení a vzdělávání",null,null,3050,6660.8270000000002,7251.9116100000001,3171.10383,0.47608259905264017]
[null,null,null,null,5195,null,"Odvody za neplnění povinnosti zaměstnávat zdravotně postižené",null,null,364,264.60000000000002,264.60000000000002,264.60000000000002,1,null,null,5168,null,"Zpracování dat a služby související s informačními a komunikačními technologiemi",null,null,24496.196,28728.300999999999,31064.877,21399.228760000002,0.74488319932320401]
[null,null,null,null,5196,null,"Náhrady a příspěvky související s výkonem ústavní funkce a funkce soudce",null,null,219.6,238.92,238.92,238.92,1,null,null,5169,null,"Nákup ostatních služeb",null,null,219535.807,144422.23699999999,180052.41570000001,86816.959319999994,0.6011329080853387]
[{"$f":"IF(COUNTBLANK(C61:IW61)=254,\"odstr\",IF(AND($A$1=\"TISK\",SUM(J28:N28)=0),\"odstr\",\"OK\"))","v":{"$error":"#REF!"}},"OK",null,null,51,null,"Neinvestiční nákupy a související výdaje",null,null,388976.79299999995,393701.91999999993,432226.51265999995,294364.74796999997,0.74768430890558024,null,null,517,null,"Ostatní nákupy",null,null,{"$f":"SUM(V62:V67)","v":63027.043999999994},{"$f":"SUM(W62:W67)","v":71654.907999999996},{"$f":"SUM(X62:X67)","v":75549.356280000007},{"$f":"SUM(Y62:Y67)","v":58843.960069999994},0.82121325269163692]
[null,null,null,null,5212,null,"Neinvestiční transfery nefinančním podnikatelským subjektům-fyzickým osobám",null,null,5375,1970.94,2115.94,1140.653,0.57873552721036658,null,null,5171,null,"Opravy a udržování",null,null,10049.027,13174.695,16149.24676,13150.732180000001,0.99818114802657676]
[null,null,null,null,5213,null,"Neinvestiční transfery nefinančním podnikatelským subjektům-právnickým osobám",null,null,582735.35100000002,655200.44499999995,992878.59223000007,844041.81713999994,1.2882192366948102,null,null,5172,null,"Programové vybavení",null,null,1589.76,2418.223,2592.223,905.14890000000003,0.37430332107502079]
[null,null,null,null,5221,null,"Neinvestiční transfery obecně prospěšným společnostem",null,null,36604,58491.296000000002,296257.70199999999,254890.07769999999,4.357743717971303,null,null,5173,null,"Cestovné (tuzemské i zahraniční)",null,null,42739.786999999997,40307.239000000001,40547.533409999996,32813.599459999998,0.81408700457007233]
[null,null,null,null,5222,null,"Neinvestiční transfery občanským sdružením",null,null,4795705.2980000004,4326945.1500000004,4613479.665,4431366.1406000005,1.0241327280517989,null,null,5175,null,"Pohoštění",null,null,2455.4699999999998,5917.9849999999997,6422.5871100000004,3186.00902,0.53836044194096477]
[null,null,null,null,5223,null,"Neinvestiční transfery církvím a náboženským společnostem",null,null,1428972.9739999999,1532501.15,1613387.6270000001,1591329.80987,1.0383873512068817,null,null,5176,null,"Účastnické poplatky na konference",null,null,175,1456.6,1456.6,440.98459000000003,0.30274927227790749]
[null,null,null,null,5229,null,"Ostatní neinvestiční transfery neziskovým a podobným organizacím",null,null,691665,325814.86200000002,380984.96299999999,331556.12573000003,1.017621245681543,null,null,5179,null,"Ostaní nákupy jinde nezařazené",null,null,6018,8380.1659999999993,8381.1659999999993,8347.4859199999992,0.99610030636624625]
[{"$f":"IF(COUNTBLANK(C68:IW68)=254,\"odstr\",IF(AND($A$1=\"TISK\",SUM(J29:N29)=0),\"odstr\",\"OK\"))","v":{"$error":"#REF!"}},"OK",null,null,5230,null,"Neinvestiční nedotační transfery podnikatelským subjektům",null,null,0,0,0,0,"x ",null,null,518,null,"Poskytnuté zálohy, jistiny a záruky",null,null,0,0,0,0,"x "]
[null,null,null,null,5240,null,"Neinvestiční nedotační transfery neziskovým a podobným organizacím",null,null,0,0,0,0,"x ",null,null,5181,null,"Poskytnuté zálohy vnitřním organizačním jednotkám",null,null,0,0,0,0,"x "]
[null,null,null,null,52,null,"Neinvestiční transfery podnikatelským subjektům a neziskovým organizacím. Neinvestiční transfery soukromoprávním subjektům",null,null,7541057.6229999997,6900923.8430000003,7899104.4892299995,7454324.6240400011,1.0801922747780135,null,null,5182,null,"Poskytnuté zálohy vlastní pokladně",null,null,0,0,0,0,"x "]
[{"$f":"IF(COUNTBLANK(C71:IW71)=254,\"odstr\",IF(AND($A$1=\"TISK\",SUM(J30:N30)=0),\"odstr\",\"OK\"))","v":{"$error":"#REF!"}},"OK",null,null,5321,null,"Neinvestiční dotace obcím",null,null,10779967.124,12553597.652000001,15369169.676000001,14984063.056289999,1.1936070815446904,null,null,519,null,"Výdaje související s neivestičními nákupy, příspěvky, náhrady a věcné dary",null,null,{"$f":"SUM(V72:V76)","v":1323.6},{"$f":"SUM(W72:W76)","v":1845.3949999999998},{"$f":"SUM(X72:X76)","v":1845.3949999999998},{"$f":"Y72+Y73+Y74+Y75+Y76","v":1510.99225},{"$f":"Y71/W71","v":0.8187906925075662}]
[null,null,null,null,5323,null,"Neinvestiční dotace krajům",null,null,89220432.452999994,90693638.825000003,91588230.835679993,91013283.629889995,1.0035244456946619,null,null,5191,null,"Zaplacené sankce",null,null,0,11.04,11.04,10.098549999999999,0.91472373188405798]
[null,null,null,null,5329,null,"Ostatní neinvestiční dotace veřejným rozpočtům územní úrovně",null,null,0,564.69399999999996,19134.401000000002,19037.26154,33.712526678165524,null,null,5192,null,"Poskytnuté náhrady",null,null,260,539.69899999999996,539.69899999999996,508.70569999999998,0.94257298975910653]
[null,null,null,null,5331,null,"Neinvestiční příspěvky zřízeným příspěvkovým organizacím",null,null,3339486.4270000001,3363723.9890000001,3375449.5559999999,3323142.2772199996,0.98793548105828233,null,null,5194,null,"Věcné dary",null,null,480,536.70000000000005,536.70000000000005,234.232,0.4364300354015278]
[null,null,null,null,5332,null,"Neinvestiční dotace vysokým školám",null,null,33122116.440000001,32767330.877,34385203.288559996,29769946.752870001,0.90852522790515355,null,null,5195,null,"Odvody za neplnění povinností zaměstnávat zdravotně postižené",null,null,364,504.75599999999997,504.75599999999997,504.75599999999997,1]
[null,null,null,null,5334,null,"Neinvestiční transfery veřejným výzkumným institucím",null,null,1043935.084,1499257.4639999999,1947033.0460000001,1800709.62678,1.2010676418283286,null,null,5196,null,"Náhrady a příspěvky související s výkonem ústavní funkce a funkce soudce",null,null,219.6,253.2,253.2,253.2,1]
[null,null,null,null,5336,null,"Neinvestiční dotace zřízeným příspěvkovým organizacím",null,null,713266.62600000005,1097051.05,1324519.8513200001,785985.71882000007,0.71645318494522203,null,null,52,null,"Neinvestiční transfery soukromoprávním subjektům ",null,null,{"$f":"V78+V81","v":7292131.5070000011},{"$f":"W78+W81","v":7996254.1110000005},{"$f":"X78+X81","v":8597534.0188900009},{"$f":"Y78+Y81","v":8056243.6262499997},1.0075022022083409]
[null,null,null,null,5339,null,"Neinvestiční příspěvky ostatním příspěvkovým organizacím",null,null,447492,366772.50599999999,390768.50599999999,388315.39731000003,1.0587363855184937,null,null,521,null,"Neinvestiční transfery podnikatelským subjektům ",null,null,{"$f":"V79+V80","v":588677.93299999996},{"$f":"W79+W80","v":803510.68300000008},{"$f":"X79+X80","v":926043.39323000005},{"$f":"Y79+Y80","v":829193.10168999992},1.0319627594671319]
[null,null,null,null,5342,null,"Převody fondu kulturních a sociálních potřeb a sociálnímu fondu obcí a krajů",null,null,15345.231,15604.419,15835.388000000001,15063.028360000002,0.96530529973592749,null,null,5212,null,"Neinvestiční transfery nefinančním podnikatelským subjektům - fyzickým osobám",null,null,5375,1131.6479999999999,1131.6479999999999,592.72,0.5237671077932361]
[null,null,null,null,5361,null,"Nákup kolků",null,null,0,24,24,24,1,null,null,5213,null,"Neinvestiční transfery nefinančním podnikatelským subjektům - právnickým osobám",null,null,583302.93299999996,802379.03500000003,924911.74523,828600.38168999995,1.0326795012658823]
[null,null,null,null,5362,null,"Platby daní a poplatků státnímu rozpočtu",null,null,322,490.51299999999998,490.51299999999998,443.46100000000001,0.90407593682532372,null,null,522,null,"Neinvestiční transfery neziskovým a podobným organizacím ",null,null,{"$f":"SUM(V82:V85)","v":6703453.574000001},{"$f":"SUM(W82:W85)","v":7192743.4280000003},{"$f":"SUM(X82:X85)","v":7671490.6256600004},{"$f":"SUM(Y82:Y85)","v":7227050.5245599998},1.0047696816803513]
[null,null,null,null,5363,null,"Úhrady sankcí jiným rozpočtům",null,null,0,2534.0819999999999,7894.9949999999999,6054.3220000000001,2.3891578883398408,null,null,5221,null,"Neinvestiční transfery obecně prospěšným společnostem",null,null,24749,274526.19799999997,378809.82299999997,342119.78360999998,1.2462190716311892]
[null,null,null,null,5365,null,"Výdaje z finančního vypořádání minulých let mezi krajem a obcemi",null,null,0,0,0,0,"x ",null,null,5222,null,"Neinvestiční tranfery spolkům ",null,null,4533166.6830000002,5146811.5549999997,5326362.4886600003,5047881.5536700003,0.98077839060692029]
[null,null,null,null,53,null,"Neinvestiční transfery veřejnoprávním subjektům a mezi peněžními fondy téhož subjektu",null,null,138682363.38499999,142360590.07100001,148423754.05656001,142106068.53207999,0.99821213484158022,null,null,5223,null,"Neinvestiční transfery církvím a náboženským společnostem",null,null,1540660.121,1657947.1910000001,1833204.1129999999,1797772.43823,1.0843363696920065]
[null,null,null,null,5422,null,"Náhrady povahy rehabilitací",null,null,0,0,0,0,"x ",null,null,5229,null,"Ostatní neinvestiční transfery neziskovým a podpbným organizacím ",null,null,604877.77,113458.484,133114.201,39276.749049999999,0.34617727705580836]
[null,null,null,null,5424,null,"Náhrady mezd v době nemoci",null,null,3021,3001,3001,2321.6849999999999,0.77363712095968007,null,null,53,null,"Neinvestiční transfery veřejnoprávním subjektům a mezi peněžními fondy téhož subjektu a platby daní",null,null,{"$f":"V87+V91+V97+V99","v":158906166.26199999},{"$f":"W87+W91+W97+W99","v":162405897.58400002},{"$f":"X87+X91+X97+X99","v":167895438.26164001},{"$f":"Y87+Y91+Y97+Y99","v":163847406.76666},1.0088759657383404]
[null,null,null,null,5491,null,"Stipendia studentům a doktorandům",null,null,4231,5678.6,5678.6,5069.5,0.89273764660303589,null,null,532,null,"Neinvestiční transfery veřejným rozpočtům územní úrovně ",null,null,{"$f":"V88+V89+V90","v":117127153.83499999},{"$f":"SUM(W88:W90)","v":120096833.017},{"$f":"SUM(X88:X90)","v":121170005.59076999},{"$f":"SUM(Y88:Y90)","v":120258983.18901999},1.0013501619313894]
[null,null,null,null,5492,null,"Dary obyvatelstvu",null,null,1377,0,900,900,"x ",null,null,5321,null,"Neinvestiční transfery obcím",null,null,12434384.412,16424683.780999999,17163377.557689998,17048054.815669999,1.0379533050974845]
[null,null,null,null,5494,null,"Neinvestiční transfery obyvatelstvu nemající charakter daru",null,null,50,250,945,945,3.78,null,null,5323,null,"Neinvestiční transfery krajům",null,null,104692769.42299999,103656696.612,103988516.11508,103193437.05148,0.99553082843982532]
[null,null,null,null,5499,null,"Ostatní neinvestiční transfery obyvatelstvu",null,null,0,0,0,0,"x ",null,null,5329,null,"Ostatní neinvestiční transfery veřejným rozpočtům územní úrovně",null,null,0,15452.624,18111.918000000001,17491.32187,1.1319321475757127]
[null,null,null,null,54,null,"Neinvestiční transfery obyvatelstvu",null,null,8679,8929.6,10524.6,9236.1849999999995,1.034333564773338,null,null,533,null,"Neinvestiční transfery příspěvkovým a podobným organizacím ",null,null,{"$f":"SUM(V92:V96)","v":41761775.139999993},{"$f":"SUM(W92:W96)","v":42288258.662},{"$f":"SUM(X92:X96)","v":46699119.619870007},{"$f":"SUM(Y92:Y96)","v":43568049.577640004},1.03026350472052]
[null,null,null,null,5511,null,"Neinvestiční transfery mezinárodním organizacím",null,null,538196.1,0,0,0,"x ",null,null,5331,null,"Neinvestiční příspěvky zřízeným příspěvkovým organizacím ",null,null,3713312.8990000002,3679919.6039999998,3697507.1779999998,3617049.67,0.98291540556167001]
[null,null,null,null,5531,null,"Peněžní dary do zahraničí",null,null,3002.3580000000002,2903.201,2903.201,2903.2003599999998,0.99999977955367192,null,null,5332,null,"Neinvestiční transfery vysokým školám",null,null,34938251.034000002,35689674.441,38962759.238109998,36625348.742660001,1.0262169469549745]
[null,null,null,null,5532,null,"Ostatní neinvestiční transfery do zahraničí",null,null,3334,13865.179,30565.179,23344.308519999999,1.6836644171705246,null,null,5334,null,"Neinvestiční transfery veřejným výzkumným institucím ",null,null,1271574.311,1832008.767,2679685.13711,2367511.0619700002,1.292303347350739]
[null,null,null,null,5541,null,"Členské příspěvky mezinárodním vládním organizacím",null,null,0,876675.55,876675.55,835256.90615000005,0.95275487738878994,null,null,5336,null,"Neinvestiční transfery zřízeným příspěvkovým organizacím ",null,null,1357663.8959999999,735442.85,1007955.0666500001,616698.93400999997,0.83854093354772563]
[null,null,null,null,5542,null,"Členské příspěvky mezinárodním nevládním organizacím",null,null,0,4922.7619999999997,8222.7620000000006,7589.35761,1.5416868843141311,null,null,5339,null,"Neinvestiční transfery cizím příspěvkovým organizacím ",null,null,480973,351213,351213,341441.16899999999,0.97217690973853477]
[null,null,null,null,55,null,"Neinvestiční transfery do zahraničí",null,null,544532.45799999998,898366.69200000004,918366.69200000004,869093.77263999998,0.96741539994672909,null,null,534,null,"Převod vlastním fondům a ve vztahu k útvarům bez plné právní subjektivity",null,null,{"$f":"V98","v":16915.287},{"$f":"W98","v":16915.287},{"$f":"X98","v":17822.433000000001},{"$f":"SUM(Y98)","v":16691},0.98674057377802693]
[null,null,null,null,5909,null,"Ostatní neinvestiční výdaje jinde nezařazené",null,null,0,3155.4,3155.4,2105.7031900000006,"x ",null,null,5342,null,"Převody fondu kulturních a sociálních potřeb a sociálnímu fondu obcí a krajů",null,null,16915.287,16915.287,17822.433000000001,16691,0.98674057377802693]
[null,null,null,null,59,null,"Ostatní neinvestiční výdaje",null,null,0,3155.4,3155.4,2105.7031900000006,"x ",null,null,536,"Ostatní neinvestiční transfery jiným veřejným rozpočtům, platby daní a další povinné platby",null,null,null,{"$f":"V100+V101+V102+V103","v":322},{"$f":"SUM(W100:W103)","v":3890.6179999999999},{"$f":"SUM(X100:X103)","v":8490.6180000000004},{"$f":"SUM(Y100:Y103)","v":3683},0.94663624133749447]
[null,null,null,null,5,null,"Běžné výdaje",null,null,148332711.70199999,151760634.234,158964900.40645,151878791.01672998,1.0007785733324479,null,null,5361,null,"Nákup kolků",null,null,0,17,17,17,1]
[null,null,null,null,6111,null,"Programové vybavení",null,null,0,4029.9589999999998,7322.6466,5845.8145999999997,1.450589100286132,null,null,5362,null,"Platba daní a poplatků státnímu rozpočtu",null,null,322,169.92099999999999,169.92099999999999,124,0.72975088423443835]
[{"$f":"IF(COUNTBLANK(C102:IW102)=254,\"odstr\",IF(AND($A$1=\"TISK\",SUM(J31:N31)=0),\"odstr\",\"OK\"))","v":{"$error":"#REF!"}},"OK",null,null,6112,null,"Ocenitelná práva",null,null,0,0,0,0,"x ",null,null,5363,null,"Úhrady sankcí jiným rozpočtům",null,null,0,3703.6970000000001,8303.6970000000001,3542,0.95634173097853303]
[{"$f":"IF(COUNTBLANK(C103:IW103)=254,\"odstr\",IF(AND($A$1=\"TISK\",SUM(J32:N32)=0),\"odstr\",\"OK\"))","v":{"$error":"#REF!"}},"OK",null,null,6121,null,"Budovy, haly a stavby",null,null,66869.070000000007,63634.74,68948.126640000002,5307.2606999999998,8.340193894089927E-2,null,null,5365,null,"Platby daní a poplatků krajům, obcím a státním fondům",null,null,0,0,0,0,"x "]
[{"$f":"IF(COUNTBLANK(C104:IW104)=254,\"odstr\",IF(AND($A$1=\"TISK\",SUM(J33:N33)=0),\"odstr\",\"OK\"))","v":{"$error":"#REF!"}},"OK",null,null,6122,null,"Stroje, přístroje a zařízení",null,null,0,13213.119000000001,13213.119000000001,12738.096599999999,0.9640491847534256,null,null,54,null,"Neinvestiční transfery obyvatelstvu",null,null,{"$f":"V105+V107","v":8400.7080000000005},{"$f":"W105+W107","v":23033.507999999998},{"$f":"X105+X107","v":23059.507999999998},{"$f":"Y105+Y107","v":21313.847999999998},{"$f":"Y104/W104","v":0.92534094242179699}]
[null,null,null,null,6123,null,"Dopravní prostředky",null,null,0,1812.5820000000001,8870.5708300000006,8870.5708300000006,4.8938866379562418,null,null,542,null,"Náhrady placené obyvatelstvu",null,null,{"$f":"V106","v":3069.7080000000001},{"$f":"W106","v":3212.2080000000001},{"$f":"X106","v":3212.2080000000001},{"$f":"Y106","v":2743.7179999999998},0.85415328023589998]
[null,null,null,null,6125,null,"Výpočetní technika",null,null,0,774.92499999999995,6643.2219999999998,5564.8212800000001,7.1811095009194448,null,null,5424,null,"Náhrady mezd v době nemoci",null,null,3069.7080000000001,3212.2080000000001,3212.2080000000001,2743.7179999999998,0.85415328023589998]
[null,null,null,null,6127,null,"Umělecká díla a předměty",null,null,0,0,0,0,"x ",null,null,549,null,"Ostatní neinvestiční transfery obyvatelstvu",null,null,{"$f":"SUM(V108:V110)","v":5331},{"$f":"SUM(W108:W110)","v":19821.3},{"$f":"SUM(X108:X110)","v":19847.3},{"$f":"SUM(Y108:Y110)","v":18570.129999999997},0.93687750046666962]
[null,null,null,null,null,null,null,null,null,null,null,null,null,null,null,null,5491,null,"Stipendia žákům, studentům a doktorandům ",null,null,4231,6324.2,6324.2,5147.25,0.81389740994908444]
[null,null,null,null,61,null,"Investiční nákupy a související výdaje",null,null,66869.070000000007,83465.324999999997,104997.68507000001,38326.564010000002,0.45919145477478224,null,null,5492,null,"Dary obyvatelstvu",null,null,900,900,900,800,0.88888888888888884]
[null,null,null,null,null,null,null,null,null,null,null,null,null,null,null,null,5494,null,"Neinvestiční transfery obyvatelstvu nemající charakter daru",null,null,200,12597.1,12623.1,12622.88,1.0020465027665098]
[{"$f":"IF(COUNTBLANK(C111:IW111)=254,\"odstr\",IF(AND($A$1=\"TISK\",SUM(J34:N34)=0),\"odstr\",\"OK\"))","v":{"$error":"#REF!"}},"OK",null,null,6313,null,"Investiční dotace nefinančním podnikatelským subjektům – právnickým osobám",null,null,0,7273.7879999999996,287668.70289999997,243036.92173,33.412703495070247,null,null,55,null,"Neinvestiční transfery a související platby do zahraničí",null,null,{"$f":"V112+V114+V117","v":752535.174},{"$f":"W112+W114+W117","v":822567.63199999998},{"$f":"X112+X114+X117","v":1022567.632},{"$f":"Y112+Y114+Y117","v":940250.04891999997},1.1430671623120712]
[null,null,null,null,6319,null,"Ostatní investiční dotace podnikatelským subjektům",null,null,20800,10475.25,10475.25,10346,0.98766139232953865,null,null,551,null,"Neinvestiční transfery mezinárodním vládním organizacím a nadnárodním orgánům",null,null,{"$f":"V113","v":6132},0,0,0,"x "]
[{"$f":"IF(COUNTBLANK(C113:IW113)=254,\"odstr\",IF(AND($A$1=\"TISK\",SUM(J35:N35)=0),\"odstr\",\"OK\"))","v":{"$error":"#REF!"}},"OK",null,null,6321,null,"Investiční transfery obecně prospěšným organizacím",null,null,0,5015,5015,4515,0.90029910269192426,null,null,5511,null,"Neinvestiční transfery mezinárodním vládním organizacím",null,null,6132,0,0,0,"x "]
[null,null,null,null,6322,null,"Investiční transfery občanským sdružením",null,null,875194.1,805193.47400000005,829670.06735000003,77875.46385,9.6716461775496199E-2,null,null,553,null,"ostatní neinvestiční transfery do zahraničí ",null,null,{"$f":"V115+V116","v":21336.358},{"$f":"W115+W116","v":183388.826},{"$f":"X115+X116","v":183388.826},{"$f":"Y115+Y116","v":176264.57246999998},{"$f":"Y114/W114","v":0.9611521940273503}]
[null,null,null," ",6329,null,"Ostatní investiční transfery neziskovým a podobným organizacím",null,null,52940,36439.449999999997,45592,45592,1.2511714638942137,null,null,5531,null,"Peněžní dary do zahraničí",null,null,3002.3580000000002,6163.0360000000001,6163.0360000000001,5810.9748300000001,0.94287536694577156]
[null,null,null,null,6341,null,"Investiční transfery obcím",null,null,619690,686309.95600000001,900487.18174999999,413729.95716000005,0.60283251545894823,null,null,5532,null,"Ostatní neinvestiční transfery do zahraničí ",null,null,18334,177225.79,177225.79,170453.59763999999,0.9617877716330111]
[null,null,null,null,6342,null,"Investiční transfery krajům",null,null,0,1251.481,9180.8382000000001,6362.3538899999994,5.0838597549623206,null,null,554,null,"Členské příspěvky mezinárodním organizacím ",null,null,{"$f":"V118+V119","v":725066.81599999999},{"$f":"W118+W119","v":639178.80599999998},{"$f":"X118+X119","v":839178.80599999998},{"$f":"Y118+Y119","v":763985.47644999996},1.1952609649732346]
[null,null,null,null,6349,null,"Ostatní investiční transfery veřejným rozpočtům územní úrovně",null,null,0,11600,11600,6485.4211699999996,0.55908803189655165,null,null,5541,null,"Členské příspěvky mezinárodním vládním organizacím",null,null,723066.81599999999,626613.29099999997,826613.29099999997,753881.55377,1.203104952604652]
[null,null,null,null,6351,null,"Investiční dotace zřízeným příspěvkovým a podobným organizacím",null,null,127041.553,91623.523000000001,156887.01329,54440.493450000002,0.59417594595222012,null,null,5542,null,"Členské příspěvky mezinárodním nevládním organizacím ",null,null,2000,12565.514999999999,12565.514999999999,10103.92268,0.80409936878830679]
[{"$f":"IF(COUNTBLANK(C120:IW120)=254,\"odstr\",IF(AND($A$1=\"TISK\",SUM(J36:N36)=0),\"odstr\",\"OK\"))","v":{"$error":"#REF!"}},"OK",null,null,6352,null,"Investiční dotace vysokým školám",null,null,6362451.9639999997,5670556.591,8493027.9409400001,2951214.9509899998,0.52044537491681298,null,null,59,null,"Ostatní neinvestiční výdaje",null,null,{"$f":"V121","v":0},{"$f":"W121","v":3105.7820000000002},{"$f":"X121","v":3105.7820000000002},{"$f":"Y121","v":2335.7771200000002},0.75207375147386391]
[{"$f":"IF(COUNTBLANK(C121:IW121)=254,\"odstr\",IF(AND($A$1=\"TISK\",SUM(J37:N37)=0),\"odstr\",\"OK\"))","v":{"$error":"#REF!"}},"OK",null,null,6354,null,"Investiční transfery veřejným výzkumným institucím",null,null,62463.779000000002,331821.18900000001,1844718.7890699999,1780633.8811400002,5.3662452554830669,null,null,5909,null,"Ostatní neinvestiční výdaje jinde nezařazené",null,null,0,3105.7820000000002,3105.7820000000002,2335.7771200000002,0.75207375147386391]
[{"$f":"IF(COUNTBLANK(C122:IW122)=254,\"odstr\",IF(AND($A$1=\"TISK\",SUM(J38:N38)=0),\"odstr\",\"OK\"))","v":{"$error":"#REF!"}},"OK",null,null,6359,null,"Investiční dotace ostatním příspěvkovým organizacím",null,null,5700,90,90,90,1,null,null,null,null,"Ostantí neinvestiční transfery",null,null,null,null,null,171883276,0]
[{"$f":"IF(COUNTBLANK(C123:IW123)=254,\"odstr\",IF(AND($A$1=\"TISK\",SUM(J39:N39)=0),\"odstr\",\"OK\"))","v":{"$error":"#REF!"}},"OK",null,null,63,null,"Investiční transfery",null,null,8126281.3959999997,7657649.7020000005,12594412.783500001,5594322.4433800001,0.73055345453042764,null,null,6,null,"Kapitálové výdaje celkem",null,null,{"$f":"V124+V132","v":7503677.926},{"$f":"W124+W132","v":10647505.995000001},{"$f":"X124+X132","v":18487590.076790001},13022564.07,{"$f":"Y123/W123","v":1.2230623843851613}]
[null,null,null,null,6,null,"Kapitálové výdaje",null,null,8193150.466,7741115.0270000007,12699410.468570001,5632649.0073899999,0.72762760761777268,null,null,61,null,"Investiční nákupy a související výdaje",null,null,{"$f":"V125+V127","v":125869.07},{"$f":"W125+W127","v":50709.978999999999},{"$f":"X125+X127","v":112519.954},{"$f":"Y125+Y127","v":21312.498090000001},0.42028213204347808]
[null,null,null,null,"Výdaje kapitoly 333-MŠMT podle položek celkem",null,null,null,null,156525862.16799998,159501749.26100001,171664310.87502,157511440.02411997,0.98752170903390413,null,null,611,null,"Pořízení dlouhodobého nehmotného majetku",null,null,{"$f":"V126","v":15000},{"$f":"W126","v":18595.008999999998},{"$f":"X126","v":27777.774000000001},{"$f":"Y126","v":2000.6191899999999},0.10758904123144011]
[null,null,null,null,null,null,null,null,null,null,null,null,null,"Zdroj: Závěrečný účet – kapitola 333-MŠMT",null,null,6111,null,"Programové vybavení",null,null,15000,18595.008999999998,27777.774000000001,2000.6191899999999,0.10758904123144011]
[null,null,null,null,null,null,null,null,null,null,null,null,null,null,null,null,612,null,"Pořízení dlohodobého hmotného majetku",null,null,{"$f":"V128+V129+V130+V131","v":110869.07},{"$f":"SUM(W128:W131)","v":32114.97},{"$f":"SUM(X128:X131)","v":84742.18},{"$f":"SUM(Y128:Y131)","v":19311.8789},0.60133572910079003]
[null,null,null,null,null,null,null,null,null,null,null,null,null,null,null,null,6121,null,"Budovy, haly a stavby",null,null,110469.07,13837.182000000001,60400.547310000002,151.25,1.0930693836360611E-2]
[null,null,null,null,null,null,null,null,null,null,null,null,null,null,null,null,6122,null,"Stroje, přístroje a zařízení",null,null,400,7991.0839999999998,10052.70369,8002.8554999999997,1.0014730792468205]
[null,null,null,null,null,null,null,null,null,null,null,null,null,null,null,null,6123,null,"Dopravní prostředky",null,null,0,7365.7740000000003,9711.4189999999999,7440.4148999999998,1.0101334768077326]
[null,null,null,null,null,null,null,null,null,null,null,null,null,null,null,null,6125,null,"Výpočetní technika",null,null,0,2920.93,4577.51,3717.3584999999998,1.2726626451164527]
[{"$f":"IF(COUNTBLANK(C132:IW132)=254,\"odstr\",IF(AND($A$1=\"TISK\",SUM(J40:N40)=0),\"odstr\",\"OK\"))","v":{"$error":"#REF!"}},"OK",null,null,null,null,null,null,null,null,null,null,null,null,null,null,63,null,"Investiční transfery",null,null,{"$f":"V133+V136+V140+V144","v":7377808.8559999997},{"$f":"W133+W136+W140+W144","v":10596796.016000001},{"$f":"X133+X136+X140+X144","v":18375070.122790001},{"$f":"Y133+Y136+Y140+Y144","v":13001135.5725},1.2268930677602654]
[null,null,null,null,null,null,null,null,null,null,null,null,null,null,null,null,631,null,"Investiční transfery podnikateslým subjektům ",null,null,{"$f":"V134+V135","v":20800},{"$f":"W134+W135","v":20722.034},{"$f":"X134+X135","v":108802.898},{"$f":"Y134+Y135","v":88693.492280000006},4.2801537860617351]
[null,null,null,null,null,null,null,null,null,null,null,null,null,null,null,null,6313,null,"Investiční transfery nefinančním podnikatelským subjektům - právnickým osobám",null,null,0,1566.0340000000001,89646.898000000001,79657.741399999999,50.865908019876962]
[null,null,null,null,null,null,null,null,null,null,null,null,null,null,null,null,6319,null,"Ostatní investiční transfery podnikatelským subjektům ",null,null,20800,19156,19156,9035.7508799999996,0.47169298809772392]
[null,null,null,null,null,null,null,null,null,null,null,null,null,null,null,null,632,null,"Investiční tranfery neziskovým a podobným organizacím ",null,null,{"$f":"SUM(V137:V139)","v":1037234.1},{"$f":"W137+W138+W139","v":703446.24800000002},{"$f":"X137+X138+X139","v":1390304.6895400002},{"$f":"Y137+Y138+Y139","v":980936.51402999996},1.3944725937752105]
[null,null,null,"",null,null,null,null,null,null,null,null,null,null,null,null,6321,null,"Investiční tranfery obecně prospěšným společnostem",null,null,600,1071.355,1571.355,1523.355,1.4218956368337292]
[null,null,null,null,null,null,null,null,null,null,null,null,null,null,null,null,6322,null,"Investiční transfery spolkům ",null,null,975194.1,702374.89300000004,1323316.3325400001,913996.15902999998,1.301293893245697]
[null,null,null,null,null,null,null,null,null,null,null,null,null,null,null,null,6329,null,"Ostatní investiční transfery neziskovým a podobným organizacím ",null,null,61440,0,65417.002,65417,0]
[null,null,null,null,null,null,null,null,null,null,null,null,null,null,null,null,634,null,"Investiční transfery veřejným rozpočtům územní úrovně",null,null,{"$f":"SUM(V141:V143)","v":926340.50800000003},{"$f":"W141+W142+W143","v":1136405.527},{"$f":"X141+X142+X143","v":1839402.80758},{"$f":"Y141+Y142+Y143","v":1141995.75171},{"$f":"Y140/W140","v":1.0049192164039871}]
[null,null,null,null,null,null,null,null,null,null,null,null,null,null,null,null,6341,null,"Investiční transfery obcím ",null,null,913740.50800000003,1098590.3659999999,1714607.2223700001,1027463.9506400001,0.93525665474477693]
[null,null,null,null,null,null,null,null,null,null,null,null,null,null,null,null,6342,null,"Investiční transfery krajům ",null,null,10000,35215.161,117081.00638000001,106817.22224,3.0332737152614468]
[null,null,null,null,null,null,null,null,null,null,null,null,null,null,null,null,6349,null,"Ostatní investiční transfery veřejným rozpočtům územní úrovně",null,null,2600,2600,7714.5788300000004,7714.5788300000004,2.9671457038461542]
[null,null,null,null,null,null,null,null,null,null,null,null,null,null,null,null,635,null,"Investiční transfery příspěvkovým a podobným organizacím ",null,null,{"$f":"SUM(V145:V148)","v":5393434.2479999997},{"$f":"W145+W146+W147+W148","v":8736222.2070000004},{"$f":"X145+X146+X147+X148","v":15036559.727670001},{"$f":"Y145+Y146+Y147+Y148","v":10789509.814479999},1.2350315226454265]
[null,null,null,null,null,null,null,null,null,null,null,null,null,null,null,null,6351,null,"Investiční transfery zřízeným příspěvkovým organizacím ",null,null,100736.5,63870.447999999997,151536.40719,100772.38017999999,1.5777622254974633]
[null,null,null,null,null,null,null,null,null,null,null,null,null,null,null,null,6352,null,"Investiční transfery vysokým školám ",null,null,5224712.7479999997,8381837.8619999997,13470605.28448,9613582.0233500004,1.1469539475267412]
[null,null,null,null,null,null,null,null,null,null,null,null,null,null,null,null,6354,null,"Investiční transfery veřejným výzkumným institucím ",null,null,62285,284813.897,1408718.0360000001,1075155.4109499999,3.7749401355580621]
[null,null,null,null,null,null,null,null,null,null,null,null,null,null,null,null,6359,null,"Investiční transfery ostatním příspěvkovým organizacím ",null,null,5700,5700,5700,0,0]
[{"$f":"IF(COUNTBLANK(C149:IW149)=254,\"odstr\",IF(AND($A$1=\"TISK\",SUM(J41:N41)=0),\"odstr\",\"OK\"))","v":{"$error":"#REF!"}},"OK",null,null,null,null,null,null,null,null,null,null,null,null,null,null,"Výdaje kapitoly 333-MŠMT podle položek celkem",null,null,null,null,{"$f":"V123+V14","v":176111709.90799999},{"$f":"W123+W14","v":183552679.92700002},{"$f":"X123+X14","v":197857113.84499002},{"$f":"Y123+Y14","v":187716388.57187998},1.0226839981118003]
["odstr","OK",null,null,null,null,null,null,null,null,null,null,null,null,null,"",null,null,null,null,null,null,null,null,null,"Zdroj: Závěrečný účet – kapitola 333-MŠMT"]
[{"$error":"#REF!"},"OK"]
[{"$error":"#REF!"},"OK"]
[{"$error":"#REF!"},"OK"]
[{"$error":"#REF!"},"OK"]
[{"$error":"#REF!"},"OK"]
[{"$error":"#REF!"},"OK"]
[{"$error":"#REF!"},"OK"]
[{"$error":"#REF!"},"OK"]
[{"$error":"#REF!"},"OK"]
[{"$error":"#REF!"},"OK"]
[{"$error":"#REF!"},"OK"]
[{"$error":"#REF!"},"OK"]
[{"$error":"#REF!"},"OK"]
[{"$error":"#REF!"},"OK"]
[{"$error":"#REF!"},"OK"]
[{"$error":"#REF!"},"OK"]
[{"$error":"#REF!"},"OK"]
[{"$error":"#REF!"},"OK"]
[{"$error":"#REF!"},"OK"]
[{"$error":"#REF!"},"OK"]
[{"$error":"#REF!"},"OK"]
[{"$error":"#REF!"},"OK"]
[{"$error":"#REF!"},"OK"]
[{"$error":"#REF!"},"OK"]
[{"$error":"#REF!"},"OK"]
[{"$error":"#REF!"},"OK"]
[{"$error":"#REF!"},"OK"]
[{"$error":"#REF!"},"OK"]
[{"$error":"#REF!"},"OK"]
[{"$error":"#REF!"},"OK"]
[{"$error":"#REF!"},"OK"]
[{"$error":"#REF!"},"OK"]
[{"$error":"#REF!"},"OK"]
[{"$error":"#REF!"},"OK"]
[{"$error":"#REF!"},"OK"]
[{"$error":"#REF!"},"OK"]
[{"$error":"#REF!"},"OK"]
[{"$error":"#REF!"},"OK"]
[{"$error":"#REF!"},"OK"]
[{"$error":"#REF!"},"OK"]
[{"$error":"#REF!"},"OK"]
[{"$error":"#REF!"},"OK"]
[{"$error":"#REF!"},"OK"]
[{"$error":"#REF!"},"OK"]
[{"$error":"#REF!"},"OK"]
[]
[{"$f":"IF(COUNTBLANK(C197:IW197)=254,\"odstr\",IF(AND($A$1=\"TISK\",SUM(J89:N89)=0),\"odstr\",\"OK\"))","v":{"$error":"#REF!"}},"OK"]
[{"$error":"#REF!"},"OK"]
[{"$error":"#REF!"},"OK"]
[{"$error":"#REF!"},"OK"]
[{"$error":"#REF!"},"OK"]
[{"$error":"#REF!"},"OK"]
[{"$f":"IF(COUNTBLANK(C202:IW202)=254,\"odstr\",IF(AND($A$1=\"TISK\",SUM(J94:N94)=0),\"odstr\",\"OK\"))","v":{"$error":"#REF!"}},"OK"]
[{"$f":"IF(COUNTBLANK(C204:IW204)=254,\"odstr\",IF(AND($A$1=\"TISK\",SUM(J96:N96)=0),\"odstr\",\"OK\"))","v":{"$error":"#REF!"}},"OK"]
[{"$error":"#REF!"},"OK"]
[{"$error":"#REF!"},"OK"]
[{"$error":"#REF!"},"OK"]
[{"$error":"#REF!"},"OK"]
[{"$error":"#REF!"},"OK"]
[{"$error":"#REF!"},"OK"]
[]
[]
[]
[{"$f":"IF(COUNTBLANK(C214:IW214)=254,\"odstr\",IF(AND($A$1=\"TISK\",SUM(J106:N106)=0),\"odstr\",\"OK\"))","v":{"$error":"#REF!"}},"OK"]
[{"$f":"IF(COUNTBLANK(C215:IW215)=254,\"odstr\",IF(AND($A$1=\"TISK\",SUM(J107:N107)=0),\"odstr\",\"OK\"))","v":{"$error":"#REF!"}},"OK"]
[{"$f":"IF(COUNTBLANK(C216:IW216)=254,\"odstr\",IF(AND($A$1=\"TISK\",SUM(J109:N109)=0),\"odstr\",\"OK\"))","v":{"$error":"#REF!"}},"OK"]
[{"$f":"IF(COUNTBLANK(C217:IW217)=254,\"odstr\",IF(AND($A$1=\"TISK\",SUM(J111:N111)=0),\"odstr\",\"OK\"))","v":{"$error":"#REF!"}},"OK"]
[{"$error":"#REF!"},"OK"]
[{"$error":"#REF!"},"OK"]
[{"$error":"#REF!"},"OK"]
[{"$error":"#REF!"},"OK"]
[{"$error":"#REF!"},"OK"]
[{"$error":"#REF!"},"OK"]
[{"$error":"#REF!"},"OK"]
[{"$error":"#REF!"},"OK"]
[{"$error":"#REF!"},"OK"]
["konst","stop"]
[{"$f":"IF(COUNTBLANK(D133:E133)=2,\"odstr\",\"OK\")","v":"odstr"}]
[{"$f":"IF(COUNTBLANK(D134:E134)=2,\"odstr\",\"OK\")","v":"odstr"}]

{"sheet":"B7","index":7,"n_rows":244,"n_cols":40,"rows_kept":244,"cut":false,"hidden":false,"merged":[[112,6,112,7],[127,6,127,7],[95,6,95,7],[94,6,94,7],[102,6,102,7],[100,6,100,7],[97,6,97,7],[79,6,79,7],[78,6,78,7],[84,6,84,7],[82,6,82,7],[81,6,81,7],[80,6,80,7],[85,6,85,7],[83,6,83,7],[92,6,92,7],[109,6,109,7],[108,6,108,7],[107,6,107,7],[98,6,98,7],[106,6,106,7],[105,6,105,7],[104,6,104,7],[103,6,103,7],[99,6,99,7],[75,6,75,7],[72,6,72,7],[74,6,74,7],[93,6,93,7],[91,6,91,7],[90,6,90,7],[89,6,89,7],[86,6,86,7],[73,6,73,7],[101,6,101,7],[25,6,25,7],[57,6,57,7],[29,6,29,7],[88,6,88,7],[87,6,87,7],[26,6,26,7],[27,6,27,7],[28,6,28,7],[77,6,77,7],[76,6,76,7],[51,6,51,7],[52,6,52,7],[71,6,71,7],[67,6,67,7],[58,6,58,7],[59,6,59,7],[60,6,60,7],[61,6,61,7],[62,6,62,7],[65,6,65,7],[68,6,68,7],[69,6,69,7],[70,6,70,7],[54,6,54,7],[30,6,30,7],[31,6,31,7],[32,6,32,7],[33,6,33,7],[55,6,55,7],[56,6,56,7],[66,6,66,7],[63,6,63,7],[34,6,34,7],[36,6,36,7],[40,6,40,7],[41,6,41,7],[37,6,37,7],[39,6,39,7],[53,6,53,7],[42,6,42,7],[43,6,43,7],[44,6,44,7],[45,6,45,7],[46,6,46,7],[47,6,47,7],[48,6,48,7],[49,6,49,7],[50,6,50,7],[138,6,138,7],[167,6,167,7],[162,6,162,7],[163,6,163,7],[159,6,159,7],[151,6,151,7],[152,6,152,7],[148,6,148,7],[149,6,149,7],[153,6,153,7],[154,6,154,7],[158,6,158,7],[161,6,161,7],[146,6,146,7],[155,6,155,7],[157,6,157,7],[156,6,156,7],[147,6,147,7],[110,6,110,7],[111,6,111,7],[113,6,113,7],[114,6,114,7],[118,6,118,7],[166,6,166,7],[172,6,172,7],[174,6,174,7],[173,6,173,7],[171,6,171,7],[168,6,168,7],[169,6,169,7],[135,6,135,7],[134,6,134,7],[139,6,139,7],[136,6,136,7],[141,6,141,7],[142,6,142,7],[150,6,150,7],[130,6,130,7],[126,6,126,7],[121,6,121,7],[119,6,119,7],[120,6,120,7],[122,6,122,7],[124,6,124,7],[125,6,125,7],[115,6,115,7],[129,6,129,7],[128,6,128,7],[131,6,131,7],[132,6,132,7],[140,6,140,7],[137,6,137,7],[189,6,189,7],[176,6,176,7],[181,6,181,7],[182,6,182,7],[183,6,183,7],[178,6,178,7],[179,6,179,7],[180,6,180,7],[184,6,184,7],[186,6,186,7],[188,6,188,7],[177,6,177,7],[187,6,187,7],[133,6,133,7],[143,6,143,7],[144,6,144,7],[145,6,145,7],[170,6,170,7],[164,6,164,7],[165,6,165,7],[192,4,192,20],[193,4,193,20],[8,3,12,4],[8,6,12,7],[8,9,9,12],[8,13,9,16],[8,17,9,20],[10,9,12,9],[10,10,12,10],[10,11,12,11],[116,6,116,7],[117,6,117,7],[10,13,12,13],[10,14,12,14],[10,15,12,15],[10,20,12,20],[10,16,12,16],[10,17,12,17],[10,18,12,18],[10,19,12,19],[22,6,22,7],[23,6,23,7],[10,12,12,12],[185,6,185,7],[13,6,13,7],[14,6,14,7],[15,6,15,7],[16,6,16,7],[24,6,24,7],[17,6,17,7],[18,6,18,7],[20,6,20,7],[21,6,21,7],[19,6,19,7],[8,22,12,23],[8,25,12,26],[8,28,9,31],[8,32,9,35],[8,36,9,39],[10,28,12,28],[10,29,12,29],[10,30,12,30],[10,31,12,31],[10,32,12,32],[10,33,12,33],[10,34,12,34],[10,35,12,35],[10,36,12,36],[10,37,12,37],[10,38,12,38],[10,39,12,39],[28,25,28,26],[29,25,29,26],[31,25,31,26],[34,25,34,26],[37,25,37,26],[38,25,38,26],[39,25,39,26],[40,25,40,26],[16,25,16,26],[17,25,17,26],[19,25,19,26],[20,25,20,26],[21,25,21,26],[23,25,23,26],[24,25,24,26],[25,25,25,26],[26,25,26,26],[32,24,32,27],[41,25,41,26],[42,25,42,26],[43,25,43,26],[44,25,44,26],[45,25,45,26],[47,25,47,26],[49,25,49,26],[50,25,50,26],[51,25,51,26],[53,25,53,26],[54,25,54,26],[55,25,55,26],[56,25,56,26],[57,25,57,26],[58,25,58,26],[59,25,59,26],[60,25,60,26],[62,25,62,26],[63,25,63,26],[64,25,64,26],[65,25,65,26],[66,25,66,26],[67,25,67,26],[68,25,68,26],[69,25,69,26],[70,25,70,26],[72,25,72,26],[85,25,85,26],[86,25,86,26],[87,25,87,26],[88,25,88,26],[89,25,89,26],[90,25,90,26],[93,25,93,26],[94,25,94,26],[73,25,73,26],[74,25,74,26],[75,25,75,26],[76,25,76,26],[78,25,78,26],[79,25,79,26],[81,25,81,26],[82,25,82,26],[83,25,83,26],[91,24,91,27],[111,25,111,26],[112,25,112,26],[113,25,113,26],[115,25,115,26],[116,25,116,26],[118,25,118,26],[119,25,119,26],[120,25,120,26],[95,25,95,26],[97,25,97,26],[98,25,98,26],[100,25,100,26],[101,25,101,26],[102,25,102,26],[103,25,103,26],[104,25,104,26],[106,25,106,26],[96,25,96,27],[109,24,109,27],[121,25,121,26],[122,25,122,26],[123,25,123,26],[124,25,124,26],[126,25,126,26],[127,25,127,26],[128,25,128,26],[130,25,130,26],[131,25,131,26],[143,25,143,26],[144,25,144,26],[145,25,145,26],[146,25,146,26],[149,25,149,26],[152,25,152,26],[153,25,153,26],[167,25,167,26],[132,25,132,26],[133,25,133,26],[134,25,134,26],[135,25,135,26],[138,25,138,26],[139,25,139,26],[140,25,140,26],[142,25,142,26],[136,24,136,27],[147,24,147,27],[154,24,154,27],[172,25,172,26],[173,25,173,26],[174,25,174,26],[178,25,178,26],[156,25,156,26],[157,25,157,26],[158,25,158,26],[160,25,160,26],[161,25,161,26],[162,25,162,26],[164,25,164,26],[166,25,166,26],[170,24,170,27],[176,24,176,27],[231,25,231,26],[235,25,235,26],[236,25,236,26],[239,23,239,39],[214,25,214,26],[215,25,215,26],[216,25,216,26],[220,25,220,26],[223,25,223,26],[224,25,224,26],[226,25,226,26],[227,25,227,26],[233,24,233,27],[232,25,232,27],[14,24,14,27],[13,25,13,26],[175,25,175,26],[33,24,33,26],[92,25,92,27],[110,24,110,27],[148,25,148,27],[228,25,228,26],[230,25,230,26],[203,25,203,26],[204,25,204,26],[199,25,199,26],[200,25,200,26],[202,25,202,26],[179,25,179,26],[180,25,180,26],[181,25,181,26],[183,25,183,26],[184,25,184,26],[185,25,185,26],[186,25,186,26],[187,25,187,26],[188,25,188,26],[169,25,169,26],[189,25,189,26],[191,25,191,26],[193,25,193,26],[198,25,198,26],[192,24,192,27],[196,24,196,27],[221,24,221,27],[205,25,205,26],[207,25,207,26],[208,25,208,26],[209,25,209,26],[211,25,211,26],[212,25,212,26],[213,25,213,26]]}
[{"$f":"IF(#REF!=\"\",\"ŠABLONA\",IF(#REF!=\"T\",\"TISK\",\"ELEKTRO\"))","v":{"$error":"#REF!"}},0,{"$f":"CONCATENATE(D1,F1,IF(G1<>\"\",\".\",\"\"),G1,IF(H1<>\"\",\".\",\"\"),H1,IF(I1<>\"\",\".\",\"\"),I1,\"\")","v":{"$error":"#REF!"}},{"$f":"IF(#REF!=\"\",\" ?\",#REF!)","v":{"$error":"#REF!"}},{"$f":"CONCATENATE(C1,U1)","v":{"$error":"#REF!"}},7]
["konst"]
["konst","172x11",null,"Tab. B7:",null,null,null,"Výdaje kapitoly 700-Obce a DSO; KÚ (část: 31–32– vzdělávání) – podle položek",null,null,null,null,null,null,null,null,null,null,null,null,null,null,"Tab. B7:",null,null,null,"Výdaje kapitoly 700-Obce a DSO; KÚ (část: 31–32– vzdělávání) – podle položek"]
["konst",{"$f":"COUNTA(Datova_oblast)","v":1922},null,{"$f":"IF(D1=\" ?\",\"\",CONCATENATE(\"Tab. \",E1,\":\"))","v":{"$error":"#REF!"}},null,null,null,{"$f":"IF(H3=\"Zadejte název tabulky\",\"\",H3)","v":"Výdaje kapitoly 700-Obce a DSO; KÚ (část: 31–32– vzdělávání) – podle položek"},null,null,null,null,null,null,null,null,null,null,null,null,null,null,{"$f":"IF(W1=\" ?\",\"\",CONCATENATE(\"Tab. \",X1,\":\"))","v":"Tab. :"},null,null,null,{"$f":"IF(AA3=\"Zadejte název tabulky\",\"\",AA3)","v":"Výdaje kapitoly 700-Obce a DSO; KÚ (část: 31–32– vzdělávání) – podle položek"}]
[{"$f":"IF(D5=\"\",\"odstr\",\"OK\")","v":"odstr"},0]
[{"$f":"IF(COUNTBLANK(C6:IV6)=254,\"odstr\",\"OK\")","v":"odstr"},"Řádky pro"]
[{"$f":"IF(COUNTBLANK(C7:IV7)=254,\"odstr\",\"OK\")","v":"odstr"},"ročenku PaM"]
["konst",null,null,"(podle stavu k: 31. 12. 2017)",null,null,null,null,null,null,null,null,null,null,null,null,null,null,null,null,"v tis. Kč",null,"(podle stavu k: 31. 12. 2018)",null,null,null,null,null,null,null,null,null,null,null,null,null,null,null,null,"v tis. Kč"]
["konst",null,null,"Položka",null,null,"Popis položky",null,null,"Celkem1)",null,null,null,"Obce a DSO1)",null,null,null,"Krajské úřady1)",null,null,null,null,"Položka",null,null,"Popis položky",null,null,"Celkem1)",null,null,null,"Obce a DSO1)",null,null,null,"Krajské úřady1)"]
["konst"]
["konst",null,null,null,null,null,null,null,null,"schválený\nrozpočet","rozpočet po\nzměnách","skutečnost","% plnění\nrozpočtu","schválený\nrozpočet","rozpočet po\nzměnách","skutečnost","% plnění\nrozpočtu","schválený\nrozpočet","rozpočet po\nzměnách","skutečnost","% plnění\nrozpočtu",null,null,null,null,null,null,null,"schválený\nrozpočet","rozpočet po\nzměnách","skutečnost","% plnění\nrozpočtu","schválený\nrozpočet","rozpočet po\nzměnách","skutečnost","% plnění\nrozpočtu","schválený\nrozpočet","rozpočet po\nzměnách","skutečnost","% plnění\nrozpočtu"]
["konst"]
["konst"]
[null,null,null,null,5011,null,"Platy zaměstnanců v pracovním poměru",null,null,46169.080600000001,98350.138800000001,73940.028290000002,0.75180400548656878,42774.280599999998,74219.256580000001,56249.054329999999,0.75787682229570508,3394.8,24130.88222,17690.973959999999,0.73312586745533415,null,null,5,null,"BĚŽNÉ VÝDAJE",null,null,{"$f":"AC15+AC33+AC92+AC110+AC137+AC148+AC155+AC171","v":77088125.494309992},{"$f":"AD15+AD33+AD92+AD110+AD137+AD148+AD155+AD171","v":149104534.84321001},{"$f":"AE15+AE33+AE92+AE110+AE137+AE148+AE155+AE171","v":147162294.66073999},{"$f":"AE14/AD14","v":0.98697396974201779},{"$f":"AG15+AG33+AG92+AG110+AG137+AG148+AG155+AG171","v":29086731.808309998},{"$f":"AH15+AH33+AH92+AH110+AH137+AH148+AH155+AH171","v":38487490.545540005},{"$f":"AI15+AI33+AI92+AI110+AI137+AI148+AI155+AI171","v":37034681.592599995},{"$f":"AI14/AH14","v":0.96225243754926071},{"$f":"AK15+AK33+AK92+AK110+AK137+AK148+AK155+AK171","v":48001393.685999997},{"$f":"AL15+AL33+AL92+AL110+AL137+AL148+AL155+AL171","v":110625133.50847},{"$f":"AM15+AM33+AM92+AM110+AM137+AM148+AM155+AM171","v":110127613.06814},{"$f":"AM14/AL14","v":0.99550264551507273}]
[null,null,null,null,5019,null,"Ostatní platy",null,null,526.79999999999995,7207.49,5763.62021,0.79967092704949994,526.79999999999995,7207.49,5763.62021,0.79967092704949994,0,0,0,"x ",null,null,50,"Platy a podobné a související výdaje",null,null,null,{"$f":"AC16+AC19+AC23+AC28+AC31","v":150588.80669},{"$f":"AD16+AD19+AD23+AD28+AD31","v":346307.73413},{"$f":"AE16+AE19+AE23+AE28","v":277715.39591999998},0.80193241025263606,{"$f":"AG16+AG19+AG23+AG28+AG31","v":133162.17269000001},{"$f":"AH16+AH19+AH23+AH28+AH31","v":269183.89286000002},{"$f":"AI16+AI19+AI23+AI28+AI31","v":215975.3285},0.8023337734116458,{"$f":"AK16+AK19+AK23+AK28","v":17426.633999999998},{"$f":"AL16+AL19+AL23+AL28+AL31","v":77123.841270000004},{"$f":"AM16+AM19+AM23+AM28+AM31","v":61740.067419999992},{"$f":"AM15/AL15","v":0.80053153996643489}]
[null,null,null,null,5021,null,"Ostatní osobní výdaje",null,null,43487.579560000006,123416.53460999997,103360.99490000001,0.8374971410972113,38422.539560000005,110963.48260999998,93363.2019,0.8413867310576475,5065.04,12453.052,9997.7929999999997,0.80283877398086834,null,null,501,null,"Platy",null,null,{"$f":"AC17+AC18","v":63640.493690000003},{"$f":"AD17+AD18","v":134815.65896},{"$f":"AE17+AE18","v":101916.47393000001},0.75596911157211177,{"$f":"AG17+AG18","v":58243.384690000006},{"$f":"AH17+AH18","v":100504.74533999999},{"$f":"AI17+AI18","v":76063.266090000005},0.75681268414425307,{"$f":"AK17","v":5397.1090000000004},{"$f":"AL17","v":34310.913619999999},{"$f":"AM17","v":25853.207839999999},{"$f":"AM16/AL16","v":0.75349808886843628}]
[{"$f":"IF(COUNTBLANK(C17:IV17)=254,\"odstr\",IF(AND($A$1=\"TISK\",SUM(J14:U14)=0),\"odstr\",\"OK\"))","v":{"$error":"#REF!"}},"OK",null,null,5024,null,"Odstupné",null,null,0,0,3.0089999999999999,"x ",0,0,3.0089999999999999,"x ",0,0,0,"x ",null,null,5011,null,"Platy zaměstnanců v pracovním poměru vyjma zaměstnanců na služebních místech",null,null,63061.69369,128436.54896,96240.885070000004,0.74932630819886836,57664.584690000003,94125.635339999993,70387.677230000001,0.74780560020387754,5397.1090000000004,34310.913619999999,25853.207839999999,{"$f":"AM17/AL17","v":0.75349808886843628}]
[{"$f":"IF(COUNTBLANK(C18:IV18)=254,\"odstr\",IF(AND($A$1=\"TISK\",SUM(J15:U15)=0),\"odstr\",\"OK\"))","v":{"$error":"#REF!"}},"OK",null,null,5029,null,"Ostatní platby za provedenou práci jinde nezařazené",null,null,24,175,135.53373999999999,0.77447851428571424,24,175,135.53373999999999,0.77447851428571424,0,0,0,"x ",null,null,5019,null,"Ostatní platy",null,null,578.79999999999995,6379.11,5675.5888599999998,0.8897148442337568,578.79999999999995,6379.11,5675.5888599999998,0.8897148442337568,0,0,0,"x"]
[null,null,null,null,5031,null,"Povinné pojistné na sociální zabezpečení a příspěvek na státní politiku zaměstnanosti",null,null,11652.643400000001,37230.806219999999,29352.159560000004,0.78838366772278845,10724.6834,29362.351409999996,23563.453330000004,0.80250566451483007,927.96,7868.4548100000002,5788.7062300000007,0.73568526092863218,null,null,502,null,"Ostatní platby za provedenou práci",null,null,{"$f":"AC20+AC21+AC22","v":55482.879000000001},{"$f":"AD20+AD21+AD22","v":139700.62880000001},{"$f":"AE20+AE22","v":115149.63948999999},0.82425999423991125,{"$f":"AG20+AG21+AG22","v":53126.923000000003},{"$f":"AH20+AH22","v":122141.05914},{"$f":"AI20+AI22","v":100506.41348999999},0.82287163872386238,{"$f":"AK20","v":2355.9560000000001},{"$f":"AL20","v":17559.569660000001},{"$f":"AM20","v":14643.226000000001},{"$f":"AM19/AL19","v":0.83391713370725051}]
[{"$f":"IF(COUNTBLANK(C20:IV20)=254,\"odstr\",IF(AND($A$1=\"TISK\",SUM(J16:U16)=0),\"odstr\",\"OK\"))","v":{"$error":"#REF!"}},"OK",null,null,5032,null,"Povinné pojistné na veřejné zdravotní pojištění",null,null,4258.2636000000002,14106.904450000002,10474.902030000001,0.74253724955229283,3922.4736000000003,11214.599480000001,8390.1901200000011,0.74814888707911309,335.79,2892.3049700000001,2084.71191,0.72077873240317392,null,null,5021,null,"Ostatní osobní výdaje",null,null,55458.879000000001,139572.62880000001,115043.18343999999,0.82425318222565414,53102.923000000003,122013.05914,100399.95744,0.82286238987581872,2355.9560000000001,17559.569660000001,14643.226000000001,{"$f":"AM20/AL20","v":0.83391713370725051}]
[{"$f":"IF(COUNTBLANK(C21:IV21)=254,\"odstr\",IF(AND($A$1=\"TISK\",SUM(J17:U17)=0),\"odstr\",\"OK\"))","v":{"$error":"#REF!"}},"OK",null,null,5038,null,"Povinné pojistné na úrazové pojištění",null,null,60.839599999999997,274.13200999999998,166.73193999999998,0.60821769774350687,54.419599999999996,202.78903,129.24626999999998,0.63734349930072642,6.42,71.342979999999997,37.485669999999999,0.52542899105139707,null,null,5024,null,"Odstupné",null,null,0,0,0,"x",0,0,0,"x",0,0,0,"x"]
[{"$f":"IF(COUNTBLANK(C22:IV22)=254,\"odstr\",IF(AND($A$1=\"TISK\",SUM(J18:U18)=0),\"odstr\",\"OK\"))","v":{"$error":"#REF!"}},"OK",null,null,5039,null,"Ostatní povinné pojistné placené zaměstnavatelem",null,null,75,2371.34,1824.1207899999999,0.76923629256032444,75,2371.34,1824.1207899999999,0.76923629256032444,0,0,0,"x ",null,null,5029,null,"Ostatní platby za provedenou práci jinde nezařazené",null,null,24,128,106.45605,{"$f":"AE22/AD22","v":0.83168789062500004},24,128,106.45605,{"$f":"AI22/AH22","v":0.83168789062500004},0,0,0,"x"]
[null,null,null,null,5041,null,"Odměny za užití duševního vlastnictví",null,null,116.8,185.40899999999999,147.98599999999999,0.79815974413324053,116.8,185.40899999999999,147.98599999999999,0.79815974413324053,0,0,0,"x ",null,null,503,null,"Povinné pojistné placené zaměstnavatelem",null,null,{"$f":"AC24+AC25+AC26+AC27","v":22002.384999999998},{"$f":"AD24+AD25+AD26+AD27","v":60497.712370000001},{"$f":"SUM(AE24:AE27)","v":49494.022810000002},0.81811395623189576,{"$f":"SUM(AG24:AG27)","v":20168.815999999995},{"$f":"SUM(AH24:AH27)","v":44773.464380000005},{"$f":"SUM(AI24:AI27)","v":37779.047229999996},0.84378208729534077,{"$f":"AK24+AK25+AK26","v":1833.569},{"$f":"SUM(AL24:AL27)","v":15724.24799},{"$f":"AM24+AM25+AM26+AM27","v":11714.97558},{"$f":"AM23/AL23","v":0.74502612700144777}]
[{"$f":"IF(COUNTBLANK(C24:IV24)=254,\"odstr\",IF(AND($A$1=\"TISK\",SUM(J19:U19)=0),\"odstr\",\"OK\"))","v":{"$error":"#REF!"}},"OK",null,null,5042,null,"Odměny za užití počítačových programů",null,null,8563.6749999999993,8112.5909999999994,8101.1538999999993,0.99859020379555674,723.67499999999995,750.02099999999996,738.64589999999998,0.98483362465850954,7840,7362.57,7362.5079999999998,0.99999157902743196,null,null,5031,null,"Povinné pojistné na sociální zabezpečení a příspěvek na státní politiku zaměstnanosti",null,null,16073.563,42242.631650000003,35108.674050000001,0.83111947998154601,14725.677,30835.039690000001,26536.733120000001,0.86060317699561872,1347.886,11407.59196,8571.9409300000007,{"$f":"AM24/AL24","v":0.75142422345197568}]
[{"$f":"IF(COUNTBLANK(C25:IV25)=254,\"odstr\",IF(AND($A$1=\"TISK\",SUM(J20:U20)=0),\"odstr\",\"OK\"))","v":{"$error":"#REF!"}},"OK",null,null,5051,null,"Mzdové náhrady",null,null,0,5.0999999999999996,5.0609999999999999,0.99235294117647066,0,5.0999999999999996,5.0609999999999999,0.99235294117647066,0,0,0,"x ",null,null,5032,null,"Povinné pojistné na veřejné zdravotní pojištění",null,null,5792.5630000000001,15884.89417,12479.82151,0.78564083439531029,5307.08,11686.452509999999,9394.2173999999995,0.80385535233737071,485.483,4198.4416600000004,3085.6041100000002,{"$f":"AM25/AL25","v":0.73494033259950076}]
[{"$f":"IF(COUNTBLANK(C26:IV26)=254,\"odstr\",IF(AND($A$1=\"TISK\",SUM(J21:U21)=0),\"odstr\",\"OK\"))","v":{"$error":"#REF!"}},"OK",null,null,50,null,"Výdaje na platby, ostatních platby za provedenou práci a pojistné",null,null,114934.68176000001,291435.44609000004,233275.30136000001,0.80043558355616351,97364.671759999997,236656.83911000003,190313.12259000001,0.80417334781329064,17570.010000000002,54778.606979999997,42962.178770000006,0.78428753739002088,null,null,5038,null,"Povinné pojistné na úrazové pojištění",null,null,69.959000000000003,341.64654999999999,179.66166000000001,0.5258699670756225,69.759,223.43217999999999,122.23112,0.54706139464780768,0.2,118.21437,57.430540000000001,{"$f":"AM26/AL26","v":0.48581691041452912}]
[{"$f":"IF(COUNTBLANK(C27:IV27)=254,\"odstr\",IF(AND($A$1=\"TISK\",SUM(J22:U22)=0),\"odstr\",\"OK\"))","v":{"$error":"#REF!"}},"OK",null,null,5122,null,"Podlimitní věcná břemena",null,null,0,700.8,0.72599999999999998,1.0359589041095891E-3,0,700.8,0.72599999999999998,1.0359589041095891E-3,0,0,0,"x ",null,null,5039,null,"Ostatní povinné pojistné placené zaměstnavatelem",null,null,66.3,2028.54,1725.8655900000001,0.85079199325623367,66.3,2028.54,1725.8655900000001,0.85079199325623367,0,0,0,"x"]
[null,null,null,null,5131,null,"Potraviny",null,null,9447.1,10367.2585,9646.8488200000011,0.93051107194828808,9447.1,10367.2585,9646.8488200000011,0.93051107194828808,0,0,0,"x ",null,null,504,null,"Odměny za užití duševního vlastnictví",null,null,{"$f":"AC29+AC30","v":9463.0489999999991},{"$f":"AD29+AD30","v":11293.734},{"$f":"AE29+AE30","v":11155.259690000001},0.9877388373057131,{"$f":"AG29+AG30","v":1623.049},{"$f":"SUM(AH29:AH30)","v":1764.6239999999998},{"$f":"AI29+AI30","v":1626.60169},0.92178372843166601,{"$f":"AK30","v":7840},{"$f":"AL29+AL30","v":9529.11},{"$f":"AM29+AM30","v":9528.6579999999994},{"$f":"AM28/AL28","v":0.99995256639917041}]
[{"$f":"IF(COUNTBLANK(C29:IV29)=254,\"odstr\",IF(AND($A$1=\"TISK\",SUM(J23:U23)=0),\"odstr\",\"OK\"))","v":{"$error":"#REF!"}},"OK",null,null,5132,null,"Ochranné pomůcky",null,null,41.34,51.674999999999997,43.607610000000001,0.84388214804063866,41.34,51.674999999999997,43.607610000000001,0.84388214804063866,0,0,0,"x ",null,null,5041,null,"Odměny za užití duševního vlastnictví",null,null,538.99900000000002,2860.6529999999998,2751.1761999999999,0.96173013644087557,538.99900000000002,343.54300000000001,234.0752,0.681356336761337,0,2517.11,2517.1010000000001,{"$f":"AM29/AL29","v":0.99999642447092096}]
[{"$f":"IF(COUNTBLANK(C30:IV30)=254,\"odstr\",IF(AND($A$1=\"TISK\",SUM(J24:U24)=0),\"odstr\",\"OK\"))","v":{"$error":"#REF!"}},"OK",null,null,5133,null,"Léky a zdravotnický materiál",null,null,7.5,50.954999999999998,20.744,0.40710430772250028,7.5,50.954999999999998,20.744,0.40710430772250028,0,0,0,"x ",null,null,5042,null,"Odměny za užití počítačových programů",null,null,8924.0499999999993,8433.0810000000001,8404.0834900000009,0.99656145719458888,1084.05,1421.0809999999999,1392.52649,0.97990648668161773,7840,7012,7011.5569999999998,{"$f":"AM30/AL30","v":0.99993682258984595}]
[null,null,null,null,5134,null,"Prádlo, oděv a obuv",null,null,49.5,234.99799999999999,191.06700000000001,0.81305798347219982,49.5,234.99799999999999,191.06700000000001,0.81305798347219982,0,0,0,"x ",null,null,505,null,"Mzdové náhrady",null,null,{"$f":"AC32","v":0},{"$f":"AD32","v":0},0,"x",0,null,0,"x",0,0,0,"x"]
[{"$f":"IF(COUNTBLANK(C32:IV32)=254,\"odstr\",IF(AND($A$1=\"TISK\",SUM(J25:U25)=0),\"odstr\",\"OK\"))","v":{"$error":"#REF!"}},"OK",null,null,5135,null,"Učebnice a bezplatně poskytované školní potřeby",null,null,114,81.67,9.7029999999999994,0.11880739561650544,114,81.67,9.7029999999999994,0.11880739561650544,0,0,0,"x ",null,null,5051,null,"Mzdové náhrady",null,null,0,0,0,"x",0,0,0,"x",0,0,0,"x"]
[{"$f":"IF(COUNTBLANK(C33:IV33)=254,\"odstr\",IF(AND($A$1=\"TISK\",SUM(J26:U26)=0),\"odstr\",\"OK\"))","v":{"$error":"#REF!"}},"OK",null,null,5136,null,"Knihy, učební pomůcky a tisk",null,null,1236.56,2238.0027700000001,1817.7349100000001,0.81221298488383908,1230.56,2220.8367699999999,1812.2689100000002,0.81602976611378797,6,17.166,5.4660000000000002,0.31842013282069209,null,null,51,"Neinvestiční nákupy a související výdaje","Neinvestiční nákupy a související výdaje",null,null,{"$f":"AC34+AC37+AC47+AC53+AC62+AC72+AC81+AC85","v":3009383.0209599999},{"$f":"AD34+AD37+AD47+AD53+AD62+AD72+AD81+AD85","v":4632584.8287600009},{"$f":"AE34+AE37+AE47+AE53+AE62+AE72+AE81+AE85","v":3422039.68199},{"$f":"AE33/AD33","v":0.73868904909097455},{"$f":"AG34+AG37+AG47+AG53+AG62+AG72+AG81+AG85","v":2664387.6579600004},{"$f":"AH34+AH37+AH47+AH53+AH62+AH72+AH81+AH85","v":3961622.6829599994},{"$f":"AI34+AI37+AI47+AI53+AI62+AI72+AI81+AI85","v":3008595.9809599994},{"$f":"AI33/AH33","v":0.75943526724561039},{"$f":"AK34+AK37+AK47+AK53+AK62+AK72+AK81+AK85","v":344995.36300000001},{"$f":"AL34+AL37+AL47+AL53+AL62+AL72+AL81+AL85","v":679051.35659999994},{"$f":"AM34+AM37+AM47+AM53+AM62+AM72+AM81+AM85","v":413443.70103},{"$f":"AM33/AL33","v":0.60885483404393226}]
[null,null,null,null,5137,null,"Drobný hmotný dlouhodobý majetek",null,null,51554.656999999999,239163.34194000001,198307.55158999996,0.82917202101879928,51473.656999999999,226480.41275000002,187477.94597999996,0.82778878625122931,81,12682.929189999999,10829.605609999999,0.85387259108398439,null,null,512,"Výdaje na některé úpravy hmotných věcí a pořízení některých práv k hmotným věcem",null,null,null,{"$f":"AC35","v":110},{"$f":"AD35+AD36","v":259.39999999999998},{"$f":"AE35+AE36","v":4086.3594600000001},{"$f":"AE34/AD34","v":15.753120508866617},{"$f":"AG35","v":110},{"$f":"AH35+AH36","v":4136.6054000000004},{"$f":"AI35+AI36","v":3936.71207},{"$f":"AI34/AH34","v":0.95167696440177729},0,{"$f":"SUM(AL35:AL36)","v":4212.0054},{"$f":"AM36","v":149.64739},{"$f":"AM34/AL34","v":3.5528774488275822E-2}]
[{"$f":"IF(COUNTBLANK(C35:IV35)=254,\"odstr\",IF(AND($A$1=\"TISK\",SUM(J27:U27)=0),\"odstr\",\"OK\"))","v":{"$error":"#REF!"}},"OK",null,null,5138,null,"Nákup zboží (za účelem dalšího prodeje)",null,null,420,5,0.83871000000000007,0.167742,420,5,0.83871000000000007,0.167742,0,0,0,"x ",null,null,5122,null,"Podlimitní věcná břemena",null,null,110,92,0,"x",110,92,0,"x",0,0,null,"x"]
[null,null,null,null,null,null,null,null,null,null,null,null,null,null,null,null,null,null,null,null,null,null,null,5123,null,"Podlimitní technické zhodnocení",null,null,null,167.4,4086.3594600000001,{"$f":"AE36/AD36","v":24.41074946236559},null,4044.6053999999999,3936.71207,{"$f":"AI36/AH36","v":0.97332413935856388},null,4212.0054,149.64739,{"$f":"AM36/AL36","v":3.5528774488275822E-2}]
[null,null,null,null,5139,null,"Nákup materiálu jinde nezařazený",null,null,38598.438999999998,64483.157090000008,49673.814870000002,0.77033782326553257,34695.438999999998,57757.048080000008,43818.064160000002,0.75866176711986832,3903,6726.109010000001,5855.7507100000003,0.87060003061116009,null,null,513,null,"Nákupy materiálu",null,null,{"$f":"SUM(AC38:AC46)","v":344565.989},{"$f":"SUM(AD38:AD46)","v":996828.86114000005},{"$f":"SUM(AE38:AE46)","v":747571.70173000009},0.74994989699140246,{"$f":"SUM(AG38:AG46)","v":278055.78899999999},{"$f":"SUM(AH38:AH46)","v":713434.84184000001},{"$f":"SUM(AI38:AI46)","v":584076.65660999995},0.81868255144874069,{"$f":"AK43+AK44+AK46","v":66510.2},{"$f":"SUM(AL38:AL46)","v":283394.01929999999},{"$f":"SUM(AM38:AM46)","v":163495.04512},{"$f":"AM37/AL37","v":0.57691776814430462}]
[{"$f":"IF(COUNTBLANK(C38:IV38)=254,\"odstr\",IF(AND($A$1=\"TISK\",SUM(J28:U28)=0),\"odstr\",\"OK\"))","v":{"$error":"#REF!"}},"OK",null,null,5141,null,"Úroky vlastní",null,null,16843.965199999999,17338.01629,14494.258480000004,0.8359813624330148,16843.965199999999,17338.01629,14494.258480000004,0.8359813624330148,0,0,0,"x ",null,null,5131,null,"Potraviny",null,null,13716.2,10788.71,9911.5167399999991,0.91869340634793228,13716.2,10788.71,9911.5167399999991,0.91869340634793228,0,0,0,"x"]
[{"$error":"#REF!"},"OK",null,null,5142,null,"Realizované kurzové ztráty",null,null,2,12.815,6.6924399999999995,0.52223488099882953,2,12.815,6.6924399999999995,0.52223488099882953,0,0,0,"x ",null,null,5132,null,"Ochranné pomůcky",null,null,109.8,78.725999999999999,64.305499999999995,0.81682671544343666,109.8,78.725999999999999,64.305499999999995,0.81682671544343666,0,0,0,"x"]
[{"$error":"#REF!"},"OK",null,null,5143,null,"Úroky vzniklé převzetím cizích závazků",null,null,0,40.299999999999997,40.238999999999997,0.99848635235732008,0,40.299999999999997,40.238999999999997,0.99848635235732008,0,0,0,"x ",null,null,5133,null,"Léky a zdravotnický materiál",null,null,151.999,95.801000000000002,79.321929999999995,0.82798645108088631,151.999,94.063999999999993,77.58493,0.82481002296308903,0,1.7370000000000001,1.7370000000000001,{"$f":"AM40/AL40","v":1}]
[{"$error":"#REF!"},"OK",null,null,5144,null,"Poplatky dluhové služby",null,null,3.6,0,0,"x ",3.6,0,0,"x ",0,0,0,"x ",null,null,5134,null,"Prádlo, oděv a obuv",null,null,94.04,105.342,89.176900000000003,0.84654648668147559,94.04,105.342,89.176900000000003,0.84654648668147559,0,0,0,"x"]
[{"$error":"#REF!"},"OK",null,null,5149,null,"Ostatní úroky a ostatní finanční výdaje",null,null,0,312.89999999999998,312.803,0.99968999680409087,0,312.89999999999998,312.803,0.99968999680409087,0,0,0,"x ",null,null,5135,null,"Učebnice a bezplatně poskytované školní potřeby",null,null,5,9,8.2840000000000007,0.92044444444444451,5,9,8.2840000000000007,0.92044444444444451,0,0,0,"x"]
[{"$error":"#REF!"},"OK",null,null,5151,null,"Studená voda",null,null,8776.7199999999993,9562.0551699999996,7732.8768999999993,0.80870448481212853,8776.7199999999993,9562.0551699999996,7732.8768999999993,0.80870448481212853,0,0,0,"x ",null,null,5136,null,"Knihy, učební pomůcky a tisk",null,null,1155.269,4735.2511000000004,4434.2555199999997,0.93643513857163763,1149.269,4625.9480999999996,4387.9325200000003,0.94854771933130866,6,109.303,46.323,{"$f":"AM43/AL43","v":0.42380355525465907}]
[{"$error":"#REF!"},"OK",null,null,5152,null,"Teplo",null,null,52953.62,52772.050759999998,48187.882230000003,0.91313264381465553,52953.62,52726.460760000002,48164.282230000004,0.91347459199345671,0,45.59,23.6,0.51765738100460623,null,null,5137,null,"Drobný hmotný dlouhodobý majetek",null,null,250772.39300000001,825458.41592000006,645698.76604000002,0.78223052014116046,189007.39300000001,580739.60013000004,492373.39395,0.84783850427933782,61765,244718.81578999999,153325.37208999999,{"$f":"AM44/AL44","v":0.62653691582739901}]
[{"$error":"#REF!"},"OK",null,null,5153,null,"Plyn",null,null,36809.315999999999,38752.739170000001,30882.571179999999,0.79691324642949102,36809.315999999999,38752.739170000001,30882.571179999999,0.79691324642949102,0,0,0,"x ",null,null,5138,null,"Nákup zboží (za účelem dalšího prodeje)",null,null,505,138.453,125.31229999999999,0.90508909160509332,505,138.453,125.31229999999999,0.90508909160509332,0,0,0,"x"]
[{"$f":"IF(COUNTBLANK(C46:IV46)=254,\"odstr\",IF(AND($A$1=\"TISK\",SUM(J37:U37)=0),\"odstr\",\"OK\"))","v":{"$error":"#REF!"}},"OK",null,null,5154,null,"Elektrická energie",null,null,40931.839999999997,43760.854260000007,37093.955069999996,0.84765153005493432,40931.839999999997,43742.979260000007,37079.892069999994,0.84767642024572942,0,17.875,14.063000000000001,0.78674125874125878,null,null,5139,null,"Nákup materiálu jinde nezařazený",null,null,78056.288,155419.16211999999,87160.762799999997,0.56081091682055706,73317.088000000003,116854.99861,77039.149770000004,0.65927132503005559,4739.2,38564.163509999998,10121.61303,{"$f":"AM46/AL46","v":0.26246162521781097}]
[null,null,null,null,5155,null,"Pevná paliva",null,null,2670,3278.0126199999995,3018.5150599999997,0.92083692466077205,2670,3278.0126199999995,3018.5150599999997,0.92083692466077205,0,0,0,"x ",null,null,514,null,"Úroky a ostatní finanční výdaje",null,null,{"$f":"SUM(AC48:AC52)","v":17019.978649999997},{"$f":"SUM(AD48:AD52)","v":18445.95047},{"$f":"SUM(AE48:AE52)","v":15971.07806},0.86583112569747678,{"$f":"SUM(AG48:AG52)","v":17019.978649999997},{"$f":"SUM(AH48:AH52)","v":18445.95047},{"$f":"SUM(AI48:AI52)","v":15971.07806},0.86583112569747678,0,{"$f":"SUM(AL48:AL52)","v":0},0,"x"]
[{"$f":"IF(COUNTBLANK(C48:IV48)=254,\"odstr\",IF(AND($A$1=\"TISK\",SUM(J38:U38)=0),\"odstr\",\"OK\"))","v":{"$error":"#REF!"}},"OK",null,null,5156,null,"Pohonné hmoty a maziva",null,null,1878.5,1509.8193500000002,1347.1448899999998,0.89225567946257911,1868.5,1499.4193500000001,1346.7468899999999,0.89817894506963636,10,10.4,0.39800000000000002,3.8269230769230771E-2,null,null,5141,null,"Úroky vlastní",null,null,15907.978649999999,18430.829470000001,15944.47572,0.86509810890242045,15907.978649999999,18430.829470000001,15944.47572,0.86509810890242045,0,0,0,"x"]
[{"$f":"IF(COUNTBLANK(C49:IV49)=254,\"odstr\",IF(AND($A$1=\"TISK\",SUM(J39:U39)=0),\"odstr\",\"OK\"))","v":{"$error":"#REF!"}},null,null,null,5157,null,"Teplá voda",null,null,324,234.67099999999999,106.70622,0.45470560912937691,324,225.6,106.70622,0.47298856382978727,0,9.0709999999999997,0,0,null,null,5142,null,"Realizované kurzové ztráty",null,null,2,4,1.5949599999999999,0.39873999999999998,2,4,1.5949599999999999,0.39873999999999998,0,0,0,"x"]
[{"$f":"IF(COUNTBLANK(C50:IV50)=254,\"odstr\",IF(AND($A$1=\"TISK\",SUM(J40:U40)=0),\"odstr\",\"OK\"))","v":{"$error":"#REF!"}},"OK",null,null,5159,null,"Nákup ostatních paliv a energie",null,null,1963,2114.7397800000003,2095.4197199999999,0.99086409581797319,1963,2114.7397800000003,2095.4197199999999,0.99086409581797319,0,0,0,"x ",null,null,5143,null,"Úroky vzniklé převzetím cizích závazků",null,null,0,0,0,"x",0,0,0,"x",0,0,0,"x"]
[{"$f":"IF(COUNTBLANK(C51:IV51)=254,\"odstr\",IF(AND($A$1=\"TISK\",SUM(J41:U41)=0),\"odstr\",\"OK\"))","v":{"$error":"#REF!"}},"OK",null,null,5161,null,"Služby pošt",null,null,26.4,40.563780000000001,17.589380000000002,0.4336228033975138,26.4,40.563780000000001,17.589380000000002,0.4336228033975138,0,0,0,"x ",null,null,5144,null,"Poplatky dluhové služby",null,null,10,11.121,25.007300000000001,{"$f":"AE51/AD51","v":2.2486556964301769},10,11.121,25.007300000000001,{"$f":"AI51/AH51","v":2.2486556964301769},0,0,0,"x"]
[{"$f":"IF(COUNTBLANK(C52:IV52)=254,\"odstr\",IF(AND($A$1=\"TISK\",SUM(J42:U42)=0),\"odstr\",\"OK\"))","v":{"$error":"#REF!"}},"OK",null,null,5162,null,"Služby telekomunikací a radiokomunikací",null,null,4325.6705000000002,4683.2985499999986,4249.3283500000007,0.90733663562832267,4281.6705000000002,4579.1827599999988,4189.6877400000003,0.91494224178988681,44,104.11578999999999,59.640610000000002,0.57282963515908591,null,null,5149,null,"Ostatní úroky a ostatní finanční výdaje",null,null,1100,0,8.0000000000000007E-5,"x",1100,0,8.0000000000000007E-5,"x",0,0,0,"x"]
[null,null,null,null,5163,null,"Služby peněžních ústavů",null,null,21175.001,21158.488109999998,18575.350610000005,0.87791483556997907,21174.001,21145.488109999998,18574.361610000004,0.87840779618683418,1,13,0.98899999999999999,7.607692307692307E-2,null,null,515,null,"Nákup vody, paliv a energie",null,null,{"$f":"SUM(AC54:AC61)","v":149542.40099999998},{"$f":"SUM(AD54:AD61)","v":159386.07955999995},{"$f":"SUM(AE54:AE61)","v":132533.01952},{"$f":"AE53/AD53","v":0.83152192390872326},{"$f":"SUM(AG54:AG61)","v":149522.40099999998},{"$f":"SUM(AH54:AH61)","v":159362.14955999996},{"$f":"SUM(AI54:AI61)","v":132519.28438},{"$f":"AI53/AH53","v":0.83156059795808912},{"$f":"AK59","v":20},{"$f":"SUM(AL54:AL61)","v":23.93},{"$f":"SUM(AM54:AM61)","v":13.735140000000001},{"$f":"AM53/AL53","v":0.57397158378604263}]
[{"$f":"IF(COUNTBLANK(C54:IV54)=254,\"odstr\",IF(AND($A$1=\"TISK\",SUM(J43:U43)=0),\"odstr\",\"OK\"))","v":{"$error":"#REF!"}},"OK",null,null,5164,null,"Nájemné",null,null,22234.289000000001,37131.167479999996,33769.24598,0.90945823338814136,20998.289000000001,35425.071479999999,32577.568310000002,0.91961898590359603,1236,1706.096,1191.67767,0.69848218974782195,null,null,5151,null,"Studená voda",null,null,9866.5540000000001,11598.693600000001,9190.6268099999998,0.79238465356132859,9866.5540000000001,11598.693600000001,9190.6268099999998,0.79238465356132859,0,0,0,"x"]
[{"$error":"#REF!"},"OK",null,null,5165,null,"Nájemné za půdu",null,null,1.68,3.28,3.28,1,1.68,3.28,3.28,1,0,0,0,"x ",null,null,5152,null,"Teplo",null,null,52542.9,53921.348189999997,45843.750240000001,0.85019666196888544,52542.9,53907.418189999997,45831.371639999998,0.85018673085890561,0,13.93,12.3786,{"$f":"AM55/AL55","v":0.88862885857860741}]
[{"$error":"#REF!"},"OK",null,null,5166,null,"Konzultační, poradenské a právní služby",null,null,14592.45,31045.535100000005,21375.902369999996,0.68853386811168193,13779.45,28600.689100000003,19787.938369999996,0.69186928681379201,813,2444.846,1587.9639999999999,0.64951493877323963,null,null,5153,null,"Plyn",null,null,36300.379999999997,36121.13003,28489.330890000001,0.78871648994199539,36300.379999999997,36121.13003,28489.330890000001,0.78871648994199539,0,0,0,"x"]
[{"$error":"#REF!"},"OK",null,null,5167,null,"Služby školení a vzdělávání",null,null,4207.7,12270.259639999998,6665.255799999999,0.54320413712125815,3618.7,10741.392099999999,6311.3283999999994,0.58757080471906431,589,1528.86754,353.92740000000003,0.23149644474759407,null,null,5154,null,"Elektrická energie",null,null,43403.267,50427.898029999997,42463.089590000003,0.84205551388912425,43403.267,50427.898029999997,42463.089590000003,0.84205551388912425,0,0,0,"x"]
[{"$error":"#REF!"},"OK",null,null,5168,null,"Služby zpracování dat",null,null,1615.693,9513.6517100000001,7323.9343099999996,0.76983418494306011,678.69299999999998,3021.3747100000001,922.50274999999999,0.30532550197985869,937,6492.277,6401.43156,0.98600715280632667,null,null,5155,null,"Pevná paliva",null,null,2774.5,3154.0171099999998,2767.5833899999998,0.87747887645416101,2774.5,3154.0171099999998,2767.5833899999998,0.87747887645416101,0,0,0,"x"]
[{"$error":"#REF!"},"OK",null,null,5169,null,"Nákup ostatních služeb",null,null,357760.88189999992,407396.54836000002,277064.5166899999,0.68008557707555506,281160.33589999995,345163.10687000002,245465.23377999989,0.71115721493505479,76600.546000000002,62233.441489999997,31599.282910000005,0.50775406523320021,null,null,5156,null,"Pohonné hmoty a maziva",null,null,2090.3000000000002,1887.8233499999999,1638.01854,0.86767574942856818,2070.3000000000002,1877.8233499999999,1636.662,0.87157399549856496,20,10,1.3565400000000001,{"$f":"AM59/AL59","v":0.135654}]
[{"$error":"#REF!"},"OK",null,null,5171,null,"Opravy a udržování",null,null,1485366.7723599998,2054490.1498099996,1584318.3121500001,0.77114913999296553,1263408.7723599998,1737233.8511899996,1391455.5072000001,0.8009603924347074,221958,317256.29861999996,192862.80495000002,0.60790851368093812,null,null,5157,null,"Teplá voda",null,null,50,54,46.599159999999998,0.86294740740740739,50,54,46.599159999999998,0.86294740740740739,0,0,0,"x"]
[{"$error":"#REF!"},"OK",null,null,5172,null,"Programové vybavení",null,null,439.5,2981.7409699999998,2449.2169699999995,0.82140500957063334,439.5,2060.84357,1634.7083799999998,0.79322293249069842,0,920.89740000000006,814.50858999999991,0.88447267849816913,null,null,5159,null,"Nákup ostatních paliv a energie",null,null,2514.5,2221.1692499999999,2094.0209,0.94275611820215865,2514.5,2221.1692499999999,2094.0209,0.94275611820215865,0,0,0,"x"]
[null,null,null,null,5173,null,"Cestovné (tuzemské i zahraniční)",null,null,1816.2080000000001,3607.1796299999996,2714.4844199999998,0.75252266269866908,1644.2080000000001,2391.1956299999997,1865.7224099999999,0.7802466626287704,172,1215.9839999999999,848.76201000000003,0.69800425827971424,null,null,516,null,"Nákup služeb",null,null,{"$f":"SUM(AC63:AC71)","v":623565.83043999993},{"$f":"SUM(AD63:AD71)","v":1000892.32522},{"$f":"SUM(AE63:AE71)","v":593146.24629000004},0.59261743880354378,{"$f":"SUM(AG63:AG71)","v":533625.9834400001},{"$f":"SUM(AH63:AH71)","v":905921.67151999997},{"$f":"SUM(AI63:AI71)","v":539955.36338999995},0.59602875211499939,{"$f":"SUM(AK63:AK71)","v":89939.846999999994},{"$f":"SUM(AL63:AL71)","v":94970.653699999995},{"$f":"SUM(AM63:AM71)","v":53190.882899999997},{"$f":"AM62/AL62","v":0.56007704304134953}]
[{"$f":"IF(COUNTBLANK(C63:IV63)=254,\"odstr\",IF(AND($A$1=\"TISK\",SUM(J51:U51)=0),\"odstr\",\"OK\"))","v":{"$error":"#REF!"}},"OK",null,null,5175,null,"Pohoštění",null,null,4841.4430000000002,10504.10599,7265.5816200000008,0.69168967134536696,3647.5970000000002,7751.9063299999989,5623.1122900000009,0.72538444746661457,1193.846,2752.1996600000002,1642.4693300000001,0.59678422095292316,null,null,5161,null,"Služby pošt",null,null,20.309000000000001,40.633000000000003,6.4240000000000004,0.15809809760539462,20.309000000000001,37.633000000000003,6.218,0.16522732707995641,0,3,0.20599999999999999,{"$f":"AM63/AL63","v":6.8666666666666668E-2}]
[{"$error":"#REF!"},"OK",null,null,5176,null,"Účastnické poplatky na konference",null,null,28.390999999999998,520.81799999999998,253.417,0.48657496476696277,28.390999999999998,9.2309999999999999,7.8250000000000002,0.84768714115480448,0,511.58699999999999,245.59200000000001,0.4800591101806731,null,null,5162,null,"Služby telekomunikací a radiokomunikací",null,null,4573.54,4971.7580799999996,4502.4645200000004,0.90560812645172006,4540.54,4836.73416,4415.1162199999999,0.912830036538539,33,135.02392,87.348299999999995,{"$f":"AM64/AL64","v":0.64690982160790467}]
[{"$error":"#REF!"},"OK",null,null,5177,null,"Nákup uměleckých předmětů",null,null,0,0,0,"x ",0,0,0,"x ",0,0,0,"x ",null,null,5163,null,"Služby peněžních ústavů",null,null,21045.656999999999,22199.93131,19214.754509999999,0.86553216051369841,21044.656999999999,22190.234469999999,19211.902340000001,0.8657818539940827,1,9.6968399999999999,2.8521700000000001,{"$f":"AM65/AL65","v":0.29413396529178581}]
[{"$error":"#REF!"},"OK",null,null,5178,null,"Nájemné za nájem s právem koupě",null,null,699.41600000000005,4464.2020000000002,2985.2240000000002,0.66870271551332128,0,0,0,"x ",699.41600000000005,4464.2020000000002,2985.2240000000002,0.66870271551332128,null,null,5164,null,"Nájemné",null,null,33502.730000000003,49280.59403,44788.725579999998,0.90885117076174982,32007.73,46543.876900000003,42657.232129999997,0.91649503589160608,1495,2736.71713,2131.4934499999999,{"$f":"AM66/AL66","v":0.77885047988134604}]
[{"$error":"#REF!"},"OK",null,null,5179,null,"Ostatní nákupy jinde nezařazené",null,null,789.01,2239.38,1800.69175,0.80410280970625791,779.01,1026.8800000000001,709.19174999999996,0.69062767801495784,10,1212.5,1091.5,0.90020618556701026,null,null,5165,null,"Nájemné za půdu",null,null,242.91300000000001,249.864,26.103339999999999,0.10447019178433067,242.91300000000001,249.864,26.103339999999999,0.10447019178433067,0,0,0,"x"]
[{"$error":"#REF!"},"OK",null,null,5182,null,"Poskytované zálohy vlastní pokladně",null,null,0,0,0,"x ",0,0,0,"x ",0,0,0,"x ",null,null,5166,null,"Konzultační, poradenské a právní služby",null,null,12244.550999999999,31048.90667,19933.410179999999,0.64200038963884065,11932.550999999999,23115.913250000001,15913.25369,0.68841120477902806,312,7932.9934199999998,4020.1564899999998,{"$f":"AM68/AL68","v":0.50676412763241641}]
[{"$error":"#REF!"},"OK",null,null,5183,null,"Výdaje na realizaci záruk",null,null,0,0,0,"x ",0,0,0,"x ",0,0,0,"x ",null,null,5167,null,"Služby školení a vzdělávání",null,null,3556.076,13857.92229,10221.66185,0.73760421195145842,3236.3,10601.702139999999,8150.1704,0.76876055301059421,319.77600000000001,3256.2201500000001,2071.49145,0.63616443439796289]
[{"$error":"#REF!"},"OK",null,null,5189,null,"Ostatní poskytované zálohy a jistiny",null,null,20,115,115,1,0,115,115,1,20,0,0,"x ",null,null,5168,null,"Služby zpracování dat",null,null,3658.873,15686.6155,11578.177009999999,0.73809273963526423,1878.873,5644.3389999999999,4346.85167,0.77012590313941098,1780,10042.2765,7231.3253400000003,0.72008825289763734]
[{"$error":"#REF!"},"OK",null,null,5191,null,"Zaplacené sankce",null,null,4.6020000000000003,837.44219999999996,766.50443999999993,0.91529235092284578,4.6020000000000003,814.702,743.76423999999997,0.91292796629933393,0,22.740200000000002,22.740200000000002,1,null,null,5169,null,"Nákup ostatních služeb",null,null,544721.18143999996,863556.10034,482874.52529999998,0.55916983865886916,458722.11044000002,792701.37459999998,445228.51559999998,0.56165982533417946,85999.070999999996,70854.725739999994,37646.009700000002,0.53131261615691361]
[null,null,null,null,5192,null,"Poskytnuté neinvestiční příspěvky a náhrady (část)",null,null,5456.3620000000001,6288.9359599999998,5952.9200899999996,0.94657031457512242,5456.3620000000001,6284.9359599999998,5948.9200899999996,0.94653630965557201,0,4,4,1,null,null,517,null,"Ostatní nákupy",null,null,{"$f":"SUM(AC73:AC80)","v":1831489.0908700002},{"$f":"SUM(AD73:AD80)","v":2420493.1495300005},{"$f":"SUM(AE73:AE80)","v":1903938.5333900002},0.78659116790299433,{"$f":"SUM(AG73:AG80)","v":1666424.7748700001},{"$f":"SUM(AH73:AH80)","v":2132120.7017599996},{"$f":"SUM(AI73:AI80)","v":1708729.5288000002},0.80142251205079373,{"$f":"SUM(AK73:AK80)","v":165064.31599999999},{"$f":"SUM(AL73:AL80)","v":288372.44776999991},{"$f":"SUM(AM73:AM80)","v":195209.00459000003},0.67693361865726787]
[{"$f":"IF(COUNTBLANK(C73:IV73)=254,\"odstr\",IF(AND($A$1=\"TISK\",SUM(J60:U60)=0),\"odstr\",\"OK\"))","v":{"$error":"#REF!"}},"OK",null,null,5193,null,"Výdaje na dopravní územní obslužnost",null,null,0,3,0,0,0,3,0,0,0,0,0,"x ",null,null,5171,null,"Opravy a udržování",null,null,1814876.9528000001,2371078.33421,1868968.7226400001,0.7882357557211227,1654490.9528000001,2097632.4950799998,1681228.46022,0.80148856587763773,160386,273445.83912999998,187740.26242000001,0.68657202105293569]
[{"$error":"#REF!"},"OK",null,null,5194,null,"Věcné dary",null,null,9145.7999999999993,12830.41102,11042.352259999998,0.86063901170330537,7360.8,10123.36102,8867.4227499999979,0.87593663136988442,1785,2707.05,2174.9295099999999,0.80343159897305172,null,null,5172,null,"Programové vybavení",null,null,1356.799,21310.872940000001,16638.95966,0.78077325630190719,1356.799,16116.2438,14142.169089999999,0.87751024776629394,0,5194.62914,2496.7905700000001,0.4806484741661462]
[{"$error":"#REF!"},"OK",null,null,5197,null,"Náhrady zvýšených nákladů spojených s výkonem funkce v zahraničí",null,null,0,0,0,"x ",0,0,0,"x ",0,0,0,"x ",null,null,5173,null,"Cestovné (tuzemské i zahraniční)",null,null,1456.55,5093.7787500000004,3153.24026,0.61903753868383071,1117.55,2578.9962500000001,1948.54441,0.75554371589334413,339,2514.7824999999998,1204.6958500000001,0.47904574252445298]
[{"$error":"#REF!"},"OK",null,null,5199,null,"Ostatní výdaje související s neinvestičními nákupy",null,null,20322,4132.0462100000004,10.667,2.5815296968811001E-3,42,12.6,10.667,0.84658730158730156,20280,4119.4462100000001,0,0,null,null,5175,null,"Pohoštění",null,null,9532.9190699999999,18123.54463,12405.283729999999,0.68448440872131966,8013.0730700000004,13894.715630000001,9866.4019800000005,0.71008304471503603,1519.846,4228.8289999999997,2538.88175,0.60037465454384653]
[{"$error":"#REF!"},null,null,null,51,null,"Neinvestiční nákupy a související výdaje",null,null,2219494.9269600003,3113323.0362200001,2393750.4758900004,0.76887314552374264,1889156.1189600001,2684104.34711,2133134.1488300003,0.79472847288026105,330338.80800000002,429218.68910999992,260616.32706000001,0.60718774292050781,null,null,5176,null,"Účastnické poplatky na konference",null,null,47,103.098,34.884,0.33835767910143749,2,12.7,19.010000000000002,1.4968503937007875,45,90.397999999999996,15.874000000000001,0.17560123011571055]
[{"$error":"#REF!"},"OK",null,null,5211,null,"Neinvestiční transfery finančním institucím",null,null,0,0,0,"x ",0,0,0,"x ",0,0,0,"x ",null,null,5177,null,"Nákup uměleckých předmětů",null,null,0,0,0,"x",0,0,0,"x",0,0,0,"x"]
[{"$error":"#REF!"},"OK",null,null,5212,null,"Neinvestiční transfery nefinančním podnikatelským subjektům-fyzickým osobám",null,null,37899.311000000002,156800.57973,156571.24621000001,0.99853741918304839,1096.5,6159.8,5999.0479999999998,0.97390304880028566,36802.811000000002,150640.77973000001,150572.19821,0.99954473469851302,null,null,5178,null,"Nájemné za nájem s právem koupě",null,null,1564.47,1577.9469999999999,13.477,{"$f":"AE79/AD79","v":8.5408445277312863E-3},0,13.477,13.477,{"$f":"AI79/AH79","v":1},1564.47,1564.47,0,"x"]
[{"$error":"#REF!"},"OK",null,null,5213,null,"Neinvestiční transfery nefinančním podnikatelským subjektům-právnickým osobám",null,null,823119.79500000004,3962468.8395699998,3957840.0461999997,0.9988318410674234,13379.5,1209935.80048,1206016.24251,0.99676052401421211,809740.29500000004,2752533.0390900001,2751823.8036899995,0.99974233355606335,null,null,5179,null,"Ostatní nákupy jinde nezařazené",null,null,2654.4,3205.5740000000001,2723.9661000000001,{"$f":"AE80/AD80","v":0.84975923188795521},1444.4,1872.0740000000001,1511.4661000000001,{"$f":"AI80/AH80","v":0.80737518922863094},1210,1333.5,1212.5,{"$f":"AM80/AL80","v":0.90926134233220846}]
[null,null,null,null,5215,null,"Neinvestiční transfery vybraným podnikatelským subjektům ve vlastnictví státu",null,null,85,70,0,0,85,70,0,0,0,0,0,"x ",null,null,518,null,"Poskytnuté zálohy, jistiny, záruky a vládní úvěry",null,null,{"$f":"SUM(AC82:AC84)","v":0},{"$f":"SUM(AD82:AD84)","v":4942.6899999999996},{"$f":"AE84","v":4872.6935999999996},{"$f":"AE81/AD81","v":0.98583839973779464},0,{"$f":"SUM(AH82:AH84)","v":4937.6899999999996},{"$f":"AI84","v":4872.6935999999996},{"$f":"AI81/AH81","v":0.98683667868983271},0,{"$f":"SUM(AL82:AL84)","v":5},0,"x"]
[{"$f":"IF(COUNTBLANK(C82:IV82)=254,\"odstr\",IF(AND($A$1=\"TISK\",SUM(J68:U68)=0),\"odstr\",\"OK\"))","v":{"$error":"#REF!"}},"OK",null,null,5219,null,"Ostatní neinvestiční transfery podnikatelským subjektům",null,null,40,61,61.02,1.0003278688524591,40,61,61.02,1.0003278688524591,0,0,0,"x ",null,null,5182,null,"Poskytované zálohy vlastní pokladně",null,null,null,null,null,"x",null,null,null,"x",null,null,null,"x"]
[{"$f":"IF(COUNTBLANK(C83:IV83)=254,\"odstr\",IF(AND($A$1=\"TISK\",SUM(J69:U69)=0),\"odstr\",\"OK\"))","v":{"$error":"#REF!"}},"OK",null,null,5221,null,"Neinvestiční transfery obecně prospěšným společnostem",null,null,287431.451,1040458.8377500001,1029632.3613800001,0.98959451736369286,16847.2,275650.59600000002,265280.61041999998,0.96237996314725893,270584.25099999999,764808.24175000004,764351.75096000009,0.9994031303991241,null,null,5183,null,"Výdaje na realizaci záruk",null,null,null,null,null,"x",null,null,null,"x",null,null,null,"x"]
[{"$f":"IF(COUNTBLANK(C84:IV84)=254,\"odstr\",IF(AND($A$1=\"TISK\",SUM(J70:U70)=0),\"odstr\",\"OK\"))","v":{"$error":"#REF!"}},"OK",null,null,5222,null,"Neinvestiční transfery občanským sdružením",null,null,85512.027000000002,189283.37286999999,186740.74631000002,0.98656708974778118,36657.97,61071.0484,59999.905850000003,0.9824607145601254,48854.057000000001,128212.32446999999,126740.84046000001,0.98852306893207997,null,null,5189,null,"Ostatní poskytované zálohy a jistiny",null,null,0,4942.6899999999996,4872.6935999999996,{"$f":"AE84/AD84","v":0.98583839973779464},0,4937.6899999999996,4872.6935999999996,{"$f":"AI84/AH84","v":0.98683667868983271},0,5,0,"x"]
[null,null,null,null,5223,null,"Neinvestiční transfery církvím a náboženským společnostem",null,null,835,8674.2883000000002,8132.8035500000005,0.93757588734974373,835,7410.3489500000005,6868.8720000000003,0.92692962859731454,0,1263.9393500000001,1263.93155,0.99999382881781462,null,null,519,null,"Výdaje související s neinvestičními nákupy, příspěvky, náhrady a věcné dary",null,null,{"$f":"SUM(AC86:AC91)","v":43089.731},{"$f":"SUM(AD86:AD91)","v":31336.37284},{"$f":"SUM(AE86:AE91)","v":19920.049939999997},{"$f":"AE85/AD85","v":0.63568460975715135},{"$f":"AG87+AG89+AG91","v":19628.731},{"$f":"SUM(AH86:AH91)","v":23263.072410000001},{"$f":"SUM(AI86:AI91)","v":18534.664049999999},{"$f":"AI85/AH85","v":0.79674188014961345},{"$f":"AK89+AK91","v":23461},{"$f":"SUM(AL86:AL91)","v":8073.3004300000002},{"$f":"AM87+AM89","v":1385.38589},{"$f":"AM85/AL85","v":0.17160093347349889}]
[{"$f":"IF(COUNTBLANK(C86:IV86)=254,\"odstr\",IF(AND($A$1=\"TISK\",SUM(J71:U71)=0),\"odstr\",\"OK\"))","v":{"$error":"#REF!"}},"OK",null,null,5224,null,"Neinvestiční transfery politickým stranám a hnutím",null,null,0,0,0,"x ",0,0,0,"x ",0,0,0,"x ",null,null,5191,null,"Zaplacené sankce",null,null,0,43.335999999999999,5.5359999999999996,{"$f":"AE86/AD86","v":0.12774598486246999},0,43.335999999999999,5.5359999999999996,{"$f":"AI86/AH86","v":0.12774598486246999},0,0,0,"x"]
[{"$error":"#REF!"},"OK",null,null,5229,null,"Ostatní neinvestiční transfery neziskovým a podobným organizacím",null,null,74521.036000000007,100315.27228999999,81361.142609999995,0.81105439633153986,21752.45,67514.721289999987,50552.091609999996,0.74875657699689813,52768.586000000003,32800.550999999999,30809.050999999999,0.93928455653077292,null,null,5192,null,"Poskytnuté neinvestiční příspěvky a náhrady (část)",null,null,4083.511,5680.8230000000003,5117.1416399999998,{"$f":"AE87/AD87","v":0.90077470113045233},4083.511,5678.8230000000003,5115.1416399999998,{"$f":"AI87/AH87","v":0.90073975540354045},0,2,2,{"$f":"AM87/AL87","v":1}]
[{"$error":"#REF!"},"OK",null,null,5230,null,"Neinvestiční nedotační transfery podnikatelským subjektům",null,null,0,6.5,6.5,1,0,6.5,6.5,1,0,0,0,"x ",null,null,5193,null,"Výdaje na dopravní územní obslužnost",null,null,0,0,0,"x",0,0,0,"x",0,0,0,"x"]
[{"$error":"#REF!"},"OK",null,null,5240,null,"Neinvestiční nedotační transfery neziskovým a podobným organizacím",null,null,792,1246.606,1200.451,0.96297547099885616,792,1246.606,1200.451,0.96297547099885616,0,0,0,"x ",null,null,5194,null,"Věcné dary",null,null,16349.22,18619.258310000001,14624.5713,{"$f":"AE89/AD89","v":0.78545402059036151},13188.22,16796.113410000002,13241.18541,{"$f":"AI89/AH89","v":0.78834817834205129},3161,1823.1449,1383.38589,{"$f":"AM89/AL89","v":0.75879097157883613}]
[{"$error":"#REF!"},"OK",null,null,52,null,"Neinvestiční transfery podnikatelským subjektům a neziskovým organizacím. Neinvestiční transfery soukromoprávním subjektům",null,null,1310235.6200000001,5459385.2965099998,5421546.317259999,0.99306900370739726,91485.62,1629126.4211199998,1595984.7413899999,0.97965677844251298,1218750,3830258.8753900002,3825561.5758699994,0.99877363393106877,null,null,5197,null,"Náhrady zvýšených nákladů spojených s výkonem funkce v zahraničí",null,null,0,0,0,"x",0,0,0,"x",0,0,0,"x"]
[{"$error":"#REF!"},"OK",null,null,5311,null,"Neinvestiční transfery státnímu rozpočtu",null,null,1340,5302.4880000000003,1135.038,0.21405762728741676,300,300,0,0,1040,5002.4880000000003,1135.038,0.22689469719867392,null,null,5199,null,"Ostatní výdaje související s neinvestičními nákupy",null,null,22657,6992.9555300000002,172.80099999999999,{"$f":"AE91/AD91","v":2.4710724851413433E-2},2357,744.8,172.80099999999999,{"$f":"AI91/AH91","v":0.23200993555316862},20300,6248.15553,0,"x"]
[{"$error":"#REF!"},"OK",null,null,5313,null,"Neinvestiční transfery zvláštním fondům ústřední úrovně",null,null,0,0,0,"x ",0,0,0,"x ",0,0,0,"x ",null,null,52,"Neinvestiční transfery soukromoprávním subjektům ","Neinvestiční transfery podnikatelským subjektům a neziskovým organizacím. Neinvestiční transfery soukromoprávním subjektům",null,null,{"$f":"AC93+AC100","v":1814134.1269999999},{"$f":"AD93+AD100+AD108","v":6704385.9537400007},{"$f":"AE93+AE100+AE108","v":6505544.9403499998},{"$f":"AE92/AD92","v":0.97034165175424025},{"$f":"AG93+AG100+AG106+AG108","v":310361.69699999999},{"$f":"AH93+AH100+AH106+AH108","v":2244057.8457800001},{"$f":"AI93+AI100+AI106+AI108","v":2054623.72159},{"$f":"AI92/AH92","v":0.9155841171624719},{"$f":"AK93+AK100+AK106+AK108","v":1503772.43},{"$f":"AL93+AL100","v":4460328.1079600006},{"$f":"AM93+AM100+AM106+AM108","v":4450921.2187599996},{"$f":"AM92/AL92","v":0.99789098717127711}]
[null,null,null,null,5319,null,"Ostatní neinvestiční transfery jiným veřejným rozpočtům",null,null,100,10,0,0,100,10,0,0,0,0,0,"x ",null,null,521,null,"Neinvestiční transfery podnikatelským subjektům",null,null,{"$f":"SUM(AC94:AC99)","v":1054971.392},{"$f":"SUM(AD94:AD99)","v":4804541.6412400007},{"$f":"SUM(AE95:AE99)","v":4657608.0201300001},{"$f":"AE93/AD93","v":0.96941776508943345},{"$f":"SUM(AG94:AG99)","v":15991.23},{"$f":"SUM(AH95:AH99)","v":1559693.456},{"$f":"SUM(AI95:AI99)","v":1415120.4673000001},{"$f":"AI93/AH93","v":0.90730679279069826},{"$f":"AK95+AK96","v":1038980.162},{"$f":"SUM(AL94:AL99)","v":3244848.18524},{"$f":"AM95+AM96","v":3242487.5528299999},{"$f":"AM93/AL93","v":0.99927249834961829}]
[{"$f":"IF(COUNTBLANK(C94:IV94)=254,\"odstr\",IF(AND($A$1=\"TISK\",SUM(J78:U78)=0),\"odstr\",\"OK\"))","v":{"$error":"#REF!"}},"OK",null,null,5322,null,"Neinvestiční dotace obcím v rámci souhrnného dotačního vztahu",null,null,0,0,0,"x ",0,0,0,"x ",0,0,0,"x ",null,null,5211,null,"Neinvestiční transfery finančním institucím",null,null,0,"x","x","x",0,"x",0,"x",0,"x","x","x"]
[{"$f":"IF(COUNTBLANK(C95:IV95)=254,\"odstr\",IF(AND($A$1=\"TISK\",SUM(J79:U79)=0),\"odstr\",\"OK\"))","v":{"$error":"#REF!"}},"OK",null,null,5324,null,"Neinvestiční dotace krajům v rámci souhrnného dotačního vztahu",null,null,0,0,0,"x ",0,0,0,"x ",0,0,0,"x ",null,null,5212,null,"Neinvestiční transfery nefinančním podnikatelským subjektům-fyzickým osobám",null,null,60720.66,202108.37100000001,201847.40100000001,{"$f":"AE95/AD95","v":0.99870876204330994},1235.5,10188.252,9985.4120000000003,{"$f":"AI95/AH95","v":0.98009079477029026},59485.16,191920.11900000001,191861.989,{"$f":"AM95/AL95","v":0.99969711356837998}]
[{"$f":"IF(COUNTBLANK(C96:IV96)=254,\"odstr\",IF(AND($A$1=\"TISK\",SUM(J80:U80)=0),\"odstr\",\"OK\"))","v":{"$error":"#REF!"}},"OK",null,null,5331,null,"Neinvestiční příspěvky zřízeným příspěvkovým organizacím",null,null,18709549.541029997,20596942.245030001,20443288.480079994,0.99253997204429301,13133157.247029999,14510176.458670001,14416912.247299999,0.9935724964037721,5576392.2939999998,6086765.7863599993,6026376.2327799965,0.99007854816504826,null,null,5213,null,"Neinvestiční transfery nefinančním podnikatelským subjektům-právnickým osobám",null,null,994095.73199999996,4602128.2702400004,4455697.6871300004,{"$f":"AE96/AD96","v":0.96818198570063674},14600.73,1549200.2039999999,1405072.1233000001,{"$f":"AI96/AH96","v":0.90696613625026357},979495.00199999998,3052928.0662400001,3050625.5638299999,{"$f":"AM96/AL96","v":0.99924580522041717}]
[null,null,null,null,null,null,null,null,null,null,null,null,null,null,null,null,null,null,null,null,null,null,null,5214,null,"Neinvestiční transfery finančním a podobným institucím ve vlastnictví státu",null,null,null,160,0,"x",null,160,0,"x",null,0,0,"x"]
[{"$f":"IF(COUNTBLANK(C98:IV98)=254,\"odstr\",IF(AND($A$1=\"TISK\",SUM(J81:U81)=0),\"odstr\",\"OK\"))","v":{"$error":"#REF!"}},"OK",null,null,5332,null,"Neinvestiční dotace vysokým školám",null,null,18399.599999999999,59407.898999999998,54693.610090000002,0.92064541939111499,9099.6,24934.1,23960.810089999999,0.96096550868088282,9300,34473.798999999999,30732.799999999999,0.89148283309303977,null,null,5215,null,"Neinvestiční transfery vybraným podnikatelským subjektům ve vlastnictví státu",null,null,85,75,0,"x",85,75,0,"x",0,0,0,"x"]
[{"$f":"IF(COUNTBLANK(C99:IV99)=254,\"odstr\",IF(AND($A$1=\"TISK\",SUM(J82:U82)=0),\"odstr\",\"OK\"))","v":{"$error":"#REF!"}},"OK",null,null,5333,null,"Neinvestiční transfery školským právnickým osobám zřízeným státem, kraji a obcemi",null,null,76432.024999999994,120492.12652999999,120549.78439,1.0004785197312096,56432.025000000001,69684.676529999997,69742.334390000004,1.0008274108867419,20000,50807.45,50807.45,1,null,null,5219,null,"Ostatní neinvestiční transfery podnikatelským subjektům",null,null,70,70,62.932000000000002,{"$f":"AE99/AD99","v":0.89902857142857151},70,70,62.932000000000002,{"$f":"AI99/AH99","v":0.89902857142857151},0,0,0,"x"]
[null,null,null,null,5334,null,"Neinvestiční transfery veřejným výzkumným institucím",null,null,0,0,0,"x ",0,0,0,"x ",0,0,0,"x ",null,null,522,"Neinvestiční transfery neziskovým a podobným organizacím",null,null,null,{"$f":"SUM(AC101:AC105)","v":759162.73499999999},{"$f":"SUM(AD101:AD105)","v":1899663.1544999999},{"$f":"SUM(AE101:AE105)","v":1847838.7622199999},{"$f":"AE100/AD100","v":0.97271916752333887},{"$f":"SUM(AG101:AG105)","v":294370.467},{"$f":"SUM(AH101:AH105)","v":684183.23178000003},{"$f":"SUM(AI101:AI105)","v":639405.0962899999},{"$f":"AI100/AH100","v":0.93455242190969301},{"$f":"SUM(AK101:AK105)","v":464792.26799999998},{"$f":"SUM(AL101:AL105)","v":1215479.9227200001},{"$f":"SUM(AM101:AM105)","v":1208433.6659299999},{"$f":"AM100/AL100","v":0.99420290153848689}]
[{"$f":"IF(COUNTBLANK(C101:IV101)=254,\"odstr\",IF(AND($A$1=\"TISK\",SUM(J83:U83)=0),\"odstr\",\"OK\"))","v":{"$error":"#REF!"}},"OK",null,null,5335,null,"Neinvestiční transfery veřejným zdravotnickým zařízením zřízeným státem, kraji a obcemi",null,null,0,0,0,"x ",0,0,0,"x ",0,0,0,"x ",null,null,5221,null,"Neinvestiční transfery obecně prospěšným společnostem",null,null,363264.49300000002,1187739.7525899999,1179507.10197,{"$f":"AE101/AD101","v":0.99306864100317616},22888.78,309801.48074000003,301593.89497000002,{"$f":"AI101/AH101","v":0.97350695112755703},340375.71299999999,877938.27185000002,877913.20700000005,{"$f":"AM101/AL101","v":0.99997145032765555}]
[{"$f":"IF(COUNTBLANK(C102:IV102)=254,\"odstr\",IF(AND($A$1=\"TISK\",SUM(J84:U84)=0),\"odstr\",\"OK\"))","v":{"$error":"#REF!"}},null,null,null,5336,null,"Neinvestiční dotace zřízeným příspěvkovým organizacím",null,null,19693365.799000002,41134059.526059985,41090577.916709989,0.99894292929385076,9356464.978000002,13426302.157719996,13386970.06514,0.99707051933451529,10336900.821,27707757.368339993,27703607.851569988,0.99985023989076982,null,null,5222,null,"Neinvestiční transfery občanským sdružením",null,null,273786.05800000002,485206.29029999999,472308.89898,{"$f":"AE102/AD102","v":0.97341874666953387},186649.64,229056.2616,218141.94774,{"$f":"AI102/AH102","v":0.95235094738837733},87136.418000000005,256150.0287,254166.95123999999,{"$f":"AM102/AL102","v":0.9922581407854435}]
[{"$f":"IF(COUNTBLANK(C103:IV103)=254,\"odstr\",IF(AND($A$1=\"TISK\",SUM(J85:U85)=0),\"odstr\",\"OK\"))","v":{"$error":"#REF!"}},"OK",null,null,5339,null,"Neinvestiční příspěvky ostatním příspěvkovým organizacím",null,null,20683779.098000001,58947049.228899993,58938267.205219999,0.99985101843442759,24790.35,38760.364099999999,35109.352810000004,0.9058055471155908,20658988.748,58908288.864799991,58903157.852409996,0.99991289829514873,null,null,5223,null,"Neinvestiční transfery církvím a náboženským společnostem",null,null,3186,19059.53141,14290.422570000001,{"$f":"AE103/AD103","v":0.74977827432327204},2979,17298.89215,12583.28953,{"$f":"AI103/AH103","v":0.72740435750968024},207,1760.6392599999999,1707.1330399999999,{"$f":"AM103/AL103","v":0.96960977684889293}]
[{"$f":"IF(COUNTBLANK(C104:IV104)=254,\"odstr\",IF(AND($A$1=\"TISK\",SUM(J86:U86)=0),\"odstr\",\"OK\"))","v":{"$error":"#REF!"}},"OK",null,null,5341,null,"Převody vlastním fondům hospodářské (podnikatelské) činnosti",null,null,0,0,0,"x ",0,0,0,"x ",0,0,0,"x ",null,null,5224,null,"Neinvestiční transfery politickým stranám a hnutím",null,null,0,0,0,"x",0,0,0,"x",0,0,0,"x"]
[{"$f":"IF(COUNTBLANK(C105:IV105)=254,\"odstr\",IF(AND($A$1=\"TISK\",SUM(J87:U87)=0),\"odstr\",\"OK\"))","v":{"$error":"#REF!"}},"OK",null,null,5342,null,"Převody fondu kulturních a sociálních potřeb a sociálnímu fondu obcí a krajů",null,null,0,0,0,"x ",0,0,0,"x ",0,0,0,"x ",null,null,5229,null,"Ostatní neinvestiční transfery neziskovým a podobným organizacím",null,null,118926.18399999999,207657.5802,181732.33869999999,{"$f":"AE105/AD105","v":0.87515388807367023},81853.047000000006,128026.59729000001,107085.96405,{"$f":"AI105/AH105","v":0.83643529014079598},37073.137000000002,79630.982910000006,74646.374649999998,{"$f":"AM105/AL105","v":0.93740365774922463}]
[null,null,null,null,5343,null,"Převody jiným vlastním fondům a účtům nemajícím charakter veřejných rozpočtů",null,null,0,0,0,"x ",0,0,0,"x ",0,0,0,"x ",null,null,523,"Neinvestiční nedotační transfery podnikatelským subjektům ",null,null,null,"x","x","x","x",0,null,0,"x",0,null,null,"x"]
[{"$f":"IF(COUNTBLANK(C107:IV107)=254,\"odstr\",IF(AND($A$1=\"TISK\",SUM(J88:U88)=0),\"odstr\",\"OK\"))","v":{"$error":"#REF!"}},"OK",null,null,5361,null,"Nákup kolků",null,null,48,53,52.1,0.98301886792452831,48,51,50.1,0.98235294117647065,0,2,2,1,null,null,5230,null,"Neinvestiční nedotační transfery podnikatelským subjektům (zrušeno)",null,null,"x","x","x","x","x",null,"x","x","x",null,"x","x"]
[null,null,null,null,5362,null,"Platby daní a poplatků státnímu rozpočtu",null,null,198.8,745.91958999999997,704.53458999999998,0.94451814839720194,48.8,641.16958999999997,599.78458999999998,0.93545389449926974,150,104.75,104.75,1,null,null,524,"Neinvestiční nedotační transfery neziskovým a podobným organizacím",null,null,null,"x",{"$f":"AD109","v":181.15799999999999},{"$f":"AE109","v":98.158000000000001},{"$f":"AE108/AD108","v":0.54183640799743871},0,{"$f":"AH109","v":181.15799999999999},{"$f":"AI109","v":98.158000000000001},{"$f":"AI108/AH108","v":0.54183640799743871},0,null,null,"x"]
[{"$f":"IF(COUNTBLANK(C109:IV109)=254,\"odstr\",IF(AND($A$1=\"TISK\",SUM(J89:U89)=0),\"odstr\",\"OK\"))","v":{"$error":"#REF!"}},"OK",null,null,5363,null,"Úhrady sankcí jiným rozpočtům",null,null,27000,48652.737960000006,16076.471399999999,0.33043302543871872,0,13665.978580000001,13364.5839,0.97794562034210353,27000,34986.759380000003,2711.8874999999998,7.7511822988391321E-2,null,null,5240,null,"Neinvestiční nedotační transfery neziskovým a podobným organizacím (zrušeno)",null,null,"x",181.15799999999999,98.158000000000001,{"$f":"AE109/AD109","v":0.54183640799743871},"x",181.15799999999999,98.158000000000001,{"$f":"AI109/AH109","v":0.54183640799743871},"x",null,0,"x"]
[{"$f":"IF(COUNTBLANK(C110:IV110)=254,\"odstr\",IF(AND($A$1=\"TISK\",SUM(J90:U90)=0),\"odstr\",\"OK\"))","v":{"$error":"#REF!"}},"OK",null,null,5364,null,"Vratky veřejným rozpočtům ústřední úrovně transferů poskytnutých v minulých rozpočtových obdobích",null,null,0,900.74808000000007,900.72268999999994,0.99997181231848964,0,900.74808000000007,900.72268999999994,0.99997181231848964,0,0,0,"x ",null,null,53,"Neinvestiční transfery veřejnoprávním subjektům a mezi peněžními fondy téhož subjektu a platby daní","Neinvestiční transfery veřejnoprávním subjektům a mezi peněžními fondy téhož subjektu a platby daní",null,null,{"$f":"AC111+AC115+AC118+AC126+AC130","v":65961062.479659997},{"$f":"AD111+AD118+AD130","v":136748660.91242},{"$f":"AE111+AE115+AE118+AE126+AE130","v":136514805.98295999},{"$f":"AE110/AD110","v":0.99828989236238452},{"$f":"AG111+AG118+AG126+AG130","v":24722100.900660001},{"$f":"AH111+AH118+AH126+AH130","v":31779430.641510002},{"$f":"AI111+AI115+AI118+AI126+AI130","v":31613490.398929998},{"$f":"AI110/AH110","v":0.99477837584782736},{"$f":"AK111+AK115+AK118+AK126+AK130","v":41238961.578999996},{"$f":"AL111+AL118+AL126+AL130","v":104969230.27090998},{"$f":"AM111+AM115+AM118+AM126+AM130","v":104901315.58403},{"$f":"AM110/AL110","v":0.99935300385927661}]
[null,null,null,null,5365,null,"Výdaje z finančního vypořádání minulých let mezi krajem a obcemi",null,null,29,331.7,319.64999999999998,0.96367199276454629,29,330.7,318.64999999999998,0.96356214091321435,0,1,1,1,null,null,531,"Neinvestiční transfery veřejným rozpočtům ústřední úrovně",null,null,null,{"$f":"SUM(AC112:AC114)","v":1043},{"$f":"SUM(AD112:AD114)","v":6201.0803999999998},{"$f":"AE112+AE114","v":2260.8104000000003},{"$f":"AE111/AD111","v":0.3645833071282224},{"$f":"AG112+AG113+AG114","v":3},{"$f":"AH112+AH114","v":152.31039999999999},{"$f":"AI112","v":150.81039999999999},{"$f":"AI111/AH111","v":0.99015169023257765},{"$f":"AK112","v":1040},{"$f":"AL112+AL114","v":6048.77},{"$f":"AM112+AM114","v":2110},{"$f":"AM111/AL111","v":0.3488312499896673}]
[{"$f":"IF(COUNTBLANK(C112:IV112)=254,\"odstr\",IF(AND($A$1=\"TISK\",SUM(J91:U91)=0),\"odstr\",\"OK\"))","v":{"$error":"#REF!"}},"OK",null,null,5369,null,"Ostatní neinvestiční transfery jiným veřejným rozpočtům",null,null,0,195.9,195.8212,0.99959775395610007,0,195.9,195.8212,0.99959775395610007,0,0,0,"x ",null,null,5311,null,"Neinvestiční transfery státnímu rozpočtu",null,null,1040,5129.5803999999998,1190.8104000000001,{"$f":"AE112/AD112","v":0.23214577161126085},0,150.81039999999999,150.81039999999999,{"$f":"AI112/AH112","v":1},1040,4978.7700000000004,1040,{"$f":"AM112/AL112","v":0.20888693392143037}]
[{"$f":"IF(COUNTBLANK(C113:IV113)=254,\"odstr\",IF(AND($A$1=\"TISK\",SUM(J92:U92)=0),\"odstr\",\"OK\"))","v":{"$error":"#REF!"}},"OK",null,null,53,null,"Neinvestiční transfery veřejnoprávním subjektům a mezi peněžními fondy téhož subjektu",null,null,59210241.863030002,120914143.51914997,120666761.33436999,0.99795406742685311,22580470.000030003,28085953.253269996,27948124.472109996,0.99509260804085564,36629771.862999998,92828190.265879974,92718636.862259984,0.99881982614003129,null,null,5313,null,"Neinvestiční transfery zvláštním fondům ústřední úrovně",null,null,0,0,0,"x",0,0,null,"x",0,0,0,"x"]
[{"$f":"IF(COUNTBLANK(C114:IV114)=254,\"odstr\",IF(AND($A$1=\"TISK\",SUM(J93:U93)=0),\"odstr\",\"OK\"))","v":{"$error":"#REF!"}},"OK",null,null,5421,null,"Náhrady z úrazového pojištění",null,null,0,14,13.5,0.9642857142857143,0,14,13.5,0.9642857142857143,0,0,0,"x ",null,null,5319,null,"Ostatní neinvestiční transfery jiným veřejným rozpočtům",null,null,3,1071.5,1070,{"$f":"AE114/AD114","v":0.99860009332711153},3,1.5,0,"x",0,1070,1070,{"$f":"AM114/AL114","v":1}]
[null,null,null,null,5424,null,"Náhrady mezd v době nemoci",null,null,84,428.71699999999998,220.1677,0.51355019744959962,84,303.31599999999997,172.946,0.57018423030766596,0,125.401,47.221699999999998,0.37656557762697268,null,null,532,null,"Neinvestiční transfery veřejným rozpočtům územní úrovně",null,null,{"$f":"SUM(AC116:AC117)","v":0},{"$f":"SUM(AD116:AD117)","v":0},0,"x",0,null,0,"x",0,null,0,"x"]
[{"$f":"IF(COUNTBLANK(C116:IV116)=254,\"odstr\",IF(AND($A$1=\"TISK\",SUM(J94:U94)=0),\"odstr\",\"OK\"))","v":{"$error":"#REF!"}},"OK",null,null,5429,null,"Ostatní náhrady placené obyvatelstvu",null,null,45,79.5,61.89,0.77849056603773581,45,79.5,61.89,0.77849056603773581,0,0,0,"x ",null,null,5322,null,"Neinvestiční dotace obcím v rámci souhrnného dotačního vztahu",null,null,0,null,0,"x",0,null,0,"x",0,null,0,"x"]
[{"$f":"IF(COUNTBLANK(C117:IV117)=254,\"odstr\",IF(AND($A$1=\"TISK\",SUM(J95:U95)=0),\"odstr\",\"OK\"))","v":{"$error":"#REF!"}},"OK",null,null,5491,null,"Stipendia studentům a doktorandům",null,null,15174,7537,6579,0.87289372429348544,1824,1937,1713,0.88435725348477023,13350,5600,4866,0.86892857142857138,null,null,5324,null,"Neinvestiční dotace krajům v rámci souhrnného dotačního vztahu",null,null,0,null,0,"x",0,null,0,"x",0,null,0,"x"]
[null,null,null,null,5492,null,"Dary obyvatelstvu",null,null,12111.1,12736.573,11490.5365,0.9021686210254517,11219.1,11885.316000000001,11033.0365,0.92829138913933795,892,851.25699999999995,457.5,0.53744051443923524,null,null,533,"Neinvestiční transfery příspěvkovým a podobným organizacím",null,null,null,{"$f":"SUM(AC119:AC125)","v":65958744.820659995},{"$f":"SUM(AD119:AD125)","v":136728343.56459001},{"$f":"SUM(AE119:AE125)","v":136505607.45201999},{"$f":"AE118/AD118","v":0.99837095874371651},{"$f":"SUM(AG119:AG125)","v":24720823.241659999},{"$f":"SUM(AH119:AH125)","v":31772925.612679999},{"$f":"SUM(AI119:AI125)","v":31608060.571989998},{"$f":"AI118/AH118","v":0.99481114699037321},{"$f":"SUM(AK119:AK125)","v":41237921.578999996},{"$f":"SUM(AL119:AL125)","v":104955417.95190999},{"$f":"SUM(AM119:AM125)","v":104897546.88003001},{"$f":"AM118/AL118","v":0.9994486128204787}]
[{"$f":"IF(COUNTBLANK(C119:IV119)=254,\"odstr\",IF(AND($A$1=\"TISK\",SUM(J96:U96)=0),\"odstr\",\"OK\"))","v":{"$error":"#REF!"}},"OK",null,null,5493,null,"Účelové neinvestiční transfery nepodnikajícím fyzickým osobám",null,null,1341.8,1435.57933,816.38823000000002,0.56868207345950017,341.8,475.73232999999993,360.95249999999999,0.75873022966507242,1000,959.84699999999998,455.43572999999998,0.47448784024953977,null,null,5331,null,"Neinvestiční příspěvky zřízeným příspěvkovým organizacím",null,null,19852327.558400001,21960332.216669999,21799764.104249999,{"$f":"AE119/AD119","v":0.99268826578597413},14105513.9794,15632216.516729999,15520011.796010001,{"$f":"AI119/AH119","v":0.9928222129856048},5746813.5789999999,6328115.6999399997,6279752.3082400002,{"$f":"AM119/AL119","v":0.99235737872168517}]
[{"$f":"IF(COUNTBLANK(C120:IV120)=254,\"odstr\",IF(AND($A$1=\"TISK\",SUM(J98:U98)=0),\"odstr\",\"OK\"))","v":{"$error":"#REF!"}},"OK",null,null,5494,null,"Neinvestiční transfery obyvatelstvu nemající charakter daru",null,null,1219,1260.0149999999999,1053.2850000000001,0.83593052463661166,369,504.64499999999998,460.43099999999998,0.91238593466694407,850,755.37,592.85400000000004,0.78485245641208945,null,null,5332,null,"Neinvestiční dotace vysokým školám",null,null,40009.599999999999,185925.86199999999,175115.38201,{"$f":"AE120/AD120","v":0.94185596412617412},10359.6,147660.20000000001,137509.10576000001,{"$f":"AI120/AH120","v":0.93125368758812455},29650,38265.661999999997,37606.276250000003,{"$f":"AM120/AL120","v":0.98276821266021752}]
[{"$f":"IF(COUNTBLANK(C121:IV121)=254,\"odstr\",IF(AND($A$1=\"TISK\",SUM(J99:U99)=0),\"odstr\",\"OK\"))","v":{"$error":"#REF!"}},"OK",null,null,5499,null,"Ostatní neinvestiční transfery obyvatelstvu",null,null,5606.85,8794.2286999999997,7186.7310800000005,0.81720993678501908,5571.85,7223.2287000000006,5818.0610800000004,0.8054654395755183,35,1571,1368.67,0.87120942075111396,null,null,5333,null,"Neinvestiční transfery školským právnickým osobám zřízeným státem, kraji a obcemi",null,null,93690.797000000006,136773.28218000001,136138.92194,{"$f":"AE121/AD121","v":0.99536195790662418},69717.797000000006,76153.852180000002,75519.491940000007,{"$f":"AI121/AH121","v":0.99167001770966756},23973,60619.43,60619.43,{"$f":"AM121/AL121","v":1}]
[null,null,null,null,54,null,"Neinvestiční transfery obyvatelstvu",null,null,35581.75,32285.613030000004,27421.498510000001,0.84934111316144945,19454.75,22422.738030000004,19633.817080000001,0.87562085654889121,16127,9862.875,7787.6814300000005,0.78959547089464288,null,null,5334,null,"Neinvestiční transfery veřejným výzkumným institucím",null,null,0,58126.400000000001,56090.092290000001,{"$f":"AE122/AD122","v":0.9649675928665804},0,58126.400000000001,56090.092290000001,{"$f":"AI122/AH122","v":0.9649675928665804},0,0,0,"x"]
[{"$f":"IF(COUNTBLANK(C123:IV123)=254,\"odstr\",IF(AND($A$1=\"TISK\",SUM(J101:U101)=0),\"odstr\",\"OK\"))","v":{"$error":"#REF!"}},"OK",null,null,5511,null,"Neinvestiční transfery mezinárodním organizacím",null,null,646,5,5,1,646,5,5,1,0,0,0,"x ",null,null,5335,null,"Neinvestiční transfery veřejným zdravotnickým zařízením zřízeným státem, kraji a obcemi",null,null,0,0,0,"x",0,0,0,"x",0,0,0,"x"]
[{"$f":"IF(COUNTBLANK(C124:IV124)=254,\"odstr\",IF(AND($A$1=\"TISK\",SUM(J102:U102)=0),\"odstr\",\"OK\"))","v":{"$error":"#REF!"}},"OK",null,null,5513,null,"Vratky neoprávněně použitých nebo zadržených prostředků Evropských společenství",null,null,0,0,0,"x ",0,0,0,"x ",0,0,0,"x ",null,null,5336,null,"Neinvestiční dotace zřízeným příspěvkovým organizacím",null,null,22422218.864259999,47185696.632080004,47142483.317000002,{"$f":"AE124/AD124","v":0.99908418613765637},10506641.65026,15815439.38449,15779922.81119,{"$f":"AI124/AH124","v":0.99775431004877224},11915577.214,31370257.247590002,31362560.50581,{"$f":"AM124/AL124","v":0.99975464843277329}]
[{"$f":"IF(COUNTBLANK(C125:IV125)=254,\"odstr\",IF(AND($A$1=\"TISK\",SUM(J103:U103)=0),\"odstr\",\"OK\"))","v":{"$error":"#REF!"}},"OK",null,null,5531,null,"Peněžní dary do zahraničí",null,null,0,0,0,"x ",0,0,0,"x ",0,0,0,"x ",null,null,5339,null,"Neinvestiční příspěvky cizím příspěvkovým organizacím",null,null,23550498.000999998,67201489.171660006,67196015.634529993,{"$f":"AE125/AD125","v":0.99991855035956079},28590.215,43329.259279999998,39007.274799999999,{"$f":"AI125/AH125","v":0.90025251869479916},23521907.785999998,67158159.912379995,67157008.359730005,{"$f":"AM125/AL125","v":0.99998285312385726}]
[null,null,null,null,5532,null,"Ostatní neinvestiční transfery do zahraničí",null,null,943.4,3857.7620000000002,0,0,50,0,0,"x ",893.4,3857.7620000000002,0,0,null,null,534,null,"Převody vlastním fondům a ve vztahu k útvarům bez plné právní subjektivity",null,null,{"$f":"SUM(AC127:AC129)","v":0},{"$f":"SUM(AD127:AD129)","v":0},0,"x",0,{"$f":"SUM(AH127:AH129)","v":0},0,"x",0,null,null,"x"]
[{"$f":"IF(COUNTBLANK(C127:IV127)=254,\"odstr\",IF(AND($A$1=\"TISK\",SUM(J104:U104)=0),\"odstr\",\"OK\"))","v":{"$error":"#REF!"}},"OK",null,null,55,null,"Neinvestiční transfery do zahraničí",null,null,1589.4,3862.7620000000002,5,1.2944105797872093E-3,696,5,5,1,893.4,3857.7620000000002,0,0,null,null,5341,null,"Převody vlastním fondům hospodářské (podnikatelské) činnosti",null,null,null,null,null,"x",null,null,null,"x",null,null,null,"x"]
[{"$f":"IF(COUNTBLANK(C128:IV128)=254,\"odstr\",IF(AND($A$1=\"TISK\",SUM(J105:U105)=0),\"odstr\",\"OK\"))","v":{"$error":"#REF!"}},"OK",null,null,5612,null,"Neinvestiční půjčené prostředky nefinančním podnikatelským subjektům – fyzickým osobám",null,null,0,0,0,"x ",0,0,0,"x ",0,0,0,"x ",null,null,5342,null,"Převody fondu kulturních a sociálních potřeb a sociálnímu fondu obcí a krajů",null,null,null,null,null,"x",null,null,null,"x",null,null,null,"x"]
[{"$f":"IF(COUNTBLANK(C129:IV129)=254,\"odstr\",IF(AND($A$1=\"TISK\",SUM(J106:U106)=0),\"odstr\",\"OK\"))","v":{"$error":"#REF!"}},"OK",null,null,5613,null,"Neinvestiční půjčené prostředky nefinančním podnikatelským subjektům – právnickým osobám",null,null,0,0,0,"x ",0,0,0,"x ",0,0,0,"x ",null,null,5343,null,"Převody jiným vlastním fondům a účtům nemajícím charakter veřejných rozpočtů",null,null,null,null,null,"x",null,null,null,"x",null,null,null,"x"]
[null,null,null,null,5615,null,"Neinvestiční půjčené prostředky vybraným podnikatelským subjektům ve vlastnictví státu",null,null,0,0,0,"x ",0,0,0,"x ",0,0,0,"x ",null,null,536,null,"Ostatní neinvestiční transfery jiným veřejným rozpočtům, platby daní a další povinné platby",null,null,{"$f":"SUM(AC131:AC136)","v":1274.6590000000001},{"$f":"SUM(AD131:AD136)","v":14116.267430000002},{"$f":"SUM(AE131:AE136)","v":6937.7205400000003},{"$f":"AE130/AD130","v":0.49146989984448031},{"$f":"SUM(AG131:AG136)","v":1274.6590000000001},{"$f":"SUM(AH131:AH136)","v":6352.7184299999999},{"$f":"SUM(AI131:AI136)","v":5279.0165399999996},{"$f":"AI130/AH130","v":0.83098544318766532},0,{"$f":"SUM(AL131:AL136)","v":7763.549},{"$f":"SUM(AM131:AM136)","v":1658.704},{"$f":"AM130/AL130","v":0.21365280234593739}]
[{"$f":"IF(COUNTBLANK(C131:IV131)=254,\"odstr\",IF(AND($A$1=\"TISK\",SUM(J107:U107)=0),\"odstr\",\"OK\"))","v":{"$error":"#REF!"}},"OK",null,null,5621,null,"Neinvestiční půjčené prostředky obecně prospěšným společnostem",null,null,0,757.49,757.49,1,0,757.49,757.49,1,0,0,0,"x ",null,null,5361,null,"Nákup kolků",null,null,21,18.8,14,0.74468085106382975,21,18.8,14,0.74468085106382975,0,0,0,"x"]
[{"$error":"#REF!"},"OK",null,null,5622,null,"Neinvestiční půjčené prostředky občanským sdružením",null,null,3000,7225.4790000000003,6225.4790000000003,0.86160087102875815,0,225.47900000000001,225.47900000000001,1,3000,7000,6000,0.8571428571428571,null,null,5362,null,"Platby daní a poplatků státnímu rozpočtu",null,null,820.5,2494.4622300000001,1637.01423,0.65625937739694695,820.5,2494.4622300000001,1637.01423,0.65625937739694695,0,0,0,"x"]
[{"$error":"#REF!"},"OK",null,null,5629,null,"Ostatní neinvestiční půjčené prostředky neziskovým a podobným organizacím",null,null,200,186.23,186.23,1,200,186.23,186.23,1,0,0,0,"x ",null,null,5363,null,"Úhrady sankcí jiným rozpočtům",null,null,1.5589999999999999,9677.9850000000006,3509.0764600000002,0.36258337453509176,1.5589999999999999,1942.576,1874.7064600000001,0.96506209280872413,0,7735.4089999999997,1634.37,{"$f":"AM133/AL133","v":0.21128423849340092}]
[{"$error":"#REF!"},"OK",null,null,5649,null,"Ostatní neinvestiční půjčené prostředky veřejným rozpočtům územní úrovně",null,null,0,0,0,"x ",0,0,0,"x ",0,0,0,"x ",null,null,5364,null,"Vratky veřejným rozpočtům ústřední úrovně transferů poskytnutých v minulých rozpočtových obdobích",null,null,201.7,1673.7582,1547.66785,0.9246663287444985,201.7,1659.6181999999999,1533.53385,0.92402809875186964,0,14.14,14.134,{"$f":"AM134/AL134","v":0.99957567185289953}]
[{"$error":"#REF!"},"OK",null,null,5651,null,"Neinvestiční půjčené prostředky zřízeným příspěvkovým organizacím",null,null,66582.899999999994,99349.481180000002,47340.671359999993,0.47650647791737155,28212.9,38653.686270000006,18350.800670000001,0.4747490457137194,38370,60695.794910000004,28989.870689999996,0.47762568614491835,null,null,5365,null,"Výdaje z finančního vypořádání minulých let mezi krajem a obcemi",null,null,74,251.262,229.96199999999999,0.91522792941232656,74,237.262,219.762,0.92624187606949282,0,14,10.199999999999999,{"$f":"AM135/AL135","v":0.72857142857142854}]
[{"$error":"#REF!"},"OK",null,null,5659,null,"Neinvestiční půjčené prostředky ostatním příspěvkovým organizacím",null,null,0,330,330,1,0,330,330,1,0,0,0,"x ",null,null,5369,null,"Ostatní neinvestiční transfery jiným veřejným rozpočtům",null,null,155.9,0,0,"x",155.9,0,0,"x",0,0,0,"x"]
[{"$error":"#REF!"},"OK",null,null,5660,null,"Neinvestiční půjčené prostředky obyvatelstvu",null,null,225,0,0,"x ",225,0,0,"x ",0,0,0,"x ",null,null,54,"Neinvestiční transfery obyvatelstvu","Neinvestiční transfery obyvatelstvu",null,null,{"$f":"AC138+AC142","v":34036.5},{"$f":"AD138+AD142","v":40507.873160000003},{"$f":"AE138+AE142","v":34913.21658},{"$f":"AE137/AD137","v":0.86188718035375611},{"$f":"AG138+AG142","v":25920.5},{"$f":"AH138+AH142","v":30717.004159999997},{"$f":"AI138+AI142","v":26852.388470000002},{"$f":"AI137/AH137","v":0.87418643856445677},{"$f":"AK138+AK142","v":8116},{"$f":"AL138+AL142","v":9790.8689999999988},{"$f":"AM138+AM142","v":8060.8281100000004},{"$f":"AM137/AL137","v":0.8233005783245595}]
[null,null,null,null,56,null,"Neinvestiční půjčené prostředky",null,null,70007.899999999994,107848.68018,54839.870360000001,0.50848902618439074,28637.9,40152.885270000006,19849.999670000001,0.49436048086015905,41370,67695.794909999997,34989.870689999996,0.51686919012500299,null,null,542,null,"Náhrady placené obyvatelstvu",null,null,{"$f":"SUM(AC139:AC141)","v":282.25},{"$f":"SUM(AD139:AD141)","v":886.42916000000002},{"$f":"SUM(AE139:AE141)","v":349.42830000000004},0.394197659291804,{"$f":"AG139+AG140+AG141","v":188.25},{"$f":"SUM(AH139:AH141)","v":504.27015999999998},{"$f":"SUM(AI139:AI141)","v":274.48180000000002},0.54431497592480993,{"$f":"AK140","v":94},{"$f":"AL140","v":382.15899999999999},{"$f":"AM140","v":74.9465},{"$f":"AM138/AL138","v":0.19611339782655909}]
[{"$f":"IF(COUNTBLANK(C139:IV139)=254,\"odstr\",IF(AND($A$1=\"TISK\",SUM(J114:U114)=0),\"odstr\",\"OK\"))","v":{"$error":"#REF!"}},"OK",null,null,5901,null,"Nespecifikované rezervy",null,null,4497965.0420000004,109816.10424999999,0.5,4.5530662685113425E-6,144930.64199999999,45397.300230000001,0.5,1.1013870813171922E-5,4353034.4000000004,64418.804019999989,0,0,null,null,5421,null,"Náhrady z úrazového pojištění",null,null,10,25,26.5,1.06,10,25,26.5,1.06,0,0,0,"x"]
[{"$f":"IF(COUNTBLANK(C140:IV140)=254,\"odstr\",IF(AND($A$1=\"TISK\",SUM(J115:U115)=0),\"odstr\",\"OK\"))","v":{"$error":"#REF!"}},"OK",null,null,5902,null,"Ostatní výdaje z finančního vypořádání minulých let",null,null,0,0.1,6.2060000000000004E-2,0.62060000000000004,0,0.1,6.2060000000000004E-2,0.62060000000000004,0,0,0,"x ",null,null,5424,null,"Náhrady mezd v době nemoci",null,null,187.25,771.92916000000002,283.14030000000002,0.36679570441412007,93.25,389.77015999999998,208.19380000000001,0.53414504589063472,94,382.15899999999999,74.9465,{"$f":"AM140/AL140","v":0.19611339782655909}]
[{"$f":"IF(COUNTBLANK(C141:IV141)=254,\"odstr\",IF(AND($A$1=\"TISK\",SUM(J116:U116)=0),\"odstr\",\"OK\"))","v":{"$error":"#REF!"}},"OK",null,null,5909,null,"Ostatní neinvestiční výdaje jinde nezařazené",null,null,909724.18065999995,26312.466189999999,3703.4345800000001,0.14074828840663681,867982.79065999994,17693.018550000001,2872.3579,0.16234414110191503,41741.39,8619.4476399999985,831.0766799999999,9.6418786297076467E-2,null,null,5429,null,"Ostatní náhrady placené obyvatelstvu",null,null,85,89.5,39.787999999999997,0.44455865921787707,85,89.5,39.787999999999997,0.44455865921787707,0,0,0,"x"]
[null,null,null,null,59,null,"Ostatní neinvestiční výdaje",null,null,5407689.2226599995,136128.67043999999,3703.9966400000003,2.7209526310863163E-2,1012913.4326599999,63090.41878,2872.9199600000002,4.5536549218638742E-2,4394775.79,73038.25165999998,831.0766799999999,1.137864969535061E-2,null,null,549,null,"Ostatní neinvestiční transfery obyvatelstvu",null,null,{"$f":"SUM(AC143:AC147)","v":33754.25},{"$f":"SUM(AD143:AD147)","v":39621.444000000003},{"$f":"SUM(AE143:AE147)","v":34563.788280000001},0.87235054532590983,{"$f":"SUM(AG143:AG147)","v":25732.25},{"$f":"SUM(AH143:AH147)","v":30212.733999999997},{"$f":"SUM(AI143:AI147)","v":26577.90667},0.87969220759696898,{"$f":"SUM(AK143:AK147)","v":8022},{"$f":"SUM(AL143:AL147)","v":9408.7099999999991},{"$f":"SUM(AM143:AM147)","v":7985.8816100000004},{"$f":"AM142/AL142","v":0.84877540172882371}]
[{"$f":"IF(COUNTBLANK(C143:IV143)=254,\"odstr\",IF(AND($A$1=\"TISK\",SUM(J117:U117)=0),\"odstr\",\"OK\"))","v":{"$error":"#REF!"}},"OK",null,null,5,null,"Běžné výdaje",null,null,68369775.364409998,130058413.02361995,128801303.79438999,0.99033427211662461,25720178.493410006,32761511.902689993,31909918.22163,0.97400627652382332,42649596.870999992,97296901.120929956,96891385.572759986,0.99583218433991072,null,null,5491,null,"Stipendia studentům a doktorandům",null,null,5516,7125,6522.28,0.9154077192982456,2192,2238,2009.28,0.89780160857908842,3324,4887,4513,0.92347043175772459]
[{"$f":"IF(COUNTBLANK(C144:IV144)=254,\"odstr\",IF(AND($A$1=\"TISK\",SUM(J118:U118)=0),\"odstr\",\"OK\"))","v":{"$error":"#REF!"}},"OK",null,null,6111,null,"Programové vybavení",null,null,588,1551.1680000000001,1357.15157,0.87492236172999949,588,1400.2280000000001,1206.2161699999999,0.86144268647677369,0,150.94,150.93539999999999,0.99996952431429698,null,null,5492,null,"Dary obyvatelstvu",null,null,14205.8,16591.713,15254.820809999999,0.9194241010557499,13873.8,16125.013000000001,14835.52081,0.92003155656370628,332,466.7,419.3,0.89843582601242777]
[{"$f":"IF(COUNTBLANK(C145:IV145)=254,\"odstr\",IF(AND($A$1=\"TISK\",SUM(J119:U119)=0),\"odstr\",\"OK\"))","v":{"$error":"#REF!"}},"OK",null,null,6112,null,"Ocenitelná práva",null,null,0,0,0,"x ",0,0,0,"x ",0,0,0,"x ",null,null,5493,null,"Účelové neinvestiční transfery nepodnikajícím fyzickým osobám",null,null,1682.9,3126.9169999999999,2820.4886099999999,0.90200303046099395,457.9,1830.1669999999999,1532.106,0.83713999869957223,1225,1296.75,1288.3826100000001,0.99354741469057273]
[{"$f":"IF(COUNTBLANK(C146:IV146)=254,\"odstr\",IF(AND($A$1=\"TISK\",SUM(J120:U120)=0),\"odstr\",\"OK\"))","v":{"$error":"#REF!"}},"OK",null,null,6113,null,"Nehmotné výsledky výzkumné a obdobné činnosti",null,null,0,0,0,"x ",0,0,0,"x ",0,0,0,"x ",null,null,5494,null,"Neinvestiční transfery obyvatelstvu nemající charakter daru",null,null,1608,1699.452,1544.9909,0.90911123114980597,702,916.19200000000001,849.56190000000004,0.92727495983374664,906,783.26,695.42899999999997,0.88786482138753409]
[{"$f":"IF(COUNTBLANK(V147:IV147)=254,\"odstr\",IF(AND($A$1=\"TISK\",SUM(J121:U121)=0),\"odstr\",\"OK\"))","v":{"$error":"#REF!"}},"OK",null,null,6119,null,"Ostatní nákupy dlouhodobého nehmotného majetku",null,null,10420,6990.2,2047.4988000000001,0.29290990243483739,10420,6990.2,2047.4988000000001,0.29290990243483739,0,0,0,"x ",null,null,5499,null,"Ostatní neinvestiční transfery obyvatelstvu",null,null,10741.55,11078.361999999999,8421.2079599999997,0.76014919534133296,8506.5499999999993,9103.3619999999992,7351.4379600000002,0.80755197475394269,2235,1975,1069.77,0.54165569620253162]
[{"$f":"IF(COUNTBLANK(C148:IV148)=254,\"odstr\",IF(AND($A$1=\"TISK\",SUM(J122:U122)=0),\"odstr\",\"OK\"))","v":{"$error":"#REF!"}},null,null,null,6121,null,"Budovy, haly a stavby",null,null,8809758.7896100003,13742376.018879997,8786988.876459999,0.63940827003918199,7853672.2095499998,11876689.691859996,7924724.1696099993,0.66725025029839913,956086.58005999995,1865686.3270200002,862264.70685000019,0.46217024499893689,null,null,55,"Neinvestiční transfery a související platby do zahraničí","Neinvestiční transfery a související platby do zahraničí",null,null,{"$f":"AC149","v":600},{"$f":"AD149+AD152","v":4196.8385799999996},{"$f":"AE149+AE152","v":3444.9761199999998},0.82085027916417985,{"$f":"AG149+AG152","v":600},{"$f":"AH149+AH152","v":624.6},{"$f":"AI149+AI152","v":624.57501999999999},0.99996000640409854,null,{"$f":"AL152","v":3572.2385800000002},{"$f":"AM149+AM152","v":2820.4011},0.78953323996629587]
[null,null,null,null,6122,null,"Stroje, přístroje a zařízení",null,null,136430.28399999999,397880.93423000001,312571.15768999996,0.7855896847505498,98730.284,358901.47674000001,292832.79076999996,0.81591414287252328,37700,38979.457490000001,19738.36692,0.50637869767848331,null,null,551,null,"Neinvestiční transfery mezinárodním vládním organizacím a nednárodním orgánům",null,null,{"$f":"SUM(AC150:AC151)","v":600},{"$f":"AD150","v":18},{"$f":"AE150","v":18},1,{"$f":"AG150","v":600},{"$f":"SUM(AH150)","v":18},{"$f":"AI150","v":18},1,0,null,0,"x"]
[{"$f":"IF(COUNTBLANK(C150:IV150)=254,\"odstr\",IF(AND($A$1=\"TISK\",SUM(J123:U123)=0),\"odstr\",\"OK\"))","v":{"$error":"#REF!"}},"OK",null,null,6123,null,"Dopravní prostředky",null,null,775.9,1279,1178.327,0.92128772478498822,775.9,1121.7,1117.827,0.99654720513506279,0,157.30000000000001,60.5,0.38461538461538458,null,null,5511,null,"Neinvestiční transfery mezinárodním vládním organizacím",null,null,600,18,18,1,600,18,18,1,0,0,0,"x"]
[{"$f":"IF(COUNTBLANK(C151:IV151)=254,\"odstr\",IF(AND($A$1=\"TISK\",SUM(J124:U124)=0),\"odstr\",\"OK\"))","v":{"$error":"#REF!"}},"OK",null,null,6124,null,"Pěstitelské celky trvalých porostů",null,null,0,0,0,"x ",0,0,0,"x ",null,null,null,"x ",null,null,5513,null,"Vratky neoprávněně použitých nebo zadržených prostředků Evropské unie",null,null,"x",null,null,"x","x",null,null,"x","x",null,null,"x"]
[null,null,null,null,6125,null,"Výpočetní technika",null,null,1420,16747.72867,11350.419250000001,0.67772887139805804,1420,15882.81,10486.584580000001,0.66024743606452518,0,864.91867000000002,863.83467000000007,0.99874670297034984,null,null,553,null,"Ostatní neinvestiční transfery do zahraničí",null,null,{"$f":"SUM(AC153:AC154)","v":0},{"$f":"AD154","v":4178.8385799999996},{"$f":"AE154","v":3426.9761199999998},{"$f":"AE152/AD152","v":0.82007860662567156},0,{"$f":"AH154","v":606.6},{"$f":"AI154","v":606.57501999999999},{"$f":"AI152/AH152","v":0.99995881965051103},0,{"$f":"AL154","v":3572.2385800000002},{"$f":"AM154","v":2820.4011},{"$f":"AM152/AL152","v":0.78953323996629587}]
[{"$f":"IF(COUNTBLANK(C153:IV153)=254,\"odstr\",IF(AND($A$1=\"TISK\",SUM(J125:U125)=0),\"odstr\",\"OK\"))","v":{"$error":"#REF!"}},"OK",null,null,6127,null,"Umělecká díla a předměty",null,null,0,140,0,0,0,140,0,0,0,0,0,"x ",null,null,5531,null,"Peněžní dary do zahraničí",null,null,"x",null,null,"x","x",null,null,"x","x",null,null,"x"]
[{"$f":"IF(COUNTBLANK(C154:IV154)=254,\"odstr\",IF(AND($A$1=\"TISK\",SUM(J126:U126)=0),\"odstr\",\"OK\"))","v":{"$error":"#REF!"}},"OK",null,null,6129,null,"Nákup dlouhodobého hmotného majetku jinde nezařazený",null,null,1100,12789.332,8892.3039899999985,0.69529073058702351,1100,12789.332,8892.3039899999985,0.69529073058702351,0,0,0,"x ",null,null,5532,null,"Ostatní neinvestiční transfery do zahraničí",null,null,0,4178.8385799999996,3426.9761199999998,{"$f":"AE154/AD154","v":0.82007860662567156},0,606.6,606.57501999999999,{"$f":"AI154/AH154","v":0.99995881965051103},0,3572.2385800000002,2820.4011,{"$f":"AM154/AL154","v":0.78953323996629587}]
[{"$f":"IF(COUNTBLANK(C155:IV155)=254,\"odstr\",IF(AND($A$1=\"TISK\",SUM(J127:U127)=0),\"odstr\",\"OK\"))","v":{"$error":"#REF!"}},"OK",null,null,6130,null,"Pozemky",null,null,16307,58121.672999999995,54726.032599999999,0.94157703615998811,16245,57862.470999999998,54567.888599999998,0.94306184400593607,62,259.202,158.14400000000001,0.61011874908372621,null,null,56,"Neinvestiční půjčené prostředky","Neinvestiční půjčené prostředky",null,null,{"$f":"AC156+AC160+AC166","v":111469.42600000001},{"$f":"AD156+AD160+AD166","v":431952.60839999997},{"$f":"AE156+AE160+AE166","v":390625.79103000002},{"$f":"AE155/AD155","v":0.90432557515260981},{"$f":"AG156+AG160+AG164+AG166+AG169","v":36898.815999999999},{"$f":"AH156+AH160+AH164+AH166+AH169","v":117793.86026},{"$f":"AI156+AI160+AI164+AI166","v":105112.17362999999},{"$f":"AI155/AH155","v":0.89234000310365569},{"$f":"AK156+AK160+AK164+AK166+AK169","v":74570.61},{"$f":"AL160+AL166","v":314158.74814000004},{"$f":"AM156+AM160+AM164+AM166","v":285513.61739999999},{"$f":"AM155/AL155","v":0.9088195668285679}]
[null,null,null,null,61,null,"Investiční nákupy a související výdaje",null,null,8976799.9736100007,14237876.054779997,9179111.7673599981,0.64469670420247471,7982951.3935500002,12331777.909599997,8295875.2795199985,0.67272337698052898,993848.58005999995,1906098.1451800002,883236.48784000019,0.46337408704450145,null,null,561,null,"Neinvestiční půjčené prostředky podnikatelským subjektům ",null,null,{"$f":"SUM(AC157:AC159)","v":0},{"$f":"AD157+AD158+AD159","v":599.88499999999999},{"$f":"AE157+AE158","v":599.88499999999999},{"$f":"AE156/AD156","v":1},0,{"$f":"AH157+AH158","v":599.88499999999999},{"$f":"AI157+AI158","v":599.88499999999999},{"$f":"AI156/AH156","v":1},0,null,0,"x"]
[{"$f":"IF(COUNTBLANK(C157:IV157)=254,\"odstr\",IF(AND($A$1=\"TISK\",SUM(J128:U128)=0),\"odstr\",\"OK\"))","v":{"$error":"#REF!"}},"OK",null,null,6202,null,"Nákup majetkových podílů",null,null,0,0,0,"x ",0,0,0,"x ",0,0,0,"x ",null,null,5612,null,"Neinvestiční půjčené prostředky nefinančním podnikatelským subjektům – fyzickým osobám",null,null,0,499.88499999999999,499.88499999999999,{"$f":"AE157/AD157","v":1},0,499.88499999999999,499.88499999999999,{"$f":"AI157/AH157","v":1},0,0,0,"x"]
[{"$f":"IF(COUNTBLANK(C158:IV158)=254,\"odstr\",IF(AND($A$1=\"TISK\",SUM(J129:U129)=0),\"odstr\",\"OK\"))","v":{"$error":"#REF!"}},"OK",null,null,62,null,"Nákup akcií a majetkových podílů",null,null,0,0,0,"x ",0,0,0,"x ",0,0,0,"x ",null,null,5613,null,"Neinvestiční půjčené prostředky nefinančním podnikatelským subjektům – právnickým osobám",null,null,0,100,100,{"$f":"AE158/AD158","v":1},0,100,100,{"$f":"AI158/AH158","v":1},0,0,0,"x"]
[{"$f":"IF(COUNTBLANK(C159:IV159)=254,\"odstr\",IF(AND($A$1=\"TISK\",SUM(J130:U130)=0),\"odstr\",\"OK\"))","v":{"$error":"#REF!"}},"OK",null,null,6312,null,"Investiční transfery nefinančním podnikatelským subjektům-fyzickým osobám",null,null,0,0,0,"x ",0,0,0,"x ",0,0,0,"x ",null,null,5615,null,"Neinvestiční půjčené prostředky vybraným podnikatelským subjektům ve vlastnictví státu",null,null,"x",0,0,"x","x",0,0,"x","x",0,0,"x"]
[null,null,null,null,6313,null,"Investiční dotace nefinančním podnikatelským subjektům – právnickým osobám",null,null,0,1832,1832,1,0,1368,1368,1,0,464,464,1,null,null,562,null,"Neinvestiční půjčené prostředky neziskovým a podobným organizacím ",null,null,{"$f":"SUM(AC161:AC163)","v":500},{"$f":"SUM(AD161:AD163)","v":27813.957629999997},{"$f":"AE161+AE162+AE163","v":21658.989000000001},{"$f":"AE160/AD160","v":0.77870935478231706},{"$f":"AG162","v":500},{"$f":"AH161+AH162+AH163","v":4967.9889999999996},{"$f":"SUM(AI161:AI163)","v":4967.9889999999996},{"$f":"AI160/AH160","v":1},0,{"$f":"SUM(AL161:AL163)","v":22845.968629999999},{"$f":"SUM(AM161:AM163)","v":16691},{"$f":"AM160/AL160","v":0.73058841453902501}]
[{"$f":"IF(COUNTBLANK(C161:IV161)=254,\"odstr\",IF(AND($A$1=\"TISK\",SUM(J131:U131)=0),\"odstr\",\"OK\"))","v":{"$error":"#REF!"}},"OK",null,null,null,null,null,null,null,null,null,null,null,null,null,null,null,null,null,null,null,null,null,5621,null,"Neinvestiční půjčené prostředky obecně prospěšným společnostem",null,null,0,7750,7750,{"$f":"AE161/AD161","v":1},0,2050,2050,{"$f":"AI161/AH161","v":1},0,5700,5700,{"$f":"AM161/AL161","v":1}]
[{"$f":"IF(COUNTBLANK(C162:IV162)=254,\"odstr\",IF(AND($A$1=\"TISK\",SUM(J132:U132)=0),\"odstr\",\"OK\"))","v":{"$error":"#REF!"}},null,null,null,6314,null,"Investiční transfery finančním a podobným institucím ve vlastnictví státu",null,null,0,0,0,"x ",0,0,0,"x ",0,0,0,"x ",null,null,5622,null,"Neinvestiční půjčené prostředky občanským sdružením",null,null,500,8865.9686299999994,2711,{"$f":"AE162/AD162","v":0.30577595219846837},500,1156,1156,{"$f":"AI162/AH162","v":1},0,7709.9686300000003,1555,{"$f":"AM162/AL162","v":0.20168694253169742}]
[{"$f":"IF(COUNTBLANK(C163:IV163)=254,\"odstr\",IF(AND($A$1=\"TISK\",SUM(J133:U133)=0),\"odstr\",\"OK\"))","v":{"$error":"#REF!"}},"OK",null,null,6321,null,"Investiční transfery obecně prospěšným organizacím",null,null,604,1705,1555.57,0.91235777126099704,604,1705,1555.57,0.91235777126099704,0,0,0,"x ",null,null,5629,null,"Ostatní neinvestiční půjčené prostředky neziskovým a podobným organizacím",null,null,0,11197.989,11197.989,{"$f":"AE163/AD163","v":1},0,1761.989,1761.989,{"$f":"AI163/AH163","v":1},0,9436,9436,{"$f":"AM163/AL163","v":1}]
[null,null,null,null,6322,null,"Investiční transfery občanským sdružením",null,null,0,3080.279,3065.279,0.99513031124777984,0,2015,2000,0.99255583126550873,0,1065.279,1065.279,1,null,null,564,null,"Neinvestiční půjdčené prostřeky veřejným rozpočtům územní úrovně",null,null,"x","x","x","x",0,null,0,"x",0,null,0,"x"]
[{"$f":"IF(COUNTBLANK(C165:IV165)=254,\"odstr\",IF(AND($A$1=\"TISK\",SUM(J134:U134)=0),\"odstr\",\"OK\"))","v":{"$error":"#REF!"}},"OK",null,null,6323,null,"Investiční transfery církvím a náboženským společnostem",null,null,0,365,300,0.82191780821917804,0,215,150,0.69767441860465118,0,150,150,1,null,null,5649,null,"Ostatní neinvestiční půjčené prostředky veřejným rozpočtům územní úrovně",null,null,"x","x","x","x","x",null,0,"x","x",null,0,"x"]
[null,null,null,null,6329,null,"Ostatní investiční transfery neziskovým a podobným organizacím",null,null,0,488.142,488.14190000000002,0.99999979514157766,0,488.142,488.14190000000002,0.99999979514157766,0,0,0,"x ",null,null,565,null,"Neinvestiční půjčené prostředky příspěvkovým a podobným organizacím ",null,null,{"$f":"SUM(AC167:AC168)","v":110969.42600000001},{"$f":"AD167","v":403538.76577},{"$f":"AE167","v":368366.91703000001},{"$f":"AE166/AD166","v":0.91284146227466423},{"$f":"AG167","v":36398.815999999999},{"$f":"AH167","v":112225.98626000001},{"$f":"AI167","v":99544.299629999994},{"$f":"AI166/AH166","v":0.88699866178391462},{"$f":"AK167","v":74570.61},{"$f":"AL167","v":291312.77951000002},{"$f":"AM167","v":268822.61739999999},{"$f":"AM166/AL166","v":0.92279720049415814}]
[{"$f":"IF(COUNTBLANK(C167:IV167)=254,\"odstr\",IF(AND($A$1=\"TISK\",SUM(J135:U135)=0),\"odstr\",\"OK\"))","v":{"$error":"#REF!"}},"OK",null,null,6331,null,"Investiční transfery státnímu rozpočtu",null,null,300,50,50,1,300,50,50,1,0,0,0,"x ",null,null,5651,null,"Neinvestiční půjčené prostředky zřízeným příspěvkovým organizacím",null,null,110969.42600000001,403538.76577,368366.91703000001,{"$f":"AE167/AD167","v":0.91284146227466423},36398.815999999999,112225.98626000001,99544.299629999994,{"$f":"AI167/AH167","v":0.88699866178391462},74570.61,291312.77951000002,268822.61739999999,{"$f":"AM167/AL167","v":0.92279720049415814}]
[{"$f":"IF(COUNTBLANK(C168:IV168)=254,\"odstr\",IF(AND($A$1=\"TISK\",SUM(J136:U136)=0),\"odstr\",\"OK\"))","v":{"$error":"#REF!"}},"OK",null,null,6335,null,"Investiční transfery státním finančním aktivům",null,null,0,0,0,"x ",0,0,0,"x ",0,0,0,"x ",null,null,5659,null,"Neinvestiční půjčené prostředky ostatním příspěvkovým organizacím",null,null,"x","x","x","x","x","x","x","x","x","x","x","x"]
[null,null,null,null,6339,null,"Ostatní investiční transfery jiným veřejným rozpočtům",null,null,60,60,0,0,60,60,0,0,0,0,0,"x ",null,null,566,null,"Neinvestiční půjčené prostředky obyvatelstvu",null,null,"x","x","x","x",0,null,0,"x",0,null,"x","x"]
[{"$f":"IF(COUNTBLANK(C170:IV170)=254,\"odstr\",IF(AND($A$1=\"TISK\",SUM(J137:U137)=0),\"odstr\",\"OK\"))","v":{"$error":"#REF!"}},"OK",null,null,6351,null,"Investiční dotace zřízeným příspěvkovým a podobným organizacím",null,null,1193872.798,2488502.63136,2026160.92405,0.81420887344719262,639711.79799999995,1350701.4188400002,1030414.7503100003,0.76287381943741039,554161,1137801.2125200001,995746.17373999988,0.87514951011049025,null,null,5660,null,"Neinvestiční půjčené prostředky obyvatelstvu",null,null,"x","x","x","x","x",null,"x","x","x",null,"x","x"]
[{"$f":"IF(COUNTBLANK(C171:IV171)=254,\"odstr\",IF(AND($A$1=\"TISK\",SUM(J138:U138)=0),\"odstr\",\"OK\"))","v":{"$error":"#REF!"}},"OK",null,null,6352,null,"Investiční dotace vysokým školám",null,null,0,11415,11415,1,0,2525,2525,1,0,8890,8890,1,null,null,59,"Ostatní neinvestiční výdaje","Ostatní neinvestiční výdaje",null,null,{"$f":"AC172","v":6006851.1339999996},{"$f":"AD172","v":195938.09401999996},{"$f":"AE172","v":13204.675789999999},{"$f":"AE171/AD171","v":6.7392080422361153E-2},{"$f":"AG172","v":1193300.064},{"$f":"AH172","v":84060.01801},{"$f":"AI172","v":9407.0254999999997},{"$f":"AI171/AH171","v":0.11190844021566727},{"$f":"AK172","v":4813551.0699999994},{"$f":"AL172","v":111878.07601},{"$f":"AM172","v":3797.65029},{"$f":"AM171/AL171","v":3.3944544145186717E-2}]
[null,null,null,null,6353,null,"Investiční transfery školským právnickým osobám zřízeným státem, kraji a obcemi",null,null,2973.2750000000001,3474.4167400000001,2014.60374,0.57983940636896658,2973.2750000000001,3474.4167400000001,2014.60374,0.57983940636896658,0,0,0,"x ",null,null,590,null,"Ostatní neinvestiční výdaje",null,null,{"$f":"SUM(AC173:AC175)","v":6006851.1339999996},{"$f":"SUM(AD173:AD175)","v":195938.09401999996},{"$f":"AE174+AE175","v":13204.675789999999},{"$f":"AE172/AD172","v":6.7392080422361153E-2},{"$f":"AG173+AG175","v":1193300.064},{"$f":"AH173+AH174+AH175","v":84060.01801},{"$f":"AI173+AI174+AI175","v":9407.0254999999997},{"$f":"AI172/AH172","v":0.11190844021566727},{"$f":"AK173+AK175","v":4813551.0699999994},{"$f":"AL173+AL175","v":111878.07601},{"$f":"AM175","v":3797.65029},{"$f":"AM172/AL172","v":3.3944544145186717E-2}]
[{"$f":"IF(COUNTBLANK(C173:IV173)=254,\"odstr\",IF(AND($A$1=\"TISK\",SUM(J139:U139)=0),\"odstr\",\"OK\"))","v":{"$error":"#REF!"}},"OK",null,null,6354,null,"Investiční transfery veřejným výzkumným institucím",null,null,0,0,0,"x ",0,0,0,"x ",0,0,0,"x ",null,null,5901,null,"Nespecifikované rezervy",null,null,4943920.0999999996,148903.25365999999,0,"x",191687.13,66612.701289999997,0,"x",4752232.97,82290.552370000005,0,"x"]
[{"$f":"IF(COUNTBLANK(C174:IV174)=254,\"odstr\",IF(AND($A$1=\"TISK\",SUM(J140:U140)=0),\"odstr\",\"OK\"))","v":{"$error":"#REF!"}},"OK",null,null,6356,null,"Jiné investiční transfery zřízeným příspěvkovým organizacím",null,null,350,128631.74906,80441.803859999985,0.6253650785894086,350,95567.954870000001,47378.023669999995,0.49575219784129293,0,33063.794190000001,33063.780189999998,0.9999995765761206,null,null,5902,null,"Ostatní výdaje z finančního vypořádání minulých let",null,null,0,16.14357,16.14357,{"$f":"AE174/AD174","v":1},0,16.14357,16.14357,{"$f":"AI174/AH174","v":1},0,0,0,"x"]
[{"$f":"IF(COUNTBLANK(C175:IV175)=254,\"odstr\",IF(AND($A$1=\"TISK\",SUM(J141:U141)=0),\"odstr\",\"OK\"))","v":{"$error":"#REF!"}},"OK",null,null,6359,null,"Investiční dotace ostatním příspěvkovým organizacím",null,null,75,760.2,623.34500000000003,0.81997500657721656,75,760.2,623.34500000000003,0.81997500657721656,0,0,0,"x ",null,null,5909,null,"Ostatní neinvestiční výdaje jinde nezařazené",null,null,1062931.034,47018.696790000002,13188.532219999999,0.28049548627228121,1001612.934,17431.173149999999,9390.8819299999996,0.53874067162255224,61318.1,29587.523639999999,3797.65029,{"$f":"AM175/AL175","v":0.12835309694069416}]
[null,null,null,null,6371,null,"Účelové investiční transfery nepodnikajícím fyzickým osobám",null,null,0,0,0,"x ",0,0,0,"x ",0,0,0,"x ",null,null,6,null,"KAPITÁLOVÉ VÝDAJE",null,null,{"$f":"AC177+AC193+AC197+AC222+AC234","v":17791054.800779998},{"$f":"AD177+AD193+AD197+AD222+AD234","v":28244967.443350006},{"$f":"AE177+AE193+AE197+AE234","v":20029888.189170003},0.70914892110756667,{"$f":"AG177+AG193+AG197+AG222+AG234","v":13626442.910780001},{"$f":"AH177+AH193+AH197+AH222+AH234","v":20741280.472260006},{"$f":"AI177+AI193+AI197+AI222+AI234","v":15311465.482620003},0.73821216115842048,{"$f":"AK177+AK193+AK197+AK222+AK234","v":4164611.89},{"$f":"AL177+AL193+AL197+AL222+AL234","v":7549566.9710900001},{"$f":"AM177+AM193+AM197+AM234","v":4897393.3783099996},{"$f":"AM176/AL176","v":0.64869858060255314}]
[{"$f":"IF(COUNTBLANK(C177:IV177)=254,\"odstr\",IF(AND($A$1=\"TISK\",SUM(J142:U142)=0),\"odstr\",\"OK\"))","v":{"$error":"#REF!"}},"OK",null,null,6380,null,"Investiční transfery do zahraničí",null,null,0,0,0,"x ",0,0,0,"x ",0,0,0,"x ",null,null,61,"Investiční nákupy a související výdaje","Investiční nákupy a související výdaje",null,null,{"$f":"AC178+AC183+AC191","v":14758877.76378},{"$f":"AD178+AD183+AD191","v":23012728.943360005},{"$f":"AE178+AE183+AE191","v":16678216.326730002},0.72473874644676872,{"$f":"AG178+AG183+AG191","v":12631127.553780001},{"$f":"AH178+AH183+AH191","v":18999420.441210005},{"$f":"AI178+AI183+AI191","v":13769173.630480003},0.72471545503643231,{"$f":"AK178+AK183+AK191","v":2127750.21},{"$f":"AL178+AL183+AL191","v":4059188.5021500001},{"$f":"AM178+AM183+AM191","v":2909042.6962499996},{"$f":"AM177/AL177","v":0.71665622197865131}]
[null,null,null,null,63,null,"Investiční transfery",null,null,1198235.0729999999,2640364.4181600004,2127946.6675499999,0.80592915618553485,644074.07299999997,1458930.1324500002,1088567.4346200002,0.74614089489806812,554161,1181434.2857100002,1039379.2329299998,0.8797605127105057,null,null,611,null,"Pořízení dlouhodobého nehmotného majetku",null,null,{"$f":"SUM(AC179:AC182)","v":9826.2999999999993},{"$f":"SUM(AD179:AD182)","v":55831.78095},38261.815609999998,0.68530530387818478,{"$f":"SUM(AG179:AG182)","v":5095.3},{"$f":"SUM(AH179:AH182)","v":23722.408640000001},{"$f":"SUM(AI179:AI182)","v":17239.351289999999},0.72671167382773816,{"$f":"SUM(AK179:AK182)","v":4731},{"$f":"SUM(AL179:AL182)","v":32109.372309999999},{"$f":"SUM(AM179:AM182)","v":21022.464319999999},{"$f":"AM178/AL178","v":0.65471427211465161}]
[{"$f":"IF(COUNTBLANK(C179:IV179)=254,\"odstr\",IF(AND($A$1=\"TISK\",SUM(J143:U143)=0),\"odstr\",\"OK\"))","v":{"$error":"#REF!"}},"OK",null,null,6412,null,"Investiční půjčené prostředky nefinančním podnikatelským subjektům – fyzickým osobám",null,null,0,0,0,"x ",0,0,0,"x ",0,0,0,"x ",null,null,6111,null,"Programové vybavení",null,null,4733,49263.180950000002,32966.4444,0.66919033168928976,1532,17153.808639999999,11943.980079999999,0.69628735697496968,3201,32109.372309999999,21022.464319999999,{"$f":"AM179/AL179","v":0.65471427211465161}]
[{"$f":"IF(COUNTBLANK(C180:IV180)=254,\"odstr\",IF(AND($A$1=\"TISK\",SUM(J144:U144)=0),\"odstr\",\"OK\"))","v":{"$error":"#REF!"}},"OK",null,null,6413,null,"Investiční půjčené prostředky nefinančním podnikatelským subjektům – právnickým osobám",null,null,0,770.7,770.649,0.99993382639159201,0,770.7,770.649,0.99993382639159201,0,0,0,"x ",null,null,6112,null,"Ocenitelná práva",null,null,600,0,0,"x",600,0,0,"x",0,0,0,"x"]
[{"$f":"IF(COUNTBLANK(C181:IV181)=254,\"odstr\",IF(AND($A$1=\"TISK\",SUM(J145:U145)=0),\"odstr\",\"OK\"))","v":{"$error":"#REF!"}},"OK",null,null,6421,null,"Investiční půjčené prostředky obecně prospěšným organizacím",null,null,0,0,0,"x ",0,0,0,"x ",0,0,0,"x ",null,null,6113,null,"Nehmotné výsledky výzkumné a obdobné činnosti",null,null,0,0,0,"x",",",0,0,"x",0,0,null,"x"]
[{"$f":"IF(COUNTBLANK(C182:IV182)=254,\"odstr\",IF(AND($A$1=\"TISK\",SUM(J146:U146)=0),\"odstr\",\"OK\"))","v":{"$error":"#REF!"}},"OK",null,null,6422,null,"Investiční půjčené prostředky občanským sdružením",null,null,0,0,0,"x ",0,0,0,"x ",0,0,0,"x ",null,null,6119,null,"Ostatní nákupy dlouhodobého nehmotného majetku",null,null,4493.3,6568.6,5295.3712100000002,{"$f":"AE182/AD182","v":0.80616435922418783},2963.3,6568.6,5295.3712100000002,{"$f":"AI182/AH182","v":0.80616435922418783},1530,0,0,"x"]
[null,null,null,null,6429,null,"Ostatní investiční půjčené prostředky neziskovým a podobným organizacím",null,null,0,180.5,180.5,1,0,180.5,180.5,1,0,0,0,"x ",null,null,612,null,"Pořízení dlouhodobého hmotného majektu",null,null,{"$f":"SUM(AC184:AC190)","v":14695667.063779999},{"$f":"SUM(AD184:AD190)","v":22876965.038410004},16521431.852320001,{"$f":"AE183/AD183","v":0.72218634878275245},{"$f":"SUM(AG184:AG190)","v":12587084.85378},{"$f":"SUM(AH184:AH190)","v":18876580.248570003},{"$f":"SUM(AI184:AI190)","v":13654972.912390001},{"$f":"AI183/AH183","v":0.72338171070072055},{"$f":"SUM(AK184:AK190)","v":2108582.21},{"$f":"SUM(AL184:AL190)","v":4000384.7898400002},{"$f":"SUM(AM184:AM190)","v":2866458.9399299999},{"$f":"AM183/AL183","v":0.71654580509607602}]
[{"$f":"IF(COUNTBLANK(C184:IV184)=254,\"odstr\",IF(AND($A$1=\"TISK\",SUM(J147:U147)=0),\"odstr\",\"OK\"))","v":{"$error":"#REF!"}},"OK",null,null,6451,null,"Investiční půjčené prostředky zřízeným příspěvkovým organizacím",null,null,208213,242192.74198000002,132150.36950999999,0.5456413285948627,0,757,757,1,208213,241435.74198000002,131393.36950999999,0.54421672794777964,null,null,6121,null,"Budovy, haly a stavby",null,null,14233661.664039999,21426356.589590002,15370861.977390001,{"$f":"AE184/AD184","v":0.7173810401745081},12364189.45404,18100969.610010002,12984891.28324,{"$f":"AI184/AH184","v":0.71735887982814117},1869472.21,3325386.97958,2385970.6941499999,{"$f":"AM184/AL184","v":0.71750166485927314}]
[{"$error":"#REF!"},"OK",null,null,6452,null,"Investiční půjčené prostředky vysokým školám",null,null,0,5000,5000,1,0,5000,5000,1,0,0,0,"x ",null,null,6122,null,"Stroje, přístroje a zařízení",null,null,426116.39974000002,1228191.62319,971526.52104999998,{"$f":"AE185/AD185","v":0.79102194047427232},210996.39973999999,652459.38104999997,564634.68435,{"$f":"AI185/AH185","v":0.86539438430839311},215120,575732.24213999999,406891.83669999999,{"$f":"AM185/AL185","v":0.70673797108805425}]
[{"$error":"#REF!"},"OK",null,null,64,null,"Investiční půjčené prostředky",null,null,208213,248143.94198000003,138101.51850999999,0.55653794087437658,0,6708.2,6708.1489999999994,0.99999239736441958,208213,241435.74198000002,131393.36950999999,0.54421672794777964,null,null,6123,null,"Dopravní prostředky",null,null,6203,52837.855230000001,51031.294869999998,{"$f":"AE186/AD186","v":0.96580935482456365},1650,2566.944,2513.4960500000002,{"$f":"AI186/AH186","v":0.9791783731939615},4553,50270.911229999998,48517.798820000004,{"$f":"AM186/AL186","v":0.96512670315484961}]
[{"$error":"#REF!"},"OK",null,null,6901,null,"Rezervy kapitálových výdajů",null,null,277526.41599999997,94835.10514,0,0,203160.416,23716.345829999998,0,0,74366,71118.759310000009,0,0,null,null,6124,null,"Pěstitelské celky trvalých porostů",null,null,0,0,0,"x",0,0,0,"x",0,0,0,"x"]
[{"$error":"#REF!"},"OK",null,null,6909,null,"Ostatní kapitálové výdaje jinde nezařazené",null,null,70487,0,0,"x ",0,0,0,"x ",70487,0,0,"x ",null,null,6125,null,"Výpočetní technika",null,null,23729,147578.37450999999,109201.08215,{"$f":"AE188/AD188","v":0.7399531436267478},5189,98652.931620000003,84122.471890000001,{"$f":"AI188/AH188","v":0.85271132351170564},18540,48925.442889999998,25078.610260000001,{"$f":"AM188/AL188","v":0.5125883135362661}]
[{"$error":"#REF!"},"OK",null,null,69,null,"Ostatní kapitálové výdaje",null,null,348013.41599999997,94835.10514,0,0,203160.416,23716.345829999998,0,0,144853,71118.759310000009,0,0,null,null,6127,null,"Umělecká díla a předměty",null,null,100,54,53.978999999999999,0.99961111111111112,100,54,53.978999999999999,0.99961111111111112,0,0,0,"x"]
[{"$error":"#REF!"},"OK",null,null,6,null,"Kapitálové výdaje",null,null,10731261.462609999,17221219.520059995,11445159.953419998,0.66459636845626402,8830185.8825499993,13821132.587879995,9391150.8631399982,0.67947766244390639,1901075.5800600001,3400086.9321800005,2054009.0902800001,0.60410487474302643,null,null,6129,null,"Nákup dlouhodobého hmotného majetku jinde nezařazený",null,null,5857,21946.595890000001,18756.997859999999,0.8546654776901712,4960,21877.381890000001,18756.997859999999,0.85736940344647428,897,69.213999999999999,0,"x"]
[null,null,null,null,"Výdaje kapitoly 700-Obce a DSO; KÚ (část: vzdělávání) celkem",null,null,null,null,79101036.827019989,147279632.54367995,140246463.74780998,0.95224615464881679,34550364.375960007,46582644.490569986,41301069.084769994,0.8866192449235214,44550672.45105999,100696988.05310996,98945394.663039982,0.98260530504501142,null,null,613,null,"Pozemky",null,null,{"$f":"SUM(AC192:AC194)","v":53384.4},{"$f":"AD192","v":79932.123999999996},{"$f":"SUM(AE192:AE194)","v":118522.6588},1.482791309286364,{"$f":"AG192","v":38947.4},{"$f":"SUM(AH192:AH194)","v":99117.784},{"$f":"SUM(AI192:AI194)","v":96961.366800000003},0.97824389213544161,{"$f":"AK192","v":14437},{"$f":"SUM(AL192:AL194)","v":26694.34},{"$f":"SUM(AM192:AM194)","v":21561.292000000001},{"$f":"AM191/AL191","v":0.80771024868942265}]
[{"$f":"IF(COUNTBLANK(C192:IV192)=254,\"odstr\",IF(AND($A$1=\"TISK\",SUM(J154:U154)=0),\"odstr\",\"OK\"))","v":{"$error":"#REF!"}},"OK",null,"Komentáře:",null,null,null,null,null,null,null,null,null,null,null,null,null,null,null,null,"Zdroj: Závěrečný účet – kapitola 700-Obce a DSO; KÚ (část: vzdělávání)",null,null,6130,null,"Pozemky",null,null,53384.4,79932.123999999996,72642.658800000005,0.90880431001683393,38947.4,54237.784,52081.366800000003,0.96024142136780521,14437,25694.34,20561.292000000001,{"$f":"AM192/AL192","v":0.80022650902883674}]
[{"$f":"IF(COUNTBLANK(C193:IV193)=254,\"odstr\",IF(AND($A$1=\"TISK\",SUM(J155:U155)=0),\"odstr\",\"OK\"))","v":{"$error":"#REF!"}},"OK",null,"1)","Tabulka neobsahuje z daných tříd následující položky: 5321, 5323, 5329, 5344, 5345, 5349, 5366, 5367, 5641, 5642, 5649, 6341, 6342, 6349, 6441, 6442, 6449.",null,null,null,null,null,null,null,null,null,null,null,null,null,null,null,null,null,null,62,"Nákup akcií a majetkových podílů a vklady do fundací a ústavů","Nákup akcií a majetkových podílů  a vklady do fundací a ústavů",null,null,{"$f":"AC195","v":0},{"$f":"AD194+AD195","v":23440},{"$f":"AE194+AE195","v":23440},1,{"$f":"AG194+AG195","v":0},{"$f":"AH194+AH195","v":22440},{"$f":"AI194+AI195","v":22440},1,{"$f":"AK194+AK195","v":0},{"$f":"AL194+AL195","v":1000},{"$f":"AM194+AM196","v":1000},{"$f":"AM193/AL193","v":1}]
[{"$f":"IF(COUNTBLANK(C194:IV194)=254,\"odstr\",IF(AND($A$1=\"TISK\",SUM(J156:U156)=0),\"odstr\",\"OK\"))","v":{"$error":"#REF!"}},"OK",null,null,null,null,null,null,null,null,null,null,null,null,null,null,null,null,null,null,null,null,null,6202,null,"Nákup majetkových podílů",null,null,0,22440,22440,1,0,22440,22440,1,0,0,0,"x"]
[null,null,null,null,null,null,null,null,null,null,null,null,null,null,null,null,null,null,null,null,null,null,null,621,null,"Vklady do fundací a ústavů",null,null,{"$f":"AC196","v":0},{"$f":"AD196","v":1000},1000,1,0,0,0,"x",0,{"$f":"AL196","v":1000},{"$f":"AM196","v":1000},{"$f":"AM195/AL195","v":1}]
[null,null,null,null,null,null,null,null,null,null,null,null,null,null,null,null,null,null,null,null,null,null,null,6212,null,"Vklady do nadačních fondů",null,null,0,1000,1000,1,0,0,0,"x",0,1000,1000,1]
[{"$f":"IF(COUNTBLANK(C197:IV197)=254,\"odstr\",IF(AND($A$1=\"TISK\",SUM(J157:U157)=0),\"odstr\",\"OK\"))","v":{"$error":"#REF!"}},"OK",null,null,null,null,null,null,null,null,null,null,null,null,null,null,null,null,null,null,null,null,null,63,"Investiční transfery",null,null,null,{"$f":"AC198+AC202+AC207+AC211","v":1482944.0520000001},{"$f":"AD198+AD202+AD207+AD211","v":3527425.4672499998},{"$f":"AE198+AE202+AE207+AE211","v":3328231.8624400003},0.94353003156001714,{"$f":"AG198+AG202+AG207+AG211","v":637651.10200000007},{"$f":"AH198+AH202+AH207+AH211","v":1432062.0684400003},{"$f":"AI198+AI202+AI207+AI211","v":1340881.1803799998},{"$f":"AI197/AH197","v":0.93632895523912085},{"$f":"AK198+AK202+AK207+AK211","v":845292.95},{"$f":"AL198+AL202+AL207+AL211","v":2095363.3988099999},{"$f":"AM198+AM202+AM207+AM211","v":1987350.6820600003},0.94845155889840282]
[null,null,null,null,null,null,null,null,null,null,null,null,null,null,null,null,null,null,null,null,null,null,null,631,null,"Investiční transfery podnikatelským subjektům ",null,null,{"$f":"SUM(AC199:AC201)","v":0},{"$f":"SUM(AD199:AD201)","v":10682.22},7410.7024000000001,0.6937417877557287,0,{"$f":"AH200","v":7298},{"$f":"AI200","v":4026.5014000000001},{"$f":"AI198/AH198","v":0.55172669224445059},0,{"$f":"SUM(AL199:AL201)","v":3384.22},{"$f":"SUM(AM199:AM201)","v":3384.201},0.99999438570778498]
[{"$f":"IF(COUNTBLANK(C199:IV199)=254,\"odstr\",IF(AND($A$1=\"TISK\",SUM(J158:U158)=0),\"odstr\",\"OK\"))","v":{"$error":"#REF!"}},"OK",null,null,null,null,null,null,null,null,null,null,null,null,null,null,null,null,null,null,null,null,null,6312,null,"Investiční transfery nefinančním podnikatelským subjektům-fyzickým osobám",null,null,0,210,210,1,0,0,0,"x",0,210,210,1]
[{"$f":"IF(COUNTBLANK(C200:IV200)=254,\"odstr\",IF(AND($A$1=\"TISK\",SUM(J159:U159)=0),\"odstr\",\"OK\"))","v":{"$error":"#REF!"}},"OK",null,null,null,null,null,null,null,null,null,null,null,null,null,null,null,null,null,null,null,null,null,6313,null,"Investiční dotace nefinančním podnikatelským subjektům – právnickým osobám",null,null,0,10472.219999999999,7200.7024000000001,0.68760037508761285,0,7298,4026.5014000000001,{"$f":"AI200/AH200","v":0.55172669224445059},0,3174.22,3174.201,0.99999401427752332]
[{"$f":"IF(COUNTBLANK(C201:IV201)=254,\"odstr\",IF(AND($A$1=\"TISK\",SUM(J160:U160)=0),\"odstr\",\"OK\"))","v":{"$error":"#REF!"}},"OK",null,null,null,null,null,null,null,null,null,null,null,null,null,null,null,null,null,null,null,null,null,6314,null,"Investiční transfery finančním a podobným institucím ve vlastnictví státu",null,null,0,0,0,"x",0,0,0,"x",0,null,0,"x"]
[null,null,null,null,null,null,null,null,null,null,null,null,null,null,null,null,null,null,null,null,null,null,null,632,null,"Investiční transfery neziskovým a podobným organizacím ",null,null,{"$f":"SUM(AC203:AC206)","v":6649},{"$f":"SUM(AD203:AD206)","v":43851.235189999992},42748.6348,{"$f":"AE202/AD202","v":0.97485588752009811},{"$f":"SUM(AG203:AG206)","v":5649},{"$f":"SUM(AH203:AH206)","v":16464.044000000002},{"$f":"SUM(AI203:AI206)","v":16389.734},{"$f":"AI202/AH202","v":0.99548652809722804},{"$f":"SUM(AK203:AK206)","v":1000},{"$f":"SUM(AL203:AL206)","v":27387.191190000001},{"$f":"SUM(AM203:AM206)","v":26358.900800000003},{"$f":"AM202/AL202","v":0.9624536016539198}]
[{"$f":"IF(COUNTBLANK(C203:IV203)=254,\"odstr\",IF(AND($A$1=\"TISK\",SUM(J162:U162)=0),\"odstr\",\"OK\"))","v":{"$error":"#REF!"}},"OK",null,null,null,null,null,null,null,null,null,null,null,null,null,null,null,null,null,null,null,null,null,6321,null,"Investiční transfery obecně prospěšným organizacím",null,null,300,3978,3976.2530000000002,0.99956083459024636,300,3228,3228,1,0,750,748.25300000000004,{"$f":"AM203/AL203","v":0.99767066666666671}]
[{"$f":"IF(COUNTBLANK(C204:IV204)=254,\"odstr\",IF(AND($A$1=\"TISK\",SUM(J163:U163)=0),\"odstr\",\"OK\"))","v":{"$error":"#REF!"}},"OK",null,null,null,null,null,null,null,null,null,null,null,null,null,null,null,null,null,null,null,null,null,6322,null,"Investiční transfery občanským sdružením",null,null,4354,21479.901849999998,20567.381799999999,0.95751749442933332,4354,11106.044,11061.734,0.99601028052833218,0,10373.85785,9505.6478000000006,{"$f":"AM204/AL204","v":0.91630789022234393}]
[{"$f":"IF(COUNTBLANK(C205:IV205)=254,\"odstr\",IF(AND($A$1=\"TISK\",SUM(J164:U164)=0),\"odstr\",\"OK\"))","v":{"$error":"#REF!"}},"OK",null,null,null,null,null,null,null,null,null,null,null,null,null,null,null,null,null,null,null,null,null,6323,null,"Investiční transfery církvím a náboženským společnostem",null,null,0,9080,9080,1,0,1000,1000,1,0,8080,8080,{"$f":"AM205/AL205","v":1}]
[{"$f":"IF(COUNTBLANK(C206:IV206)=254,\"odstr\",IF(AND($A$1=\"TISK\",SUM(J165:U165)=0),\"odstr\",\"OK\"))","v":{"$error":"#REF!"}},"OK",null,null,null,null,null,null,null,null,null,null,null,null,null,null,null,null,null,null,null,null,null,6329,null,"Ostatní investiční transfery neziskovým a podobným organizacím",null,null,1995,9313.3333399999992,9125,0.97977809521848391,995,1130,1100,0.97345132743362828,1000,8183.3333400000001,8025,{"$f":"AM206/AL206","v":0.98065173036199449}]
[null,null,null,null,null,null,null,null,null,null,null,null,null,null,null,null,null,null,null,null,null,null,633,633,null,"Investiční transfery veřwejným rozpočtům ústřední úrovně",null,null,{"$f":"SUM(AC208:AC210)","v":110},{"$f":"SUM(AD208:AD210)","v":179.685},179.685,1,{"$f":"SUM(AG208:AG210)","v":110},{"$f":"AH208","v":179.685},{"$f":"AI208","v":179.685},1,0,{"$f":"SUM(AL208:AL210)","v":0},{"$f":"SUM(AM208:AM210)","v":0},"x"]
[{"$f":"IF(COUNTBLANK(C208:IV208)=254,\"odstr\",IF(AND($A$1=\"TISK\",SUM(J166:U166)=0),\"odstr\",\"OK\"))","v":{"$error":"#REF!"}},"OK",null,null,null,null,null,null,null,null,null,null,null,null,null,null,null,null,null,null,null,null,null,6331,null,"Investiční transfery státnímu rozpočtu",null,null,50,179.685,179.685,1,50,179.685,179.685,1,0,0,0,"x"]
[{"$f":"IF(COUNTBLANK(C209:IV209)=254,\"odstr\",IF(AND($A$1=\"TISK\",SUM(J167:U167)=0),\"odstr\",\"OK\"))","v":{"$error":"#REF!"}},"OK",null,null,null,null,null,null,null,null,null,null,null,null,null,null,null,null,null,null,null,null,null,6335,null,"Investiční transfery státním finančním aktivům",null,null,null,0,0,"x",0,0,0,"x",0,0,0,"x"]
[{"$f":"IF(COUNTBLANK(C210:IV210)=254,\"odstr\",IF(AND($A$1=\"TISK\",SUM(J168:U168)=0),\"odstr\",\"OK\"))","v":{"$error":"#REF!"}},"OK",null,null,null,null,null,null,null,null,null,null,null,null,null,null,null,null,null,null,null,null,null,6339,null,"Ostatní investiční transfery jiným veřejným rozpočtům",null,null,60,0,0,"x",60,0,0,"x",0,0,0,"x"]
[null,null,null,null,null,null,null,null,null,null,null,null,null,null,null,null,null,null,null,null,null,null,null,635,null,"Investiční transfery příspěvkovým a podobným organizacím ",null,null,{"$f":"SUM(AC212:AC217)","v":1476185.0520000001},{"$f":"SUM(AD212:AD217)","v":3472712.3270599996},3277892.8402400003,{"$f":"AE211/AD211","v":0.94389990633490406},{"$f":"SUM(AG212:AG217)","v":631892.10200000007},{"$f":"SUM(AH212:AH217)","v":1408120.3394400002},{"$f":"SUM(AI212:AI217)","v":1320285.2599799999},{"$f":"AI211/AH211","v":0.93762246237070068},{"$f":"SUM(AK212:AK217)","v":844292.95},{"$f":"SUM(AL212:AL217)","v":2064591.98762},{"$f":"SUM(AM212:AM217)","v":1957607.5802600002},{"$f":"AM211/AL211","v":0.94818133171032581}]
[{"$f":"IF(COUNTBLANK(C212:IV212)=254,\"odstr\",IF(AND($A$1=\"TISK\",SUM(J169:U169)=0),\"odstr\",\"OK\"))","v":{"$error":"#REF!"}},"OK",null,null,null,null,null,null,null,null,null,null,null,null,null,null,null,null,null,null,null,null,null,6351,null,"Investiční dotace zřízeným příspěvkovým a podobným organizacím",null,null,1431754.9180000001,2874192.9439900001,2734536.20707,0.9514101037607704,594783.228,1111382.70603,1074382.5268999999,0.9667079765329718,836971.69,1762810.2379600001,1660153.6801700001,{"$f":"AM212/AL212","v":0.94176539506101431}]
[{"$error":"#REF!"},"OK",null,null,null,null,null,null,null,null,null,null,null,null,null,null,null,null,null,null,null,null,null,6352,null,"Investiční dotace vysokým školám",null,null,0,42876,39809.399640000003,0.92847746151693267,0,30900,30200.642639999998,0.97736707572815529,0,11976,9608.7569999999996,{"$f":"AM213/AL213","v":0.80233441883767531}]
[{"$error":"#REF!"},null,null,null,null,null,null,null,null,null,null,null,null,null,null,null,null,null,null,null,null,null,null,6353,null,"Investiční transfery školským právnickým osobám zřízeným státem, kraji a obcemi",null,null,2442.4,11025.358899999999,9934.7543000000005,0.90108216794647844,2442.4,11025.358899999999,9934.7543000000005,0.90108216794647844,0,0,0,"x"]
[{"$error":"#REF!"},"OK",null,null,null,null,null,null,null,null,null,null,null,null,null,null,null,null,null,null,null,null,null,6354,null,"Investiční transfery veřejným výzkumným institucím",null,null,0,3210.3,3050.8391099999999,0.95032835249042136,0,3210.3,3050.8391099999999,0.95032835249042136,0,0,0,"x"]
[{"$error":"#REF!"},"OK",null,null,null,null,null,null,null,null,null,null,null,null,null,null,null,null,null,null,null,null,null,6356,null,"Jiné investiční transfery zřízeným příspěvkovým organizacím",null,null,41096.06,530202.02816999995,479457.54771999997,0.9042921796713127,33774.800000000003,240396.27851,191612.40463,0.79706893059090889,7321.26,289805.74965999997,287845.14309000003,{"$f":"AM216/AL216","v":0.99323475613475531}]
[{"$error":"#REF!"},null,null,null,null,null,null,null,null,null,null,null,null,null,null,null,null,null,null,null,null,null,null,6359,null,"Investiční dotace ostatním příspěvkovým organizacím",null,null,891.67399999999998,11205.696,11104.0924,0.99093286128768798,891.67399999999998,11205.696,11104.0924,0.99093286128768798,0,0,0,"x"]
[null,null,null,null,null,null,null,null,null,null,null,null,null,null,null,null,null,null,null,null,null,null,null,637,null,"Investiční transfery obyvatelstvu",null,null,"x","x","x","x","x","x","x","x","x","x","x","x"]
[{"$f":"IF(COUNTBLANK(C219:IV219)=254,\"odstr\",IF(AND($A$1=\"TISK\",SUM(J175:U175)=0),\"odstr\",\"OK\"))","v":{"$error":"#REF!"}},"OK",null,null,null,null,null,null,null,null,null,null,null,null,null,null,null,null,null,null,null,null,null,6371,null,"Účelové investiční transfery nepodnikajícím fyzickým osobám",null,null,"x","x","x","x","x","x","x","x","x","x","x","x"]
[null,null,null,null,null,null,null,null,null,null,null,null,null,null,null,null,null,null,null,null,null,null,null,638,null,"Investiční transfery do zahraničí",null,null,"x","x","x","x","x","x","x","x","x","x","x","x"]
[null,null,null,null,null,null,null,null,null,null,null,null,null,null,null,null,null,null,null,null,null,null,null,6380,null,"Investiční transfery do zahraničí",null,null,"x","x","x","x","x","x","x","x","x","x","x","x"]
[{"$f":"IF(COUNTBLANK(C222:IV222)=254,\"odstr\",IF(AND($A$1=\"TISK\",SUM(J177:U177)=0),\"odstr\",\"OK\"))","v":{"$error":"#REF!"}},"OK",null,null,null,null,null,null,null,null,null,null,null,null,null,null,null,null,null,null,null,null,null,64,"Investiční půjčené prostředky","Investiční půjčené prostředky",null,null,{"$f":"AC226+AC230","v":714454.255},{"$f":"AD223+AD226+AD230","v":1517241.5876499999},{"$f":"AE223+AE226+AE230","v":1384611.02293},{"$f":"AE222/AD222","v":0.9125844125289061},{"$f":"AG223+AG226+AG230","v":55056.254999999997},{"$f":"AH223+AH226+AH230","v":201619.65065},{"$f":"AI223+AI226+AI230","v":178970.67176},{"$f":"AI222/AH222","v":0.88766482425208981},{"$f":"AK223+AK226+AK230","v":659398},{"$f":"AL223+AL226+AL230","v":1315621.9369999999},"x","x"]
[null,null,null,null,null,null,null,null,null,null,null,null,null,null,null,null,null,null,null,null,null,null,null,641,null,"Investiční půjčené prostředky podnikatelským subjektům",null,null,"x",{"$f":"AD225","v":1500},{"$f":"AE225","v":1500},{"$f":"AE223/AD223","v":1},0,{"$f":"AH225","v":1500},{"$f":"AI225","v":1500},{"$f":"AI223/AH223","v":1},0,0,null,"x"]
[{"$f":"IF(COUNTBLANK(C224:IV224)=254,\"odstr\",IF(AND($A$1=\"TISK\",SUM(J178:U178)=0),\"odstr\",\"OK\"))","v":{"$error":"#REF!"}},"OK",null,null,null,null,null,null,null,null,null,null,null,null,null,null,null,null,null,null,null,null,null,6412,null,"Investiční půjčené prostředky nefinančním podnikatelským subjektům – fyzickým osobám",null,null,"x","x","x","x","x","x","x","x","x","x","x","x"]
[{"$f":"IF(COUNTBLANK(C225:IV225)=254,\"odstr\",IF(AND($A$1=\"TISK\",SUM(J179:U179)=0),\"odstr\",\"OK\"))","v":{"$error":"#REF!"}},"OK",null,null,null,null,null,null,null,null,null,null,null,null,null,null,null,null,null,null,null,null,null,6413,null,"Investiční půjčené prostředky nefinančním podnikatelským subjektům – právnickým osobám",null,null,0,1500,1500,{"$f":"AE225/AD225","v":1},0,1500,1500,{"$f":"AI225/AH225","v":1},0,"x",0,"x"]
[null,null,null,null,null,null,null,null,null,null,null,null,null,null,null,null,null,null,null,null,null,null,null,642,null,"Investiční půjčené prostředky neziskovým a podobným organizacím",null,null,{"$f":"SUM(AC227:AC229)","v":3000},{"$f":"SUM(AD227:AD229)","v":8570.0313700000006},3725,{"$f":"AE226/AD226","v":0.43465418493561475},{"$f":"AG227","v":3000},{"$f":"AH227","v":3250},{"$f":"AI227","v":3250},{"$f":"AI226/AH226","v":1},0,{"$f":"SUM(AL227:AL229)","v":5320.0313699999997},{"$f":"SUM(AM227:AM229)","v":475},{"$f":"AM226/AL226","v":8.9285187805198979E-2}]
[{"$f":"IF(COUNTBLANK(C227:IV227)=254,\"odstr\",IF(AND($A$1=\"TISK\",SUM(J180:U180)=0),\"odstr\",\"OK\"))","v":{"$error":"#REF!"}},"OK",null,null,null,null,null,null,null,null,null,null,null,null,null,null,null,null,null,null,null,null,null,6421,null,"Investiční půjčené prostředky obecně prospěšným organizacím",null,null,3000,3250,3250,{"$f":"AE227/AD227","v":1},3000,3250,3250,{"$f":"AI227/AH227","v":1},0,0,0,"x"]
[{"$f":"IF(COUNTBLANK(C228:IV228)=254,\"odstr\",IF(AND($A$1=\"TISK\",SUM(J181:U181)=0),\"odstr\",\"OK\"))","v":{"$error":"#REF!"}},"OK",null,null,null,null,null,null,null,null,null,null,null,null,null,null,null,null,null,null,null,null,null,6422,null,"Investiční půjčené prostředky občanským sdružením",null,null,0,4845.0313699999997,0,"x",0,0,null,"x",0,4845.0313699999997,0,"x"]
[{"$f":"IF(COUNTBLANK(C229:IV229)=254,\"odstr\",IF(AND($A$1=\"TISK\",SUM(J182:U182)=0),\"odstr\",\"OK\"))","v":{"$error":"#REF!"}},"OK",null,null,null,null,null,null,null,null,null,null,null,null,null,null,null,null,null,null,null,null,null,6429,null,"Ostatní investiční půjčené prostředky neziskovým a podobným organizacím",null,null,0,475,475,{"$f":"AE229/AD229","v":1},0,0,null,"x",0,475,475,{"$f":"AM229/AL229","v":1}]
[null,null,null,null,null,null,null,null,null,null,null,null,null,null,null,null,null,null,null,null,null,null,null,645,null,"Investiční půjčené prostředky příspěvkovým a podobným organizacím ",null,null,{"$f":"SUM(AC231:AC233)","v":711454.255},{"$f":"SUM(AD231:AD233)","v":1507171.5562799999},1379386.02293,{"$f":"AE230/AD230","v":0.91521500467710515},{"$f":"AG231+AG232","v":52056.254999999997},{"$f":"SUM(AH231:AH233)","v":196869.65065},{"$f":"SUM(AI231:AI233)","v":174220.67176},{"$f":"AI230/AH230","v":0.88495444160529368},{"$f":"SUM(AK231:AK233)","v":659398},{"$f":"SUM(AL231:AL233)","v":1310301.9056299999},{"$f":"SUM(AM231:AM233)","v":1205165.3511699999},{"$f":"AM230/AL230","v":0.91976158013030607}]
[{"$f":"IF(COUNTBLANK(C231:IV231)=254,\"odstr\",IF(AND($A$1=\"TISK\",SUM(J183:U183)=0),\"odstr\",\"OK\"))","v":{"$error":"#REF!"}},"OK",null,null,null,null,null,null,null,null,null,null,null,null,null,null,null,null,null,null,null,null,null,6451,null,"Investiční půjčené prostředky zřízeným příspěvkovým organizacím",null,null,706454.255,1498949.5562799999,1371164.02293,{"$f":"AE231/AD231","v":0.91474994417615352},47056.254999999997,188647.65065,165998.67176,{"$f":"AI231/AH231","v":0.87994030770083165},659398,1310301.9056299999,1205165.3511699999,{"$f":"AM231/AL231","v":0.91976158013030607}]
[{"$f":"IF(COUNTBLANK(C232:IV232)=254,\"odstr\",IF(AND($A$1=\"TISK\",SUM(J184:U184)=0),\"odstr\",\"OK\"))","v":{"$error":"#REF!"}},"OK",null,null,null,null,null,null,null,null,null,null,null,null,null,null,null,null,null,null,null,null,null,6452,null,"Investiční půjčené prostředky vysokým školám",null,null,5000,5000,5000,{"$f":"AE232/AD232","v":1},5000,5000,5000,{"$f":"AI232/AH232","v":1},0,0,0,"x"]
[null,null,null,null,null,null,null,null,null,null,null,null,null,null,null,null,null,null,null,null,null,null,null,6459,null,"Investiční půjčené prostředky ostatním příspěvkovým organizacím ",null,null,0,3222,3222,{"$f":"AE233/AD233","v":1},0,3222,3222,{"$f":"AI233/AH233","v":1},0,0,0,"x"]
[{"$f":"IF(COUNTBLANK(C234:IV234)=254,\"odstr\",IF(AND($A$1=\"TISK\",SUM(J185:U185)=0),\"odstr\",\"OK\"))","v":{"$error":"#REF!"}},"OK",null,null,null,null,null,null,null,null,null,null,null,null,null,null,null,null,null,null,null,null,null,69,"Ostatní kapitálové výdaje","Ostatní kapitálové výdaje",null,null,{"$f":"AC235","v":834778.73},{"$f":"AD235","v":164131.44509000002},{"$f":"AE235","v":0},"x",{"$f":"AG235","v":302608},{"$f":"AH235","v":85738.311959999992},0,"x",{"$f":"AK235","v":532170.73},{"$f":"AL235","v":78393.133130000002},{"$f":"SUM(AM235:AM237)","v":0},"x"]
[null,null,null,null,null,null,null,null,null,null,null,null,null,null,null,null,null,null,null,null,null,null,null,690,null,"Ostatní kapitálové výdaje",null,null,{"$f":"SUM(AC236:AC237)","v":834778.73},{"$f":"SUM(AD236:AD237)","v":164131.44509000002},0,"x",{"$f":"AG236","v":302608},{"$f":"SUM(AH236:AH237)","v":85738.311959999992},{"$f":"AI236+AI237","v":0},"x",{"$f":"SUM(AK236:AK237)","v":532170.73},{"$f":"SUM(AL236:AL237)","v":78393.133130000002},0,"x"]
[{"$f":"IF(COUNTBLANK(C236:IV236)=254,\"odstr\",IF(AND($A$1=\"TISK\",SUM(J186:U186)=0),\"odstr\",\"OK\"))","v":{"$error":"#REF!"}},"OK",null,null,null,null,null,null,null,null,null,null,null,null,null,null,null,null,null,null,null,null,null,6901,null,"Rezervy kapitálových výdajů",null,null,476876.83,148324.74509000001,0,"x",302608,72931.611959999995,0,"x",174268.83,75393.133130000002,0,"x"]
[null,null,null,null,null,null,null,null,null,null,null,null,null,null,null,null,null,null,null,null,null,null,null,6909,null,"Ostatní kapitálové výdaje jinde nezařazené",null,null,357901.9,15806.7,0,"x",0,12806.7,0,"x",357901.9,3000,0,"x"]
[null,null,null,null,null,null,null,null,null,null,null,null,null,null,null,null,null,null,null,null,null,null,null,"Výdaje kapitoly 700-Obce a DSO; KÚ (část: vzdělávání) celkem",null,null,null,null,{"$f":"AC14+AC176","v":94879180.29508999},{"$f":"AD14+AD176","v":177349502.28656003},{"$f":"AE14+AE176","v":167192182.84990999},{"$f":"AE238/AD238","v":0.94272710492168221},{"$f":"AG14+AG176","v":42713174.71909},{"$f":"AH14+AH176","v":59228771.017800011},{"$f":"AI14+AI176","v":52346147.075219996},{"$f":"AI238/AH238","v":0.88379593524722},{"$f":"AK14+AK176","v":52166005.575999998},{"$f":"AL14+AL176","v":118174700.47956},{"$f":"AM14+AM176","v":115025006.44645},{"$f":"AM238/AL238","v":0.97334713758250824}]
[{"$f":"IF(COUNTBLANK(C239:IV239)=254,\"odstr\",IF(AND($A$1=\"TISK\",SUM(J189:U189)=0),\"odstr\",\"OK\"))","v":{"$error":"#REF!"}},"OK",null,null,null,null,null,null,null,null,null,null,null,null,null,null,null,null,null,null,null,null,"Komentáře:",null,null,null,null,null,null,null,null,null,null,null,null,null,null,null,null,"Zdroj: Závěrečný účet – kapitola 700-Obce a DSO; KÚ (část: vzdělávání); monitor.statnipokladna.cz"]
[{"$f":"IF(COUNTBLANK(C240:IV240)=254,\"odstr\",IF(AND($A$1=\"TISK\",SUM(J190:U190)=0),\"odstr\",\"OK\"))","v":{"$error":"#REF!"}},"OK",null,null,null,null,null,null,null,null,null,null,null,null,null,null,null,null,null,null,null,null,"1)","Tabulka neobsahuje z daných tříd následující položky: 5321, 5323, 5329, 5344, 5345, 5349, 5366, 5367, 5641, 5642, 5649, 6341, 6342, 6349, 6441, 6442, 6449."]
["konst","stop"]
[{"$f":"IF(COUNTBLANK(D193:E193)=2,\"odstr\",\"OK\")","v":"OK"}]
[{"$f":"IF(COUNTBLANK(D194:E194)=2,\"odstr\",\"OK\")","v":"odstr"}]
["stop"]

{"sheet":"B8","index":8,"n_rows":92,"n_cols":22,"rows_kept":92,"cut":false,"hidden":false,"merged":[[76,4,76,11],[8,11,12,11],[8,6,12,7],[8,3,12,4],[8,9,12,9],[8,10,12,10],[62,6,62,7],[60,6,60,7],[73,16,73,17],[75,16,75,17],[89,14,89,21],[8,13,12,14],[8,16,12,17],[8,19,12,19],[8,20,12,20],[8,21,12,21]]}
[{"$error":"#REF!"},0,{"$error":"#REF!"},{"$error":"#REF!"},{"$error":"#REF!"},8]
["konst"]
["konst","57x3",null,"Tab. B8:",null,null,null,"Běžné a kapitálové výdaje kapitoly 333-MŠMT – podle paragrafů",null,null,null,null,null,"Tab. B8:",null,null,null,"Běžné a kapitálové výdaje kapitoly 333-MŠMT – podle paragrafů"]
["konst",169,null,{"$error":"#REF!"},null,null,null,"Běžné a kapitálové výdaje kapitoly 333-MŠMT – podle paragrafů",null,null,null,null,null,{"$error":"#REF!"},null,null,null,"Běžné a kapitálové výdaje kapitoly 333-MŠMT – podle paragrafů"]
["odstr",0]
["odstr","Řádky pro"]
["odstr","ročenku PaM"]
["konst",null,null,"(podle stavu k: 31. 12. 2017)",null,null,null,null,null,null,null,"v tis. Kč",null,"(podle stavu k: 31. 12. 2018)",null,null,null,null,null,null,null,"v tis. Kč"]
["konst",null,null,"Paragraf",null,null,"Název",null,null,"Běžné výdaje","Kapitálové výdaje","Výdaje celkem",null,"Paragraf",null,null,"Název",null,null,"Běžné výdaje","Kapitálové výdaje","Výdaje celkem"]
["konst"]
["konst"]
["konst"]
["konst"]
[{"$error":"#REF!"},"OK",null,null,"SKUPINA 3 – služby pro obyvatelstvo",null,null,null,null,151737564.10931998,5632649.0073900009,157370213.11671004,null,null,"SKUPINA 3 – služby pro obyvatelstvo",null,null,null,null,174393006.80622,13022564.070590001,{"$f":"V15+V61+V64+V70+V73","v":187279499.7234}]
[{"$error":"#REF!"},"OK",null,null,null,null,"31–32 – vzdělávání ",null,null,142356162.19747001,3428037.6649400005,145784199.86241001,null,null,null,null,"31 a 32 – vzdělávání a školské služby",null,null,164364833.41688001,10605088.26169,174969921.67857]
[null,null,null,null,3111,null," Mateřské školy",null,null,632221.16760000004,0,632221.16760000004,null,null,311,null,"Předškolní a základní vzdělávání",null,null,{"$f":"T17+T18+T19+T20","v":3402634.5707299998},{"$f":"U17+U18+U19+U20","v":21016.287},{"$f":"V17+V18+V19+V20","v":3423650.8577299998}]
[{"$error":"#REF!"},"OK",null,null,3112,null," Mateřské školy pro děti se speciálními vzdělávacími  potřebami",null,null,36864.961000000003,0,36864.961000000003,null,null,3111,null," Mateřské školy",null,null,671543.53159999999,0,671543.53159999999]
[{"$error":"#REF!"},"OK",null,null,3113,null," Základní školy",null,null,2086843.0524300002,400,2087243.0524300002,null,null,3112,null," Mateřské školy pro děti se speciálními vzdělávacími  potřebami",null,null,50270.031000000003,0,50270.031000000003]
[{"$error":"#REF!"},"OK",null,null,3114,null," Základní školy pro žáky se speciálními vzdělávacími potřebami",null,null,484834.18449000001,2767.5210000000002,487601.70549000002,null,null,3113,null," Základní školy",null,null,2132628.98593,465.387,2133094.3729300001]
[{"$error":"#REF!"},"OK",null,null,3121,null," Gymnázia",null,null,514381.04879999999,212,514593.04879999999,null,null,3114,null," Základní školy pro žáky se speciálními vzdělávacími potřebami",null,null,548192.02220000001,20550.900000000001,568742.92220000003]
[null,null,null,null,3122,null," Střední odborné školy",null,null,331534.96978999994,3800,335334.96978999994,null,null,312,null,null,"Střední vzdělávání a vzdělávání v konzervatořích",null,{"$f":"T22+T23+T24+T25+T26+T27","v":1473101.2790800002},{"$f":"U22+U23+U24+U25+U26+U27","v":0},{"$f":"V22+V23+V24+V25+V26+V27","v":1473101.2790800002}]
[{"$error":"#REF!"},"OK",null,null,3123,null," Střední školy poskytující střední vzdělání s výučním listem",null,null,114334.54172999998,149,114483.54172999998,null,null,3121,null," Gymnázia",null,null,558261.80787000002,0,558261.80787000002]
[{"$error":"#REF!"},"OK",null,null,3124,null," Střední školy a konzervatoře pro žáky se speciálními  vzdělávacími potřebami",null,null,291067.79423,18695.463949999998,309763.25818,null,null,3122,null," Střední odborné školy",null,null,328133.88540000003,0,328133.88540000003]
[{"$error":"#REF!"},"OK",null,null,3126,null," Konzervatoře",null,null,37237.4666,0,37237.4666,null,null,3123,null," Střední školy poskytující střední vzdělání s výučním listem",null,null,128779.27481,0,128779.27481]
[{"$error":"#REF!"},"OK",null,null,3128,null," Sportovní školy - gymnázia",null,null,82999.92,0,82999.92,null,null,3124,null," Střední školy a konzervatoře pro žáky se speciálními  vzdělávacími potřebami",null,null,320529.59659999999,0,320529.59659999999]
[{"$error":"#REF!"},"OK",null,null,3131,null," Výchovné ústavy a dětské domovy se školou",null,null,879998.95919999992,10554.384460000001,890553.3436599999,null,null,3126,null," Konzervatoře",null,null,44188.8344,0,44188.8344]
[{"$error":"#REF!"},"OK",null,null,3132,null," Diagnostické ústavy",null,null,325747.43360000005,5927.8786,331675.31220000004,null,null,3128,null," Sportovní školy - gymnázia",null,null,93207.88,0,93207.88]
[null,null,null,null,3133,null," Dětské domovy",null,null,32072.404999999999,0,32072.404999999999,null,null,313,null,null,"Školská zařízení pro výkon ústavní a ochranné výchovy",null,{"$f":"T29+T30+T31+T32","v":1492989.9985199999},{"$f":"U29+U30+U31+U32","v":49804.197180000003},{"$f":"V29+V30+V31+V32","v":1542794.1956999998}]
[{"$error":"#REF!"},"OK",null,null,3139,null," Ostatní školská zařízení pro výkon ústavní a ochranné výchovy",null,null,127843.736,0,127843.736,null,null,3131,null," Výchovné ústavy a dětské domovy se školou",null,null,981453.84912000003,25568.468669999998,1007022.31779]
[{"$error":"#REF!"},"OK",null,null,3141,null," Školní stravování ",null,null,199275.97099999999,0,199275.97099999999,null,null,3132,null," Diagnostické ústavy",null,null,344919.47440000001,24235.728510000001,369155.20290999999]
[{"$error":"#REF!"},"OK",null,null,3142,null,"Ostatní školní stravování",null,null,null,null,0,null,null,3133,null," Dětské domovy",null,null,21387.014999999999,0,21387.014999999999]
[{"$error":"#REF!"},"OK",null,null,3143,null," Školní družiny a kluby",null,null,108720.727,0,108720.727,null,null,3139,null," Ostatní školská zařízení pro výkon ústavní a ochranné výchovy",null,null,145229.66,0,145229.66]
[null,null,null,null,3145,null," Internáty",null,null,66352.792000000001,0,66352.792000000001,null,null,314,null,"Ostatní zařízení související s výchovou a vzděláváním mládeže",null,null,{"$f":"T34+T35+T36+T37+T38+T39+T40","v":811207.65240000014},{"$f":"U34+U35+U36+U37+U38+U39+U40","v":0},{"$f":"V34+V35+V36+V37+V38+V39+V40","v":811207.65240000014}]
[{"$error":"#REF!"},"OK",null,null,3146,null," Zařízení výchovného poradenství ",null,null,50637.398999999998,0,50637.398999999998,null,null,3141,null," Školní stravování ",null,null,220909.90100000001,0,220909.90100000001]
[{"$error":"#REF!"},"OK",null,null,3147,null," Domovy mládeže",null,null,48663.65,0,48663.65,null,null,3143,null," Školní družiny a kluby",null,null,128792.747,0,128792.747]
[{"$error":"#REF!"},"OK",null,null,3148,null," Střediska výchovné péče",null,null,249092.18700000001,0,249092.18700000001,null,null,3145,null," Internáty",null,null,73378.255000000005,0,73378.255000000005]
[{"$error":"#REF!"},"OK",null,null,3150,null," Vyšší odborné školy",null,null,105887.0906,0,105887.0906,null,null,3146,null," Zařízení výchovného poradenství ",null,null,56661.133999999998,0,56661.133999999998]
[{"$error":"#REF!"},"odstr",null,null,3211,null," Vysoké školy",null,null,20353220.980069999,2272569.3785600001,22625790.358629998,null,null,3147,null," Domovy mládeže",null,null,56607.864999999998,0,56607.864999999998]
[{"$error":"#REF!"},"OK",null,null,3212,null," Výzkum, vývoj a inovace na vysokých školách",null,null,9173672.3795800004,678645.57242999994,9852317.9520100001,null,null,3148,null," Střediska výchovné péče",null,null,269448.30900000001,0,269448.30900000001]
[null,null,null,null,3221,null," Vysokoškolské koleje a menzy",null,null,129947,0,129947,null,null,3149,null," Ostatní zařízení související s výchovou a vzděláváním mládeže",null,null,5409.4413999999997,0,5409.4413999999997]
[null,null,null,null,3231,null," Základní umělecké školy",null,null,18015.726999999999,0,18015.726999999999,null,null,315,null,null,"Vyšší odborné vzdělávání",null,{"$f":"T42","v":214347.65158999999},{"$f":"U42","v":0},{"$f":"V42","v":214347.65158999999}]
[{"$error":"#REF!"},"OK",null,null,3233,null," Střediska volného času",null,null,106034.5122,0,106034.5122,null,null,3150,null," Vyšší odborné školy",null,null,214347.65158999999,0,214347.65158999999]
[null,null,null,null,3261,null," Činnost ústředního orgánu státní správy ve vzdělávání",null,null,460364.35218999995,11461.976110000001,471826.32829999994,null,null,321,null," Vysokoškolské vzdělávání",null,null,{"$f":"T45","v":11752701.786040001},{"$f":"U44+U45","v":9613682.0233500004},{"$f":"V44+V45","v":46001484.004359998}]
[{"$error":"#REF!"},"OK",null,null,3262,null," Činnost ostatních orgánů státní správy ve vzdělávání",null,null,367025.71273999999,11248.5843,378274.29703999998,null,null,3211,null," Vysoké školy",null,null,24635100.194970001,6504722.7671499997,31139822.96212]
[{"$error":"#REF!"},"OK",null,null,3269,null," Ostatní správa ve vzdělávání jinde nezařazená",null,null,null,null,0,null,null,3212,null," Výzkum, vývoj a inovace na vysokých školách",null,null,11752701.786040001,3108959.2562000002,14861661.042239999]
[null,null,null,null,3291,null," Mezinárodní spolupráce ve vzdělávání",null,null,17503.67021,0,17503.67021,null,null,322,null,"Zařízení související s vysokoškolským vzděláváním",null,null,{"$f":"T47","v":122900},{"$f":"U47","v":0},{"$f":"V47","v":122900}]
[{"$error":"#REF!"},"OK",null,null,3292,null," Vzdělávání národnostních menšin a multikulturní výchova",null,null,10200.973,0,10200.973,null,null,3221,null," Vysokoškolské koleje a menzy",null,null,122900,0,122900]
[null,null,null,null,3293,null," Vzdělávací akce k integraci Romů",null,null,14328.255999999999,0,14328.255999999999,null,null,323,null,"Základní umělecké, jazykové a zájmové vzdělávání",null,null,{"$f":"T49+T50","v":242744.18979999999},{"$f":"U49+U50","v":0},{"$f":"V49+V50","v":242744.18979999999}]
[{"$error":"#REF!"},"OK",null,null,3294,null," Zařízení pro další vzdělávání pedagogických pracovníků",null,null,181720.49931000001,0,181720.49931000001,null,null,3231,null," Základní umělecké školy",null,null,79160.349000000002,0,79160.349000000002]
[{"$error":"#REF!"},"OK",null,null,3299,null," Ostatní záležitosti vzdělávání",null,null,104717516.6781,411605.90553000005,105129122.58363001,null,null,3233,null," Střediska volného času",null,null,163583.84080000001,0,163583.84080000001]
[null,null,null,null,null,null,"33 – kultura, církve a sdělovací prostředky",null,null,195991.37335000001,5687.5557100000005,201678.92905999999,null,null,326,null,null,"Správa ve vzdělávání",null,{"$f":"T52+T53","v":891240.41926999995},{"$f":"U52+U53","v":105594.239},{"$f":"V52+V53","v":901799.84317000001}]
[{"$error":"#REF!"},"OK",null,null,3314,null,"činnosti knihovnické",null,null,157368.82399999999,1693,159061.82399999999,null,null,3261,null," Činnost ústředního orgánu státní správy ve vzdělávání",null,null,489349.674,33371.275000000001,492686.8015]
[{"$error":"#REF!"},"OK",null,null,3315,null,"činnosti muzeí a galerií",null,null,38622.549350000001,3994.5557100000001,42617.105060000002,null,null,3262,null," Činnost ostatních orgánů státní správy ve vzdělávání",null,null,401890.74527000001,72222.964000000007,409113.04167000001]
[{"$error":"#REF!"},"OK",null,null,null,null,"34 – tělovýchova a zájmová činnost",null,null,4424350.2016500002,109580.87097000002,4533931.0726199998,null,null,3269,null," Ostatní správa ve vzdělávání jinde nezařazená",null,null,null,null,0]
[null,null,null,null,3411,null,"státní sportovní reprezentace",null,null,1342321.3203099999,179.80351999999999,1342501.1238299999,null,null,329,null,null,"Ostatní činnost a nespecifikované výdaje",null,{"$f":"T56+T57+T58+T59+T60","v":119325865.67448001},{"$f":"U57+U56+U58+U59+U60","v":910026.33025999996},{"$f":"V56+V57+V58+V59+V60","v":120235892.00474}]
[{"$error":"#REF!"},"OK",null,null,3419,null,"ostatní tělovýchovná činnost",null,null,2824409.5679000001,86397.865780000007,2910807.4336800002,null,null,3291,null," Mezinárodní spolupráce ve vzdělávání",null,null,20428.55327,0,20428.55327]
[null,null,null,null,3421,null,"využití volného času dětí a mládeže",null,null,257619.31344,23003.201670000002,280622.51510999998,null,null,3292,null," Vzdělávání národnostních menšin a multikulturní výchova",null,null,12589.97184,0,12589.97184]
[null,null,null,null,null,null,"35 – zdravotnictví",null,null,12058.397999999999,0,12058.397999999999,null,null,3293,null," Vzdělávací akce k integraci Romů",null,null,17358.6031,0,17358.6031]
[null,null,null,null,3541,null,"prevence před drogami, alkoholem, nikotinem a jinými návykovými látkami",null,null,12058.397999999999,0,12058.397999999999,null,null,3294,null," Zařízení pro další vzdělávání pedagogických pracovníků",null,null,246165.58592000001,0,246165.58592000001]
[null,null,null,null,null,null,"38 – ostatní výzkum a vývoj",null,null,4749001.9388499996,2089342.9157700001,6838344.8546199994,null,null,3299,null," Ostatní záležitosti vzdělávání",null,null,119029322.96035001,910026.33025999996,119939349.29061]
[{"$error":"#REF!"},"OK",null,null,3809,null,"ostatní  výzkum a vývoj odvětvově nespecifikovaný",{"$error":"#N/A"},null,4749001.9388499996,2089342.9157700001,6838344.8546199994,null,null,null,null,"33 – kultura, církve a sdělovací prostředky",null,null,{"$f":"T62+T63","v":210972.47099999999},{"$f":"U62+U63","v":1237.249},{"$f":"V62+V63","v":212209.72}]
[{"$error":"#REF!"},"OK",null,null,"SKUPINA 4 – sociální věci a politika zaměstnanosti",null,null,null,null,0,0,0,null,null,3314,null,"Činnosti knihovnické",null,null,170364.424,0,170364.424]
[{"$error":"#REF!"},"OK",null,null,null,null,"43 – sociální služby a společné činnosti v sociálním zabezpečení a politice zaměstnanosti",null,null,0,0,0,null,null,3315,null,"Činnosti muzeí a galerií",null,null,40608.046999999999,1237.249,41845.296000000002]
[{"$error":"#REF!"},"OK",null,null,4322,null,"ústavy péče pro mládež",null,null,0,0,0,null,null,null,null,"34 – tělovýchova a zájmová činnost",null,null,{"$f":"T65+T68","v":4779995.9160799999},{"$f":"U65+U68","v":1170969.8936699999},{"$f":"V65+V68","v":5950965.80975}]
[null,null,null,null,"SKUPINA 5 – bezpečnost státu a právní ochrana",null,null,null,null,17728.292009999997,0,17728.292009999997,null,null,341,null,"Tělovýchova",null,null,4379347.3675600002,1139663.44334,5519010.8108999999]
[{"$error":"#REF!"},"OK",null,null,null,null,"52 – civilní připravenost na krizové stavy",null,null,52.42501,0,52.42501,null,null,3411,null,"Státní sportovní reprezentace",null,null,1448121.71973,19539.041000000001,1467660.76073]
[{"$error":"#REF!"},"OK",null,null,5299,null,"ostatní záležitosti civilní připravenosti na krizové stavy",null,null,52.42501,0,52.42501,null,null,3419,null,"Ostatní tělovýchovná činnost",null,null,2931225.6478300001,1120124.40234,4051350.0501700002]
[null,null,null,null,null,null,"53 – bezpečnost a veřejný pořádek",null,null,17675.866999999998,0,17675.866999999998,null,null,342,null,"Zájmová činnost a rekreace",null,null,{"$f":"T69","v":400648.54852000001},{"$f":"U69","v":31306.45033},{"$f":"V69","v":431954.99884999997}]
[{"$error":"#REF!"},"OK",null,null,5399,null,"ostatní záležitosti bezpečnosti, veřejného pořádku",null,null,17675.866999999998,0,17675.866999999998,null,null,3421,null,"Využití volného času dětí a mládeže",null,null,400648.54852000001,31306.45033,431954.99884999997]
[{"$error":"#REF!"},"OK",null,null,"SKUPINA 6 – všeobecná veřejná správa a služby",null,null,null,null,123498.61540000001,0,123498.61540000001,null,null,null,null,"35 – zdravotnictví",null,null,{"$f":"T71","v":11982.615},0,11982.615]
[null,null,null,null,null,null,"62 – jiné veřejné služby a činnosti",null,null,123498.61540000001,0,123498.61540000001,null,null,354,null,"Zdravotnické programy",null,null,11982.615,0,11982.615]
[{"$error":"#REF!"},"OK",null,null,6221,null,"humanitární zahraniční pomoc",null,null,7431.1220000000003,0,7431.1220000000003,null,null,3541,null,"Prevence před drogami, alkoholem, nikotinem a jinými závislostmi",null,null,11982.615,0,11982.615]
[{"$error":"#REF!"},"OK",null,null,6222,null,"rozvojová zahraniční pomoc",null,null,115277.51640000001,0,115277.51640000001,null,null,null,null,"38 – ostatní výzkum a vývoj",null,null,{"$f":"T74","v":4889423.4838500004},{"$f":"U74","v":1244996.4162300001},{"$f":"V74","v":6134419.9000800001}]
[{"$error":"#REF!"},"OK",null,null,6229,null,"ostatní zahraniční pomoc",null,null,789.97699999999998,0,789.97699999999998,null,null,3809,null,"Ostatní  výzkum a vývoj odvětvově nespecifikovaný",{"$error":"#N/A"},null,4889423.4838500004,1244996.4162300001,6134419.9000800001]
[{"$error":"#REF!"},"OK",null,null,"Celkem kapitola 333-MŠMT",null,null,null,null,151878791.01672998,5632649.0073900009,157511440.02412003,null,null,"SKUPINA 4 – sociální věci a politika zaměstnanosti",null,null,null,null,0,0,0]
[{"$error":"#REF!"},"OK",null,"",null,null,null,null,null,null,null,"Zdroj: Závěrečný účet – kapitola 333-MŠMT",null,null,null,null,"43 – sociální služby a společné činnosti v sociálním zabezpečení a politice zaměstnanosti",null,null,0,0,0]
[{"$error":"#REF!"},"OK",null,null,null,null,null,null,null,null,null,null,null,null,4322,null,"zrušen",null,null,0,0,0]
[{"$error":"#REF!"},"OK",null,null,null,null,null,null,null,null,null,null,null,null,"SKUPINA 5 – bezpečnost státu a právní ochrana",null,null,null,null,{"$f":"T79+T81","v":8117.2939999999999},{"$f":"U79+U81","v":272.25},{"$f":"V79+V81","v":8389.5439999999999}]
[{"$error":"#REF!"},"OK",null,null,null,null,null,null,null,null,null,null,null,null,null,null,"52 – civilní připravenost na krizové stavy",null,null,{"$f":"T80","v":0},{"$f":"U80","v":272.25},{"$f":"V80","v":272.25}]
[{"$error":"#REF!"},"odstr",null,null,null,null,null,null,null,null,null,null,null,null,5299,null,"Ostatní záležitosti civilní připravenosti na krizové stavy",null,null,0,272.25,272.25]
[{"$error":"#REF!"},"odstr",null,null,null,null,null,null,null,null,null,null,null,null,null,null,"53 – bezpečnost a veřejný pořádek",null,null,{"$f":"T82","v":8117.2939999999999},{"$f":"U82","v":0},{"$f":"V82","v":8117.2939999999999}]
[{"$error":"#REF!"},"OK",null,null,null,null,null,null,null,null,null,null,null,null,5399,null,"Ostatní záležitosti bezpečnosti, veřejného pořádku",null,null,8117.2939999999999,0,8117.2939999999999]
[{"$error":"#REF!"},"OK",null,null,null,null,null,null,null,null,null,null,null,null,"SKUPINA 6 – všeobecná veřejná správa a služby",null,null,null,null,{"$f":"T84","v":127681.60941},0,{"$f":"V84","v":127681.60941}]
[{"$error":"#REF!"},"OK",null,null,null,null,null,null,null,null,null,null,null,null,null,null,"62 – jiné veřejné služby a činnosti",null,null,{"$f":"T85+T86+T87","v":127681.60941},0,{"$f":"V85+V86+V87","v":127681.60941}]
[{"$error":"#REF!"},"OK",null,null,null,null,null,null,null,null,null,null,null,null,6221,null,"Humanitární zahraniční pomoc přímá",null,null,19779.607759999999,0,19779.607759999999]
[{"$error":"#REF!"},"OK",null,null,null,null,null,null,null,null,null,null,null,null,6222,null,"Rozvojová zahraniční pomoc",null,null,107902.00165000001,0,107902.00165000001]
[{"$error":"#REF!"},"OK",null,null,null,null,null,null,null,null,null,null,null,null,6229,null,"Ostatní zahraniční pomoc",null,null,0,0,0]
[{"$error":"#REF!"},"OK",null,null,null,null,null,null,null,null,null,null,null,null,"Celkem kapitola 333-MŠMT",null,null,null,null,174393006.80622,13022564.070590001,187415570.87681001]
["konst","stop",null,null,null,null,null,null,null,null,null,null,null,"",null,null,null,null,null,null,null,"Zdroj: Závěrečný účet – kapitola 333-MŠMT; monitor.statnipokladny.cz"]
["odstr"]
["odstr"]
["stop"]

{"sheet":"B9","index":9,"n_rows":79,"n_cols":30,"rows_kept":79,"cut":false,"hidden":false,"merged":[[14,17,14,21],[69,4,69,15],[68,4,68,15],[8,20,12,21],[8,23,9,25],[8,3,12,4],[8,6,12,7],[8,9,9,11],[10,9,12,9],[8,17,12,18],[10,14,12,14],[8,15,12,15],[8,12,9,14],[10,10,12,10],[10,11,12,11],[10,12,12,12],[10,13,12,13],[8,26,9,28],[8,29,12,29],[10,23,12,23],[10,24,12,24],[10,25,12,25],[10,26,12,26],[10,27,12,27],[10,28,12,28]]}
[{"$f":"IF(#REF!=\"\",\"ŠABLONA\",IF(#REF!=\"T\",\"TISK\",\"ELEKTRO\"))","v":{"$error":"#REF!"}},0,{"$f":"CONCATENATE(D1,F1,IF(G1<>\"\",\".\",\"\"),G1,IF(H1<>\"\",\".\",\"\"),H1,IF(I1<>\"\",\".\",\"\"),I1,\"\")","v":{"$error":"#REF!"}},{"$f":"IF(#REF!=\"\",\" ?\",#REF!)","v":{"$error":"#REF!"}},{"$f":"CONCATENATE(C1,P1)","v":{"$error":"#REF!"}},9]
["konst"]
["konst","45x6",null,"Tab. B9:",null,null,null,"Běžné a kapitálové výdaje kapitoly 700-Obce a DSO; KÚ (část: 31–32–vzdělávání) – podle paragrafů",null,null,null,null,null,null,null,null,null,"Tab. B9:",null,null,null,"Běžné a kapitálové výdaje kapitoly 700-Obce a DSO; KÚ (část: 31–32–vzdělávání) – podle paragrafů"]
["konst",{"$f":"COUNTA(Datova_oblast)","v":308},null,{"$f":"IF(D1=\" ?\",\"\",CONCATENATE(\"Tab. \",E1,\":\"))","v":{"$error":"#REF!"}},null,null,null,{"$f":"IF(H3=\"Zadejte název tabulky\",\"\",H3)","v":"Běžné a kapitálové výdaje kapitoly 700-Obce a DSO; KÚ (část: 31–32–vzdělávání) – podle paragrafů"},null,null,null,null,null,null,null,null,null,{"$f":"IF(R1=\" ?\",\"\",CONCATENATE(\"Tab. \",S1,\":\"))","v":"Tab. :"},null,null,null,{"$f":"IF(V3=\"Zadejte název tabulky\",\"\",V3)","v":"Běžné a kapitálové výdaje kapitoly 700-Obce a DSO; KÚ (část: 31–32–vzdělávání) – podle paragrafů"}]
[{"$f":"IF(D5=\"\",\"odstr\",\"OK\")","v":"odstr"},0]
[{"$f":"IF(COUNTBLANK(C6:IV6)=254,\"odstr\",\"OK\")","v":"odstr"},"Řádky pro"]
[{"$f":"IF(COUNTBLANK(C7:IV7)=254,\"odstr\",\"OK\")","v":"odstr"},"ročenku PaM"]
["konst",null,null,"(podle stavu k: 31. 12. 2017)",null,null,null,null,null,null,null,null,null,null,null,"v tis. Kč",null,"(podle stavu k: 31. 12. 2018)",null,null,null,null,null,null,null,null,null,null,null,"v tis. Kč"]
["konst",null,null,"Paragraf",null,null,"Název",null,null,"Obce a DSO",null,null,"Krajské úřady",null,null,"Výdaje celkem kapitola-Obce a DSO; KÚ",null,"Paragraf",null,null,"Název",null,null,"Obce a DSO",null,null,"Krajské úřady",null,null,"Výdaje celkem kapitola-Obce a DSO; KÚ"]
["konst"]
["konst",null,null,null,null,null,null,null,null,"běžné výdaje","kapitálové výdaje","výdaje celkem","běžné výdaje","kapitálové výdaje","výdaje celkem",null,null,null,null,null,null,null,null,"běžné výdaje","kapitálové výdaje","výdaje celkem","běžné výdaje","kapitálové výdaje","výdaje celkem"]
["konst"]
["konst"]
[{"$f":"IF(COUNTBLANK(C14:IV14)=254,\"odstr\",IF(AND($A$1=\"TISK\",SUM(J14:P14)=0),\"odstr\",\"OK\"))","v":{"$error":"#REF!"}},"OK",null,null,"SKUPINA 3 – služby pro obyvatelstvo",null,null,null,null,".",".",".",".",".",".",".",null,null,"SKUPINA 3 – služby pro obyvatelstvo",null,null,null,null,".",".",".",".",".",".","."]
[{"$error":"#REF!"},"OK",null,null,null,null,"31–32 – vzdělávání",null,null,31909918.221629996,9391150.86314,41301069.084769987,96891385.572760031,2054009.0902800004,98945394.663040042,140246463.74781004,null,"31–32 – vzdělávání a školské služby",null,null,null,null,null,35676406.316289999,14056598.283980001,49733004.600270003,109788985.34161,6192138.7592900004,115981124.10089999,{"$f":"Z15+AC15","v":165714128.70117}]
[null,null,null,null,null,null,null,null,null,null,null,null,null,null,null,null,null,null,311,null,"Předškolní a základní vzdělávání",null,null,{"$f":"SUM(X17:X24)","v":27380751.752929993},12692099.620289998,40079846.128940001,65076264.833139993,246021.97928,65322286.812420003,105402132.94135998]
[{"$f":"IF(COUNTBLANK(C17:IV17)=254,\"odstr\",IF(AND($A$1=\"TISK\",SUM(J17:P17)=0),\"odstr\",\"OK\"))","v":{"$error":"#REF!"}},"OK",null,null,3111,null," Mateřské školy",null,null,5969406.5809999984,2168605.65637,8138012.2373699984,12823283.04064,239.51650000000001,12823522.55714,20961534.794509999,null,null,3111,null," Mateřské školy",null,null,6553892.2619899996,3114961.3381699999,9668853.6001600008,14493690.62486,27870.603179999998,14521561.22804,{"$f":"Z17+AC17","v":24190414.828200001}]
[{"$error":"#REF!"},"OK",null,null,3112,null," Mateřské školy pro děti se speciálními vzdělávacími  potřebami",null,null,84581.06180999997,0,84581.06180999997,311322.08869,1474.40085,312796.48953999998,397377.55134999997,null,null,3112,null," Mateřské školy pro děti se speciálními vzdělávacími  potřebami",null,null,95121.918749999997,3440.5,98562.418749999997,365351.46010999999,12746.418299999999,378097.87841,476660.29716000002]
[{"$error":"#REF!"},"OK",null,null,3113,null," Základní školy",null,null,16593273.387679989,5617199.8225100003,22210473.210189991,35373541.47257001,876.96169999999995,35374418.434270009,57584891.64446,null,null,3113,null," Základní školy",null,null,18700639.171859998,8788488.7456199992,27489127.917479999,40355108.822379999,97481.133809999999,40452589.956189997,67941717.873669997]
[{"$error":"#REF!"},"OK",null,null,3114,null," Základní školy pro žáky se speciálními vzdělávacími potřebami",null,null,705615.1104999996,67437.56091,773052.6714099996,3741802.48025,102104.95336000001,3843907.4336100002,4616960.1050199997,null,null,3114,null," Základní školy pro žáky se speciálními vzdělávacími potřebami",null,null,771402.78668999998,74716.007549999995,846118.79423999996,4200221.4401099999,107046.77499000001,4307268.2150999997,5153387.0093399994]
[{"$error":"#REF!"},null,null,null,3115,null," Ostatní záležitosti předškolního vzdělávání",null,null,17089.455170000001,3867.0244500000003,20956.479620000002,0,0,0,20956.479620000002,null,null,3115,null," Ostatní záležitosti předškolního vzdělávání",null,null,39171.461880000003,";",46166.217600000004,0,212.04900000000001,212.04900000000001,46378.266600000003]
[{"$error":"#REF!"},"OK",null,null,3117,null," První stupeň základních škol",null,null,633339.02795000013,214941.55275,848280.58070000017,4940079.8431700002,0,4940079.8431700002,5788360.4238700001,null,null,3117,null," První stupeň základních škol",null,null,722053.60972999898,405806.5379,1127860.14763,5645255.9146800004,0,5645255.9146800004,6773116.0623100009]
[{"$error":"#REF!"},"OK",null,null,3118,null," Druhý stupeň základních škol",null,null,2173.8302899999999,4857.01746,7030.8477499999999,13335.083000000001,0,13335.083000000001,20365.93075,null,null,3118,null," Druhý stupeň základních škol",null,null,9677.4745800000001,28527.670269999999,38205.144849999997,16636.571,0,16636.571,54841.715849999993]
[{"$error":"#REF!"},"OK",null,null,3119,null," Ostatní záležitosti základního vzdělávání",null,null,453840.99132000026,103161.46597,557002.45729000028,617.83736999999996,255.02535999999998,872.86272999999994,557875.32002000033,null,null,3119,null," Ostatní záležitosti základního vzdělávání",null,null,488793.06744999997,276158.82078000001,764951.88823000004,0,665,665,765616.88823000004]
[null,null,null,null,3121,null," Gymnázia",null,null,1617327.2122200003,110316.52265,1727643.7348700003,5832253.5382299991,368001.98515000002,6200255.5233799992,7927899.25825,null,null,312,null,"Střední vzdělávání a vzdělávání v konzervatořích",null,null,{"$f":"SUM(X26:X34)","v":5768398.29648},568524.13958999992,6336922.4360700008,29422024.58199,5198904.8041099999,34620929.386100002,40957851.822169997]
[{"$f":"IF(COUNTBLANK(C26:IV26)=254,\"odstr\",IF(AND($A$1=\"TISK\",SUM(J25:P25)=0),\"odstr\",\"OK\"))","v":{"$error":"#REF!"}},"OK",null,null,3122,null," Střední odborné školy",null,null,1657041.0639899999,224180.83916,1881221.9031499999,9740850.9531200025,582493.79818999988,10323344.751310002,12204566.654460002,null,null,3121,null," Gymnázia",null,null,1797040.3282999999,135001.91779000001,1932042.24609,6589539.5518500004,937568.41699000006,7527107.9688400002,{"$f":"Z26+AC26","v":9459150.2149299998}]
[{"$error":"#REF!"},"OK",null,null,3123,null," Střední školy poskytující střední vzdělání s výučním listem",null,null,1179793.38078,165092.09859000001,1344885.4793700001,6258468.6522300001,382414.09069000004,6640882.7429200001,7985768.2222899999,null,null,3122,null," Střední odborné školy",null,null,1863640.0265500001,176249.36872999999,2039889.3952800001,10888497.814470001,2238439.77159,13126937.586060001,15166826.98134]
[{"$error":"#REF!"},"OK",null,null,3124,null," Střední školy a konzervatoře pro žáky se speciálními  vzdělávacími potřebami",null,null,191653.3112,10404.81675,202058.12794999999,899753.05716000008,10125.12708,909878.18424000009,1111936.31219,null,null,3123,null," Střední školy poskytující střední vzdělání s výučním listem",null,null,1285620.8108300001,192158.47542999999,1477779.28626,6833724.3122899998,962251.99124,7795976.3035300002,9273755.5897899996]
[{"$error":"#REF!"},"OK",null,null,3125,null," Střediska praktického vyučování a školní hospodářství",null,null,13763.224,0,13763.224,53803.694920000002,22161.750700000001,75965.445619999999,89728.669620000001,null,null,3124,null," Střední školy a konzervatoře pro žáky se speciálními  vzdělávacími potřebami",null,null,226839.0528,15482.702939999999,242321.75573999999,923600.96132999996,42809.550589999999,966410.51191999996,1208732.2676599999]
[{"$error":"#REF!"},"OK",null,null,3126,null," Konzervatoře",null,null,352859.28100000002,6873.7219999999998,359733.00300000003,326233.18721,21388.361820000002,347621.54902999999,707354.55203000002,null,null,3125,null," Střediska praktického vyučování a školní hospodářství",null,null,14452.303,0,14452.303,56017.887849999999,72198.498949999994,128216.38679999999,142668.68979999999]
[{"$error":"#REF!"},"OK",null,null,3127,null," Střední školy",null,null,183308.8475,0,183308.8475,3361523.6609199997,348253.50127000001,3709777.1621899996,3893086.0096899997,null,null,3126,null," Konzervatoře",null,null,380938.45400000003,49631.674700000003,430570.1287,363214.03824000002,42919.233999999997,406133.27224000002,836703.40094000008]
[{"$error":"#REF!"},null,null,null,3128,null," Sportovní školy - gymnázia",null,null,0,0,0,97692.549939999997,279.78699999999998,97972.336939999994,97972.336939999994,null,null,3127,null," Střední školy",null,null,199772.821,0,199772.821,3658041.49596,892494.21574999997,4550535.7117100004,4750308.5327100009]
[{"$error":"#REF!"},"OK",null,null,3129,null," Ostatní zařízení středního vzdělávání",null,null,82,0,82,0.26910000000000001,0,0.26910000000000001,82.269099999999995,null,null,3128,null," Sportovní školy - gymnázia",null,null,0,0,0,108939.61,10223.125,119162.735,119162.735]
[{"$error":"#REF!"},"OK",null,null,3131,null," Výchovné ústavy a dětské domovy se školou",null,null,62.672599999999996,0,62.672599999999996,0,0,0,62.672599999999996,null,null,3129,null," Ostatní zařízení středního vzdělávání",null,null,94.5,0,94.5,448.91,0,448.91,543.41000000000008]
[null,null,null,null,3132,null," Diagnostické ústavy",null,null,0,0,0,0,0,0,0,null,null,313,null,"Školská zařízení pro výkon ústavní a ochranné výchovy",null,null,{"$f":"SUM(X36:X39)","v":80914.843600000007},{"$f":"SUM(Y36:Y39)","v":2415.6},83330.443600000013,{"$f":"SUM(AA36:AA39)","v":1906514.7294099999},{"$f":"SUM(AB36:AB39)","v":39150.136630000001},1945664.86604,{"$f":"SUM(AD36:AD39)","v":2028995.3096399999}]
[{"$f":"IF(COUNTBLANK(C36:IV36)=254,\"odstr\",IF(AND($A$1=\"TISK\",SUM(J34:P34)=0),\"odstr\",\"OK\"))","v":{"$error":"#REF!"}},"OK",null,null,3133,null," Dětské domovy",null,null,72448.359599999996,1939.3425,74387.702099999995,1741848.50517,18374.444670000001,1760222.9498400001,1834610.6519400002,null,null,3131,null," Výchovné ústavy a dětské domovy se školou",null,null,74.854600000000005,0,74.854600000000005,60,0,60,{"$f":"Z36+AC36","v":134.8546}]
[{"$f":"IF(COUNTBLANK(C37:IV37)=254,\"odstr\",IF(AND($A$1=\"TISK\",SUM(J35:P35)=0),\"odstr\",\"OK\"))","v":{"$error":"#REF!"}},"OK",null,null,3139,null," Ostatní školská zařízení pro výkon ústavní a ochranné výchovy",null,null,10,0,10,0,0,0,10,null,null,3132,null," Diagnostické ústavy",null,null,0,0,0,0,0,0,{"$f":"Z37+AC37","v":0}]
[{"$f":"IF(COUNTBLANK(C38:IV38)=254,\"odstr\",IF(AND($A$1=\"TISK\",SUM(J36:P36)=0),\"odstr\",\"OK\"))","v":{"$error":"#REF!"}},null,null,null,3141,null," Školní stravování ",null,null,595323.94073000003,98761.566700000025,694085.50743,2863427.5511999996,3974.7869999999998,2867402.3381999996,3561487.8456299994,null,null,3133,null," Dětské domovy",null,null,80829.989000000001,2415.6,83245.589000000007,1906454.7294099999,39150.136630000001,1945604.86604,{"$f":"Z38+AC38","v":2028850.4550399999}]
[{"$f":"IF(COUNTBLANK(C39:IV39)=254,\"odstr\",IF(AND($A$1=\"TISK\",SUM(J37:P37)=0),\"odstr\",\"OK\"))","v":{"$error":"#REF!"}},"OK",null,null,3142,null,"Ostatní školní stravování",null,null,null,null,0,null,null,0,0,null,null,3139,null," Ostatní školská zařízení pro výkon ústavní a ochranné výchovy",null,null,10,null,10,0,0,0,{"$f":"Z39+AC39","v":10}]
[null,null,null,null,3143,null," Školní družiny a kluby",null,null,33940.347650000003,417.71550000000002,34358.063150000002,1608936.537,0,1608936.537,1643294.6001500001,null,null,314,null,"Ostatní zařízení související s výchovou a vzděláváním mládeže",null,null,{"$f":"SUM(X41:X49)","v":999445.05537000019},{"$f":"SUM(Y41:Y49)","v":422711.84369000001},1422156.8990600002,6756302.29373,88926.920070000007,6845229.2138,8267386.1128600007]
[{"$f":"IF(COUNTBLANK(C41:IV41)=254,\"odstr\",IF(AND($A$1=\"TISK\",SUM(J38:P38)=0),\"odstr\",\"OK\"))","v":{"$error":"#REF!"}},"OK",null,null,3144,null," Školy v přírodě",null,null,19011.332999999999,0,19011.332999999999,0,0,0,19011.332999999999,null,null,3141,null," Školní stravování ",null,null,633392.42877,156999.43401999999,790391.86279000004,3322665.6597500001,7986.8657999999996,3330652.5255499999,{"$f":"Z41+AC41","v":4121044.3883400001}]
[{"$error":"#REF!"},"OK",null,null,3145,null," Internáty",null,null,4.0540000000000003,0,4.0540000000000003,72199.713780000005,0,72199.713780000005,72203.767780000009,null,null,3142,null,"Ostatní školní stravování",null,null,0,0,0,0,0,0,0]
[{"$error":"#REF!"},"OK",null,null,3146,null," Zařízení výchovného poradenství ",null,null,112101.4054,580.4,112681.8054,732658.59973999998,10708.484899999999,743367.08464000002,856048.89003999997,null,null,3143,null," Školní družiny a kluby",null,null,44993.69515,175.328,45169.023150000001,1844391.9350000001,0,1844391.9350000001,1889560.9581500001]
[{"$error":"#REF!"},"OK",null,null,3147,null," Domovy mládeže",null,null,81477.957999999999,9605.1350000000002,91083.092999999993,523627.70952999999,20266.191009999999,543893.90053999994,634976.99353999994,null,null,3144,null," Školy v přírodě",null,null,19762.80948,0,19762.80948,0,0,0,19762.80948]
[{"$error":"#REF!"},"OK",null,null,3148,null," Střediska výchovné péče",null,null,1157.49,0,1157.49,17688.595000000001,0,17688.595000000001,18846.085000000003,null,null,3145,null," Internáty",null,null,0,0,0,76813.797000000006,0,76813.797000000006,76813.797000000006]
[{"$error":"#REF!"},"OK",null,null,3149,null," Ostatní zařízení související s výchovou a vzděláváním mládeže",null,{"$error":"#N/A"},116522.43781999999,375744.17858000001,492266.6164,82131.532830000011,37960.807529999998,120092.34036,612358.95675999997,null,null,3146,null," Zařízení výchovného poradenství ",null,null,127384.80546,11864.21954,139249.02499999999,827386.50514000002,6973.00731,834359.51245000004,973608.53745000006]
[{"$error":"#REF!"},"OK",null,null,3150,null," Vyšší odborné školy",null,null,102762.43356,0,102762.43356,308925.24978999997,3074,311999.24978999997,414761.68334999995,null,null,3147,null," Domovy mládeže",null,null,86779.28,8287.7999999999993,95067.08,582466.72945999994,70809.815310000005,653276.54477000004,748343.62476999999]
[{"$error":"#REF!"},null,null,null,3211,null," Vysoké školy",null,null,4131.933,0,4131.933,2702.9,0,2702.9,6834.8330000000005,null,null,3148,null," Střediska výchovné péče",null,null,972.89481000000001,250,1222.89481,21734.266,0,21734.266,22957.160810000001]
[{"$error":"#REF!"},"OK",null,null,3212,null," Výzkum, vývoj a inovace na vysokých školách",null,null,0,0,0,3920.7,0,3920.7,3920.7,null,null,3149,null," Ostatní zařízení související s výchovou a vzděláváním mládeže",null,{"$error":"#N/A"},86159.141699999993,245135.06213000001,331294.20383000001,80843.401379999996,3157.2316500000002,84000.633029999997,415294.83686000004]
[null,null,null,null,3213,null," Bakalářské studium",null,null,104,0,104,500,0,500,604,null,null,315,null,"Vyšší odborné vzdělávání",null,null,{"$f":"SUM(X51)","v":103679.1326},{"$f":"SUM(Y51)","v":0},103679.1326,339054.86629999999,155531.4987,494586.36499999999,598265.4976]
[{"$f":"IF(COUNTBLANK(C51:IV51)=254,\"odstr\",IF(AND($A$1=\"TISK\",SUM(J47:P47)=0),\"odstr\",\"OK\"))","v":{"$error":"#REF!"}},"OK",null,null,3214,null," Magisterské a doktorské studium",null,null,50,0,50,0,0,0,50,null,null,3150,null," Vyšší odborné školy",null,null,103679.1326,0,103679.1326,339054.86629999999,155531.4987,494586.36499999999,{"$f":"Z51+AC51","v":598265.4976}]
[null,null,null,null,3221,null," Vysokoškolské koleje a menzy",null,null,0,0,0,0,0,0,0,null,null,321,null,"Vysokoškolské vzdělávání",null,null,{"$f":"SUM(X53:X56)","v":5747.3956200000002},{"$f":"SUM(Y53:Y56)","v":0},5747.3956200000002,7082.96875,3082.7570000000001,10165.72575,15913.121370000001]
[{"$f":"IF(COUNTBLANK(C53:IV53)=254,\"odstr\",IF(AND($A$1=\"TISK\",SUM(J48:P48)=0),\"odstr\",\"OK\"))","v":{"$error":"#REF!"}},"OK",null,null,3229,null," Ostatní zařízení související s vysokoškolským vzděláváním",null,null,2963,0,2963,64.980999999999995,0,64.980999999999995,3027.9809999999998,null,null,3211,null," Vysoké školy",null,null,5614.3956200000002,0,5614.3956200000002,4646,3082.7570000000001,7728.7569999999996,{"$f":"Z53+AC53","v":13343.152620000001}]
[{"$f":"IF(COUNTBLANK(C54:IV54)=254,\"odstr\",IF(AND($A$1=\"TISK\",SUM(J49:P49)=0),\"odstr\",\"OK\"))","v":{"$error":"#REF!"}},"OK",null,null,3231,null," Základní umělecké školy",null,null,664890.26646999968,160356.63191999999,825246.89838999964,4120014.6276500002,12470.271069999999,4132484.8987199999,4957731.7971099997,null,null,3212,null," Výzkum, vývoj a inovace na vysokých školách",null,null,0,0,0,2436.96875,0,2436.96875,{"$f":"Z54+AC54","v":2436.96875}]
[{"$f":"IF(COUNTBLANK(C55:IV55)=254,\"odstr\",IF(AND($A$1=\"TISK\",SUM(J50:P50)=0),\"odstr\",\"OK\"))","v":{"$error":"#REF!"}},"OK",null,null,3232,null," Jazykové školy s právem státní jazykové zkoušky",null,null,1062.9000000000001,0,1062.9000000000001,42,0,42,1104.9000000000001,null,null,3213,null," Bakalářské studium",null,null,85,0,85,0,0,0,{"$f":"Z55+AC55","v":85}]
[{"$f":"IF(COUNTBLANK(C56:IV56)=254,\"odstr\",IF(AND($A$1=\"TISK\",SUM(J51:P51)=0),\"odstr\",\"OK\"))","v":{"$error":"#REF!"}},"OK",null,null,3233,null," Střediska volného času",null,null,70525.357809999987,19441.593929999999,89966.95173999999,741196.62875000015,23295.667109999999,764492.29586000019,854459.24760000012,null,null,3214,null," Magisterské a doktorské studium",null,null,48,0,48,0,0,0,{"$f":"Z56+AC56","v":48}]
[null,null,null,null,3239,null," Záležitosti zájmového vzdělávání jinde nezařazené",null,null,3025.5068700000002,1837.7270000000001,4863.23387,0,0,0,4863.23387,null,null,322,null,"Zařízení související s vysokoškolským vzděláváním",null,null,{"$f":"SUM(X58:X59)","v":3133.922},{"$f":"SUM(Y58:Y59)","v":0},3133.922,1600,0,1600,4733.9220000000005]
[{"$f":"IF(COUNTBLANK(C58:IV58)=254,\"odstr\",IF(AND($A$1=\"TISK\",SUM(J52:P52)=0),\"odstr\",\"OK\"))","v":{"$error":"#REF!"}},"OK",null,null,3261,null," Činnost ústředního orgánu státní správy ve vzdělávání",null,null,0,0,0,0,0,0,0,null,null,3221,null," Vysokoškolské koleje a menzy",null,null,0,0,0,0,0,0,0]
[{"$f":"IF(COUNTBLANK(C59:IV59)=254,\"odstr\",IF(AND($A$1=\"TISK\",SUM(J53:P53)=0),\"odstr\",\"OK\"))","v":{"$error":"#REF!"}},"OK",null,null,3262,null," Činnost ostatních orgánů státní správy ve vzdělávání",null,null,0,0,0,0,0,0,0,null,null,3229,null," Ostatní zařízení související s vysokoškolským vzděláváním",null,null,3133.922,0,3133.922,1600,0,1600,{"$f":"Z59+AC59","v":4733.9220000000005}]
[null,null,null,null,3269,null," Ostatní správa ve vzdělávání jinde nezařazená",null,null,19.064,0,19.064,21425.574200000003,0,21425.574200000003,21444.638200000001,null,null,323,null,"Základní umělecké, jazykové a zájmové vzdělávání",null,null,{"$f":"SUM(X61:X64)","v":897590.58435000002},{"$f":"SUM(Y61:Y64)","v":317314.06917999999},1214904.65353,5510502.1478399998,40699.030729999999,5590257.5910700001,6805162.2446000008]
[{"$f":"IF(COUNTBLANK(C61:IV61)=254,\"odstr\",IF(AND($A$1=\"TISK\",SUM(J54:P54)=0),\"odstr\",\"OK\"))","v":{"$error":"#REF!"}},"OK",null,null,3280,null," Výzkum školství a vzdělávání",null,null,834.69065999999987,0,834.69065999999987,0,0,0,834.69065999999987,null,null,3231,null," Základní umělecké školy",null,null,783759.34395999997,268001.11898000003,1051760.46294,4641999.4287299998,"39056,41,5",4681055.8412300004,{"$f":"Z61+AC61","v":5732816.3041700004}]
[null,null,null,null,3291,null," Mezinárodní spolupráce ve vzdělávání",null,null,2645.7649200000001,0,2645.7649200000001,860,0,860,3505.7649200000001,null,null,3232,null," Jazykové školy s právem státní jazykové zkoušky",null,null,3011.8,2418.6999999999998,5430.5,74.27,24770,24844.27,{"$f":"Z62+AC62","v":30274.77}]
[null,null,null,null,3292,null," Vzdělávání národnostních menšin a multikulturní výchova",null,null,4403.2180099999996,0,4403.2180099999996,1778.4845,0,1778.4845,6181.7025099999992,null,null,3233,null," Střediska volného času",null,null,107462.18023,24432.446769999999,131894.62700000001,868428.44911000005,15929.03073,884357.47984000004,{"$f":"Z63+AC63","v":1016252.10684}]
[{"$f":"IF(COUNTBLANK(C64:IV64)=254,\"odstr\",IF(AND($A$1=\"TISK\",SUM(J57:P57)=0),\"odstr\",\"OK\"))","v":{"$error":"#REF!"}},"OK",null,null,3293,null," Vzdělávací akce k integraci Romů",null,null,0,0,0,1086.8230000000001,0,1086.8230000000001,1086.8230000000001,null,null,3239,null," Záležitosti zájmového vzdělávání jinde nezařazené",null,null,3357.2601599999998,22461.80343,25819.063590000002,0,0,0,{"$f":"Z64+AC64","v":25819.063590000002}]
[null,null,null,null,3294,null," Zařízení pro další vzdělávání pedagogických pracovníků",null,null,50,0,50,35195.263740000002,0,35195.263740000002,35245.263740000002,null,null,326,null,"Správa ve vzdělávání",null,null,{"$f":"SUM(X66:X68)","v":18.265000000000001},{"$f":"SUM(Y66:Y68)","v":0},18.265000000000001,31972.08165,500,32472.08165,32490.346649999999]
[{"$f":"IF(COUNTBLANK(C66:IV66)=254,\"odstr\",IF(AND($A$1=\"TISK\",SUM(J58:P58)=0),\"odstr\",\"OK\"))","v":{"$error":"#REF!"}},"OK",null,null,3299,null," Ostatní záležitosti vzdělávání",null,null,365242.32111999998,25528.472440000001,390770.79355999996,236592.18735999995,83815.177319999988,320407.36467999994,711178.1582399999,null,null,3261,null," Činnost ústředního orgánu státní správy ve vzdělávání",null,null,0,0,0,0,0,0,0]
[{"$f":"IF(COUNTBLANK(C67:IV67)=254,\"odstr\",IF(AND($A$1=\"TISK\",SUM(J59:P59)=0),\"odstr\",\"OK\"))","v":{"$error":"#REF!"}},"OK",null,null,"Celkem kapitola 700-Obce a DSO; KÚ (část vzdělávání)1)",null,null,null,null,31909918.221629996,9391150.86314,41301069.084769987,96891385.572760031,2054009.0902800004,98945394.663040042,140246463.74781004,null,null,3262,null," Činnost ostatních orgánů státní správy ve vzdělávání",null,null,0,0,0,0,0,0,0]
[{"$f":"IF(COUNTBLANK(C68:IV68)=254,\"odstr\",IF(AND($A$1=\"TISK\",SUM(J60:P60)=0),\"odstr\",\"OK\"))","v":{"$error":"#REF!"}},"OK",null,"Komentáře:",null,null,null,null,null,null,null,null,null,null,null,"Zdroj: Závěrečný účet – kapitola 700-Obce a DSO; KÚ (část: vzdělávání)",null,null,3269,null," Ostatní správa ve vzdělávání jinde nezařazená",null,null,18.265000000000001,null,18.265000000000001,31972.08165,500,32472.08165,{"$f":"Z68+AC68","v":32490.346649999999}]
[null,null,null,"1)","Tabulka neobsahuje z daných tříd následující položky: 5321, 5323, 5329, 5344, 5345, 5349, 5366, 5367, 5641, 5642, 5649, 6341, 6342, 6349, 6441, 6442, 6449.",null,null,null,null,null,null,null,null,null,null,null,null,null,328,null,"Výzkum školství a vzdělávání",null,null,{"$f":"SUM(X70)","v":863.82983000000002},{"$f":"SUM(Y70)","v":0},863.82983000000002,1000,0,1000,{"$f":"AD70","v":1863.8298300000001}]
[{"$f":"IF(COUNTBLANK(C70:IV70)=254,\"odstr\",IF(AND($A$1=\"TISK\",SUM(J61:P61)=0),\"odstr\",\"OK\"))","v":{"$error":"#REF!"}},"OK",null,null,null,null,null,null,null,null,null,null,null,null,null,null,null,null,3280,null," Výzkum školství a vzdělávání",null,null,863.82983000000002,0,863.82983000000002,1000,0,1000,{"$f":"Z70+AC70","v":1863.8298300000001}]
[null,null,null,null,null,null,null,null,null,null,null,null,null,null,null,null,null,null,329,null,"Ostatní činnost a nespecifikované výdaje",null,null,{"$f":"SUM(X72:X76)","v":435863.23851},{"$f":"SUM(Y72:Y76)","v":46538.255510000003},482401.49401999998,736666.83880000003,380265.22026999999,1116932.05907,1599333.5530900001]
[{"$f":"IF(COUNTBLANK(C72:IV72)=254,\"odstr\",IF(AND($A$1=\"TISK\",SUM(J62:P62)=0),\"odstr\",\"OK\"))","v":{"$error":"#REF!"}},"OK",null,null,null,null,null,null,null,null,null,null,null,null,null,null,null,null,3291,null," Mezinárodní spolupráce ve vzdělávání",null,null,2669.10205,0,2669.10205,1291.4232,0,1291.4232,{"$f":"Z72+AC72","v":3960.5252499999997}]
[{"$error":"#REF!"},"OK",null,null,null,null,null,null,null,null,null,null,null,null,null,null,null,null,3292,null," Vzdělávání národnostních menšin a multikulturní výchova",null,null,4400.6089499999998,0,4400.6089499999998,1861.963,0,1861.963,{"$f":"Z73+AC73","v":6262.5719499999996}]
[{"$error":"#REF!"},"OK",null,null,null,null,null,null,null,null,null,null,null,null,null,null,null,null,3293,null," Vzdělávací akce k integraci Romů",null,null,0,0,0,1203.5540000000001,0,1203.5540000000001,{"$f":"Z74+AC74","v":1203.5540000000001}]
[{"$error":"#REF!"},null,null,null,null,null,null,null,null,null,null,null,null,null,null,null,null,null,3294,null," Zařízení pro další vzdělávání pedagogických pracovníků",null,null,50,0,50,57408.392910000002,150.392,57558.784910000002,{"$f":"Z75+AC75","v":57608.784910000002}]
[{"$error":"#REF!"},"OK",null,null,null,null,null,null,null,null,null,null,null,null,null,null,null,null,3299,null," Ostatní záležitosti vzdělávání",null,null,428743.52750999999,46538.255510000003,475281.78301999997,674901.50569000002,380114.82827,1055016.33396,{"$f":"Z76+AC76","v":1530298.1169799999}]
[{"$error":"#REF!"},"OK",null,null,null,null,null,null,null,null,null,null,null,null,null,null,null,null,"Celkem kapitola 700-Obce a DSO; KÚ (část vzdělávání)1)",null,null,null,null,35676406.316289999,14056598.283980001,49733004.600270003,109788985.34161,6192138.7592900004,115981124.10089999,165714128.70117]
["konst","stop",null,null,null,null,null,null,null,null,null,null,null,null,null,null,null,null,null,null,null,null,null,null,null,null,null,null,null,"Zdroj: Závěrečný účet – kapitola 700-Obce a DSO; KÚ (část: vzdělávání); monitor.statnipokladna.cz"]
["stop"]

{"sheet":"B10","index":10,"n_rows":107,"n_cols":31,"rows_kept":107,"cut":false,"hidden":false,"merged":[[105,19,105,30],[106,19,106,30],[104,23,104,30],[106,4,106,16],[8,11,11,12],[8,13,11,14],[105,4,105,16],[8,3,12,4],[8,6,12,7],[8,9,11,10],[8,15,11,16],[8,18,12,19],[8,23,11,24],[8,25,11,26],[8,27,11,28],[91,6,91,7],[89,6,89,7],[84,6,84,7],[89,21,89,22],[91,21,91,22],[8,29,11,30],[8,21,12,22]]}
[{"$f":"IF(#REF!=\"\",\"ŠABLONA\",IF(#REF!=\"T\",\"TISK\",\"ELEKTRO\"))","v":{"$error":"#REF!"}},0,{"$f":"CONCATENATE(D1,F1,IF(G1<>\"\",\".\",\"\"),G1,IF(H1<>\"\",\".\",\"\"),H1,IF(I1<>\"\",\".\",\"\"),I1,\"\")","v":{"$error":"#REF!"}},{"$f":"IF(#REF!=\"\",\" ?\",#REF!)","v":{"$error":"#REF!"}},{"$f":"CONCATENATE(C1,Q1)","v":{"$error":"#REF!"}},10]
["konst"]
["konst","70x8",null,"Tab. B10:",null,null,null,"Výdaje kapitol 333-MŠMT a 700-Obce a DSO; KÚ  (vzdělávání) – podle paragrafů",null,null,null,null,null,null,null,null,null,null,"Tab. B10:",null,null,"Výdaje kapitol 333-MŠMT a 700-Obce a DSO; KÚ (vzdělávání) - podle paragrafů"]
["konst",{"$f":"COUNTA(Datova_oblast)","v":588},null,{"$f":"IF(D1=\" ?\",\"\",CONCATENATE(\"Tab. \",E1,\":\"))","v":{"$error":"#REF!"}},null,null,null,{"$f":"IF(H3=\"Zadejte název tabulky\",\"\",H3)","v":"Výdaje kapitol 333-MŠMT a 700-Obce a DSO; KÚ  (vzdělávání) – podle paragrafů"},null,null,null,null,null,null,null,null,null,null,{"$f":"IF(S1=\" ?\",\"\",CONCATENATE(\"Tab. \",T1,\":\"))","v":"Tab. :"}]
[{"$f":"IF(D5=\"\",\"odstr\",\"OK\")","v":"odstr"},0]
[{"$f":"IF(COUNTBLANK(C6:IU6)=254,\"odstr\",\"OK\")","v":"OK"},"Řádky pro"]
[{"$f":"IF(COUNTBLANK(C7:IU7)=254,\"odstr\",\"OK\")","v":"OK"},"ročenku PaM"]
["konst",null,null,"(podle stavu k: 31. 12. 2017)",null,null,null,null,null,null,null,null,null,null,null,null,null,null,"(podle stavu k: 31. 12. 2018)",null,null,null,null,null,null,null,null,null,null,null,"v tis. Kč"]
["konst",null,null,"Paragraf",null,null,"Název",null,null,"Kapitola 333-MŠMT",null,"Transfery z kapitoly\n333-MŠMT",null,"Kapitola 700-Obce a DSO; KÚ (vzdělávání)1),2)",null,"Celkem",null,null,"Paragraf",null,null,"Název",null,"Kapitola 333-MŠMT",null,"Transfery z kapitoly\n333-MŠMT",null,"Kapitola 700-Obce a DSO; KÚ (vzdělávání)1),2)",null,"Celkem"]
["konst"]
["konst"]
["konst"]
["konst","nebo odstr",null,null,null,null,null,null,null,"v tis. Kč","% z cel. výdajů","v tis. Kč","% z cel. výdajů","v tis. Kč","% z cel. výdajů","v tis. Kč","% z cel. výdajů",null,null,null,null,null,null,"v tis. Kč","% z cel. výdajů","v tis. Kč","% z cel. výdajů","v tis. Kč","% z cel. výdajů","v tis. Kč","% z cel. výdajů"]
[{"$f":"IF(COUNTBLANK(C14:IU14)=254,\"odstr\",IF(AND($A$1=\"TISK\",SUM(J14:Q14)=0),\"odstr\",\"OK\"))","v":{"$error":"#REF!"}},"OK",null,null,"SKUPINA 3 – služby pro obyvatelstvo",null,null,null,null,157370213.11671004,0.99910338634839246,-106424970.75977001,-0.99989190266904338,142567169.77511004,1,193512412.13205007,0.99933009719507726,null,null,"SKUPINA 3 – služby pro obyvatelstvo",null,null,null,187415570.87681001,{"$f":"X14/X104","v":1.0000000000000002},{"$f":"SUM(Z15,Z77,Z80,Z86,Z89)","v":-121416404.67513001},{"$f":"-Z14/Z104","v":-0.99998958067633459},{"$f":"AB15+AB77+AB80+AB86+AB89+AB94+AB99","v":177886511.39489004},{"$f":"AB14/AB104","v":1},{"$f":"SUM(AD15,AD77,AD80,AD86,AD89)","v":243710485.78958997},{"$f":"AD14/AD104","v":0.99928684722377104}]
[{"$f":"IF(COUNTBLANK(C15:IU15)=254,\"odstr\",IF(AND($A$1=\"TISK\",SUM(J15:Q15)=0),\"odstr\",\"OK\"))","v":{"$error":"#REF!"}},"OK",null,null,null,null,"31–32 – vzdělávání ",null,null,145784199.86241001,0.9255467402246198,-106254453.26749,-0.99828984387986064,140246463.74781004,0.98372201656972813,179776210.34273005,0.92839407961370746,null,null,null,null,"31–32 – vzdělávání a školské služby",null,174969921.67857,0.93359000000000003,{"$f":"Z16+Z25+Z35+Z40+Z50+Z52+Z57+Z60+Z65+Z69+Z71","v":-120882985.38241},{"$f":"-Z15/Z104","v":-0.99559632149295663},165714128.70117,{"$f":"AB15/AB104","v":0.93157219961046633},{"$f":"AD16+AD25+AD35+AD40+AD50+AD52+AD57+AD60+AD65+AD69+AD71","v":219801065.03809997},{"$f":"AD15/AD104","v":0.90125097648848074}]
[null,null,null,null,null,null,null,null,null,null,null,null,null,null,null,null,null,null,null,311,null,"Předškolní a základní vzdělávání",null,3423650.8577299998,1.8259999999999998E-2,{"$f":"Z17+Z18+Z19+Z20","v":-2259540.09718},{"$f":"-Z16/Z104","v":-1.860964801540705E-2},105402132.94135998,{"$f":"AB16/AB104","v":0.59252459399452673},{"$f":"SUM(AD17:AD24)","v":106566243.63298997},{"$f":"AD16/AD104","v":0.43695389336850404}]
[{"$f":"IF(COUNTBLANK(C17:IU17)=254,\"odstr\",IF(AND($A$1=\"TISK\",SUM(J17:Q17)=0),\"odstr\",\"OK\"))","v":{"$error":"#REF!"}},"OK",null,null,3111,null," Mateřské školy",null,null,632221.16760000004,4.0138111079626136E-3,-515762.89839999995,-4.8457344373752965E-3,20961534.794509999,0.14702918510324212,21077993.06371,0.10885024182666277,null,null,3111,null," Mateřské školy",null,671543.53159999999,3.5799999999999998E-3,-537128.8284,{"$f":"-Z17/Z104","v":-4.4238110436398631E-3},24190414.828200001,{"$f":"AB17/AB104","v":0.13598790958635268},24324829.5,{"$f":"AD17/AD104","v":9.9739172492138484E-2}]
[{"$error":"#REF!"},"OK",null,null,3112,null," Mateřské školy pro děti se speciálními vzdělávacími  potřebami",null,null,36864.961000000003,2.3404624447820934E-4,-3858.2812000000004,-3.6249614188839617E-5,397377.55135000002,2.78730055437613E-3,430384.23115000001,2.2225753418487022E-3,null,null,3112,null," Mateřské školy pro děti se speciálními vzdělávacími  potřebami",null,50270.031000000003,{"$f":"X18/X104","v":2.6822761185111438E-4},-6695.7218000000003,{"$f":"-Z18/Z104","v":-5.5146189289847072E-5},476660.29716000002,{"$f":"AB18/AB104","v":2.6795752720219601E-3},520234.6,{"$f":"AD18/AD104","v":2.1331195150115509E-3}]
[{"$error":"#REF!"},"OK",null,null,3113,null," Základní školy",null,null,2087243.0524300002,1.325137432627355E-2,-1701039.8774000001,-1.5981738001776814E-2,57584891.64446,0.40391411104882163,57971094.819490001,0.29937232026715604,null,null,3113,null," Základní školy",null,2133094.3729300001,{"$f":"X19/X104","v":1.1381628340433374E-2},-1677670.26498,{"$f":"-Z19/Z104","v":-1.3817348564053986E-2},67941717.873669997,{"$f":"AB19/AB104","v":0.38193855925841541},68397142,{"$f":"AD19/AD104","v":0.28044900967989478}]
[{"$error":"#REF!"},"OK",null,null,3114,null," Základní školy pro žáky se speciálními vzdělávacími potřebami",null,null,487601.70549000002,3.0956589909617526E-3,-44914.827490000003,-4.2198717083420146E-4,4616960.1050199997,3.2384455076880175E-2,5059646.9830200002,2.6128853728844222E-2,null,null,3114,null," Základní školy pro žáky se speciálními vzdělávacími potřebami",null,568742.92220000003,{"$f":"X20/X104","v":3.0346620589696898E-3},-38045.281999999999,{"$f":"-Z20/Z104","v":-3.1334221842335377E-4},5153387.0093399994,{"$f":"AB20/AB104","v":2.8970083054245761E-2},5684084.5999999996,{"$f":"AD20/AD104","v":2.3306469399068469E-2}]
[{"$error":"#REF!"},null,null,null,3115,null," Ostatní záležitosti předškolního vzdělávání",null,null,0,0,0,0,20956.479620000002,1.4699372690821748E-4,20956.479620000002,1.0822272630879325E-4,null,null,3115,null," Ostatní záležitosti předškolního vzdělávání",null,0,0,0,{"$f":"Z21/Z104","v":0},46378.266600000003,{"$f":"AB21/AB104","v":2.6071828738630411E-4},46378.266600000003,{"$f":"AD21/AD104","v":1.90164947807909E-4}]
[{"$error":"#REF!"},"OK",null,null,3117,null," První stupeň základních škol",null,null,0,0,0,0,5788360.4238700001,4.0600935215314597E-2,5788360.4238700001,2.9892050443973063E-2,null,null,3117,null," První stupeň základních škol",null,0,0,0,{"$f":"Z22/Z104","v":0},6773116.0623100009,{"$f":"AB22/AB104","v":3.8075489868224857E-2},6773116.0623100009,{"$f":"AD22/AD104","v":2.7771828421161635E-2}]
[{"$error":"#REF!"},"OK",null,null,3118,null," Druhý stupeň základních škol",null,null,0,0,0,0,20365.93075,1.4285147683106751E-4,20365.93075,1.0517303428566435E-4,null,null,3118,null," Druhý stupeň základních škol",null,0,0,0,{"$f":"Z23/Z104","v":0},54841.715849999993,{"$f":"AB23/AB104","v":3.0829608956834808E-4},54841.715849999993,{"$f":"AD23/AD104","v":2.2486765454730092E-4}]
[{"$error":"#REF!"},"OK",null,null,3119,null," Ostatní záležitosti základního vzdělávání",null,null,0,0,0,0,557875.32002000033,3.9130700349877924E-3,557875.32002000033,2.8809604078413879E-3,null,null,3119,null," Ostatní záležitosti základního vzdělávání",null,0,0,0,{"$f":"Z24/Z104","v":0},765616.88823000004,{"$f":"AB24/AB104","v":4.3039625783115624E-3},765616.88823000004,{"$f":"AD24/AD104","v":3.1392612588740359E-3}]
[null,null,null,null,null,null,null,null,null,null,null,null,null,null,null,null,null,null,null,312,null,"Střední vzdělávání a vzdělávání v konzervatořích",null,1473101.2790800002,{"$f":"X25/X104","v":7.8600794597172702E-3},{"$f":"SUM(Z26:Z34)","v":-469714.03288000001},{"$f":"-Z25/Z104","v":-3.8685805269415359E-3},40957851.822169997,{"$f":"AB25/AB104","v":0.23024709125498399},{"$f":"SUM(AD26:AD34)","v":41961239.032510005},{"$f":"AD25/AD104","v":0.1720537962186896}]
[{"$f":"IF(COUNTBLANK(C26:IU26)=254,\"odstr\",IF(AND($A$1=\"TISK\",SUM(J26:Q26)=0),\"odstr\",\"OK\"))","v":{"$error":"#REF!"}},"OK",null,null,3121,null," Gymnázia",null,null,514593.04879999999,3.2670201524486052E-3,-120566.098,-1.1327516866198937E-3,7927899.258249999,5.5608168912630575E-2,8321926.2090499988,4.2975803131766237E-2,null,null,3121,null," Gymnázia",null,558261.80787000002,{"$f":"X26/X104","v":2.9787376003936766E-3},-135430.76227000001,{"$f":"-Z26/Z104","v":-1.1154122998075725E-3},9459150.2149299998,{"$f":"AB26/AB104","v":5.3175196594482894E-2},9881981.1999999993,{"$f":"AD26/AD104","v":4.0519117614816975E-2}]
[{"$error":"#REF!"},"OK",null,null,3122,null," Střední odborné školy",null,null,335334.96978999994,2.1289562824049445E-3,-156222.06840000002,-1.467749345818162E-3,12204566.654460004,8.5605730082962808E-2,12383679.555850003,6.395136910254362E-2,null,null,3122,null," Střední odborné školy",null,328133.88540000003,{"$f":"X27/X104","v":1.750835770287654E-3},-136342.54240000001,{"$f":"-Z27/Z104","v":-1.1229217515353461E-3},15166826.98134,{"$f":"AB27/AB104","v":8.5261253719632404E-2},15358618.4,{"$f":"AD27/AD104","v":6.2974989807781878E-2}]
[{"$error":"#REF!"},"OK",null,null,3123,null," Střední školy poskytující střední vzdělání s výučním listem",null,null,114483.54172999998,7.2682683691082306E-4,-87766.103129999989,-8.2458670387228607E-4,7985768.2222899999,5.6014075574951819E-2,8012485.6608899999,4.1377800969208241E-2,null,null,3123,null," Střední školy poskytující střední vzdělání s výučním listem",null,128779.27481,{"$f":"X28/X104","v":6.8713220682526874E-4},-95992.660610000006,{"$f":"-Z28/Z104","v":-7.9059877195541593E-4},9273755.5897899996,{"$f":"AB28/AB104","v":5.2132989269788994E-2},9306542.1999999993,{"$f":"AD28/AD104","v":3.8159643330333143E-2}]
[{"$error":"#REF!"},"OK",null,null,3124,null," Střední školy a konzervatoře pro žáky se speciálními  vzdělávacími potřebami",null,null,309763.25818,1.9666080008700661E-3,-5215.5815999999995,-4.9001825157381172E-5,1111936.31219,7.799385468225283E-3,1416483.9887699999,7.31495756048379E-3,null,null,3124,null," Střední školy a konzervatoře pro žáky se speciálními  vzdělávacími potřebami",null,320529.59659999999,{"$f":"X29/X104","v":1.7102612931274911E-3},-6987.1840000000002,{"$f":"-Z29/Z104","v":-5.7546681743406785E-5},1208732.2676599999,{"$f":"AB29/AB104","v":6.7949630254805363E-3},1522274.7,{"$f":"AD29/AD104","v":6.2417875892498385E-3}]
[{"$error":"#REF!"},"OK",null,null,3125,null," Střediska praktického vyučování a školní hospodářství",null,null,0,0,0,0,89728.669620000001,6.2937820650813816E-4,89728.669620000001,4.6337368825391441E-4,null,null,3125,null," Střediska praktického vyučování a školní hospodářství",null,0,0,0,{"$f":"-Z30/Z104","v":0},142668.68979999999,{"$f":"AB30/AB104","v":8.0202084284676284E-4},{"$f":"AB30","v":142668.68979999999},{"$f":"AD30/AD104","v":5.8498486335493527E-4}]
[{"$error":"#REF!"},"OK",null,null,3126,null," Konzervatoře",null,null,37237.4666,2.3641118762102458E-4,-462.33840000000004,-4.3437965653424655E-6,707354.55203000002,4.9615528816753778E-3,744129.68023000006,3.8428087246545435E-3,null,null,3126,null," Konzervatoře",null,44188.8344,{"$f":"X31/X104","v":2.3577995250483074E-4},-1753.0036,{"$f":"-Z31/Z104","v":-1.4437796437627285E-5},836703.40094000008,{"$f":"AB31/AB104","v":4.7035797957867822E-3},879139.2,{"$f":"AD31/AD104","v":3.6047371396128645E-3}]
[{"$error":"#REF!"},null,null,null,3127,null," Střední školy",null,null,0,0,0,0,3893086.0096899997,2.7307030193775166E-2,3893086.0096899997,2.0104539949600219E-2,null,null,3127,null," Střední školy",null,0,0,0,{"$f":"-Z32/Z104","v":0},4750308.5327100009,{"$f":"AB32/AB104","v":2.6704152526578009E-2},{"$f":"AB32","v":4750308.5327100009},{"$f":"AD32/AD104","v":1.9477704546082844E-2}]
[{"$error":"#REF!"},"OK",null,null,3128,null," Sportovní školy - gymnázia",null,null,82999.92,5.2694534433365644E-4,-82999.92,-7.7980710107509869E-4,97972.336939999994,6.8720124762625687E-4,97972.336939999994,5.0594534954103581E-4,null,null,3128,null," Sportovní školy - gymnázia",null,93207.88,{"$f":"X33/X104","v":4.9733263657834718E-4},-93207.88,{"$f":"-Z33/Z104","v":-7.6766322546216762E-4},119162.735,{"$f":"AB33/AB104","v":6.6988066754241303E-4},119162.7,{"$f":"AD33/AD104","v":4.8860318177888773E-4}]
[{"$error":"#REF!"},"OK",null,null,3129,null," Ostatní zařízení středního vzdělávání",null,null,0,0,0,0,82.269100000000009,5.7705501294424154E-7,82.269100000000009,4.248512371550095E-7,null,null,3129,null," Ostatní zařízení středního vzdělávání",null,0,0,0,{"$f":"-Z34/Z104","v":0},543.41000000000008,{"$f":"AB34/AB104","v":3.0548128452172795E-6},{"$f":"AB34","v":543.41000000000008},{"$f":"AD34/AD104","v":2.2281456782236842E-6}]
[null,null,null,null,null,null,null,null,null,null,null,null,null,null,null,null,null,null,null,313,null,"Školská zařízení pro výkon ústavní a ochranné výchovy",null,1542794.1956999998,{"$f":"X35/X104","v":8.2319424607152462E-3},{"$f":"Z36","v":-673.14359999999999},{"$f":"-Z35/Z104","v":-5.5440332638744191E-6},2028995.3096399999,{"$f":"AB35/AB104","v":1.140612232894846E-2},{"$f":"SUM(AD36:AD39)","v":3571116.4329500003},{"$f":"AD35/AD104","v":1.4642659587624668E-2}]
[{"$f":"IF(COUNTBLANK(C36:IU36)=254,\"odstr\",IF(AND($A$1=\"TISK\",SUM(J36:Q36)=0),\"odstr\",\"OK\"))","v":{"$error":"#REF!"}},"OK",null,null,3131,null," Výchovné ústavy a dětské domovy se školou",null,null,890553.34366000001,5.6538962727001154E-3,-280.04640000000001,-2.6311130342115695E-6,62.672599999999996,4.3960050619551286E-7,890335.96986000007,4.5978421822850408E-3,null,null,3131,null," Výchovné ústavy a dětské domovy se školou",null,1007022.31779,{"$f":"X36/X104","v":5.3732051882280649E-3},-673.14359999999999,{"$f":"-Z36/Z104","v":-5.5440332638744191E-6},134.8546,{"$f":"AB36/AB104","v":7.5809345488054715E-7},1006484.1,{"$f":"AD36/AD104","v":4.1268898209746857E-3}]
[{"$f":"IF(COUNTBLANK(C37:IU37)=254,\"odstr\",IF(AND($A$1=\"TISK\",SUM(J37:Q37)=0),\"odstr\",\"OK\"))","v":{"$error":"#REF!"}},"OK",null,null,3132,null," Diagnostické ústavy",null,null,331675.31220000004,2.1057220488188665E-3,0,0,0,0,331675.31220000004,1.7128261610002298E-3,null,null,3132,null," Diagnostické ústavy",null,369155.20290999999,{"$f":"X37/X104","v":1.9697146890353587E-3},0,{"$f":"-Z37/Z104","v":0},0,{"$f":"AB37/AB104","v":0},{"$f":"X37","v":369155.20290999999},{"$f":"AD37/AD104","v":1.5136482029364635E-3}]
[{"$f":"IF(COUNTBLANK(C38:IU38)=254,\"odstr\",IF(AND($A$1=\"TISK\",SUM(J38:Q38)=0),\"odstr\",\"OK\"))","v":{"$error":"#REF!"}},null,null,null,3133,null," Dětské domovy",null,null,32072.404999999999,2.0361952754091188E-4,0,0,1834610.65194,1.2868394980653491E-2,1866683.05694,9.6398599974626426E-3,null,null,3133,null," Dětské domovy",null,21387.014999999999,{"$f":"X38/X104","v":1.1411546489943403E-4},0,{"$f":"-Z38/Z104","v":0},2028850.4550399999,{"$f":"AB38/AB104","v":1.1405308019876546E-2},{"$f":"X38+AB38","v":2050237.4700399998},{"$f":"AD38/AD104","v":8.4065949434163623E-3}]
[{"$f":"IF(COUNTBLANK(C39:IU39)=254,\"odstr\",IF(AND($A$1=\"TISK\",SUM(J39:Q39)=0),\"odstr\",\"OK\"))","v":{"$error":"#REF!"}},"OK",null,null,3139,null," Ostatní školská zařízení pro výkon ústavní a ochranné výchovy",null,null,127843.736,8.1164730625548883E-4,0,0,10,7.0142375806255515E-8,127853.736,6.6025783574258097E-4,null,null,3139,null," Ostatní školská zařízení pro výkon ústavní a ochranné výchovy",null,145229.66,{"$f":"X39/X104","v":7.7490711855238983E-4},0,{"$f":"-Z39/Z104","v":0},10,{"$f":"AB39/AB104","v":5.6215617033497346E-8},{"$f":"X39+AB39","v":145239.66},{"$f":"AD39/AD104","v":5.9552662029715552E-4}]
[null,null,null,null,null,null,null,null,null,null,null,null,null,null,null,null,null,null,null,314,null,"Ostatní zařízení související s výchovou a vzděláváním mládeže",null,811207.65240000014,{"$f":"X40/X104","v":4.3283898376470257E-3},{"$f":"Z41+Z42+Z43+Z44+Z45+Z46+Z47+Z48+Z49","v":-5604.2554},{"$f":"-Z40/Z104","v":-4.6156835416466612E-5},8267386.1128600007,{"$f":"AB40/AB104","v":4.6475621158859205E-2},{"$f":"SUM(AD41:AD49)","v":9072989.4818500001},{"$f":"AD40/AD104","v":3.7202006408702484E-2}]
[{"$f":"IF(COUNTBLANK(C41:IU41)=254,\"odstr\",IF(AND($A$1=\"TISK\",SUM(J41:Q41)=0),\"odstr\",\"OK\"))","v":{"$error":"#REF!"}},"OK",null,null,3141,null," Školní stravování ",null,null,199275.97099999999,1.265152365882024E-3,0,0,3561487.8456299994,2.4981121889759074E-2,3760763.8166299993,1.9421206262655727E-2,null,null,3141,null," Školní stravování ",null,220909.90100000001,{"$f":"X41/X104","v":1.17871690151725E-3},0,{"$f":"-Z41/Z104","v":0},4121044.3883400001,{"$f":"AB41/AB104","v":2.3166705311296474E-2},{"$f":"X41+AB41","v":4341954.2893399997},{"$f":"AD41/AD104","v":1.7803328398148188E-2}]
[null,null,null,null,null,null,null,null,null,null,null,null,null,null,null,null,null,null,null,3142,null,"Ostatní školní stravování",null,0,{"$f":"X42/X104","v":0},0,{"$f":"-Z42/Z104","v":0},0,{"$f":"AB42/AB104","v":0},0,{"$f":"AD42/AD104","v":0}]
[{"$f":"IF(COUNTBLANK(C43:IU43)=254,\"odstr\",IF(AND($A$1=\"TISK\",SUM(J43:Q43)=0),\"odstr\",\"OK\"))","v":{"$error":"#REF!"}},"OK",null,null,3143,null," Školní družiny a kluby",null,null,108720.727,6.9024019451127726E-4,0,0,1643294.6001500001,1.1526458740411168E-2,1752015.32715,9.047696878344556E-3,null,null,3143,null," Školní družiny a kluby",null,128792.747,{"$f":"X43/X104","v":6.8720409087384042E-4},-194.81399999999999,{"$f":"-Z43/Z104","v":-1.6044946372043513E-6},1889560.9581500001,{"$f":"AB43/AB104","v":1.0622283518480871E-2},2018158.9,{"$f":"AD43/AD104","v":8.2750630849702141E-3}]
[{"$error":"#REF!"},"OK",null,null,3144,null," Školy v přírodě",null,null,0,0,0,0,19011.332999999999,1.3335000638638669E-4,19011.332999999999,9.8177667496251406E-5,null,null,3144,null," Školy v přírodě",null,0,0,0,{"$f":"-Z44/Z104","v":0},19762.80948,{"$f":"AB44/AB104","v":1.1109785292336508E-4},{"$f":"AB44","v":19762.80948},{"$f":"AD44/AD104","v":8.1033507908246163E-5}]
[{"$error":"#REF!"},"OK",null,null,3145,null," Internáty",null,null,66352.792000000001,4.2125697022285665E-4,0,0,72203.767779999995,5.0645438142523627E-4,138556.55978000001,7.1552898765727378E-4,null,null,3145,null," Internáty",null,73378.255000000005,{"$f":"X45/X104","v":3.9152699349741981E-4},0,{"$f":"-Z45/Z104","v":0},76813.797000000006,{"$f":"AB45/AB104","v":4.3181349950408075E-4},{"$f":"X45+AB45","v":150192.05200000003},{"$f":"AD45/AD104","v":6.1583292829971267E-4}]
[{"$error":"#REF!"},"OK",null,null,3146,null," Zařízení výchovného poradenství ",null,null,50637.398999999998,3.2148394422808777E-4,0,0,856048.89003999997,6.0045302953713577E-3,906686.28903999995,4.6822779343657396E-3,null,null,3146,null," Zařízení výchovného poradenství ",null,56661.133999999998,{"$f":"X46/X104","v":3.0232884991847288E-4},0,{"$f":"-Z46/Z104","v":0},973608.53745000006,{"$f":"AB46/AB104","v":5.4732004681832657E-3},{"$f":"X46+AB46","v":1030269.67145},{"$f":"AD46/AD104","v":4.2244178720418323E-3}]
[{"$error":"#REF!"},"OK",null,null,3147,null," Domovy mládeže",null,null,48663.65,3.0895311472327368E-4,0,0,634976.99353999994,4.4538794909208951E-3,683640.64353999996,3.5304333361786599E-3,null,null,3147,null," Domovy mládeže",null,56607.864999999998,{"$f":"X47/X104","v":3.0204462059990139E-4},0,{"$f":"-Z47/Z104","v":0},748343.62476999999,{"$f":"AB47/AB104","v":4.2068598619529555E-3},{"$f":"X47+AB47","v":804951.48976999999},{"$f":"AD47/AD104","v":3.300545045381464E-3}]
[{"$error":"#REF!"},"OK",null,null,3148,null," Střediska výchovné péče",null,null,249092.18700000001,1.5814228284742749E-3,0,0,18846.084999999999,1.3219091765466349E-4,267938.272,1.3836775452797639E-3,null,null,3148,null," Střediska výchovné péče",null,269448.30900000001,{"$f":"X48/X104","v":1.4377050302672605E-3},0,{"$f":"-Z48/Z104","v":0},22957.160810000001,{"$f":"AB48/AB104","v":1.2905509602713738E-4},{"$f":"X48+AB48","v":292405.46981000004},{"$f":"AD48/AD104","v":1.198951038527295E-3}]
[{"$error":"#REF!"},"OK",null,null,3149,null," Ostatní zařízení související s výchovou a vzděláváním mládeže",null,null,0,0,0,0,612358.95675999997,4.2952312073386489E-3,612358.95675999997,3.1623229178687614E-3,null,null,3149,null," Ostatní zařízení související s výchovou a vzděláváním mládeže",null,5409.4413999999997,{"$f":"X49/X104","v":2.8863350972879816E-5},-5409.4413999999997,{"$f":"-Z49/Z104","v":-4.4552340779262261E-5},415294.83686000004,{"$f":"AB49/AB104","v":2.3346055504910521E-3},415294.8,{"$f":"AD49/AD104","v":1.7028345334255334E-3}]
[null,null,null,null,null,null,null,null,null,null,null,null,null,null,null,null,null,null,null,315,null,"Vyšší odborné vzdělávání",null,214347.65158999999,{"$f":"X50/X104","v":1.1437024713965348E-3},{"$f":"Z51","v":-90851.081000000006},{"$f":"-Z50/Z104","v":-7.4825254986149946E-4},598265.4976,{"$f":"AB50/AB104","v":3.3631864097436325E-3},{"$f":"AD51","v":721762.1},{"$f":"AD50/AD104","v":2.9594433371131377E-3}]
[{"$f":"IF(COUNTBLANK(C51:IU51)=254,\"odstr\",IF(AND($A$1=\"TISK\",SUM(J51:Q51)=0),\"odstr\",\"OK\"))","v":{"$error":"#REF!"}},"OK",null,null,3150,null," Vyšší odborné školy",null,null,105887.0906,6.7225015899661188E-4,-37848.165000000001,-3.5559393105031922E-4,414761.68334999995,2.9092369863570845E-3,482800.60894999991,2.4932621848494682E-3,null,null,3150,null," Vyšší odborné školy",null,214347.65158999999,{"$f":"X51/X104","v":1.1437024713965348E-3},-90851.081000000006,{"$f":"-Z51/Z104","v":-7.4825254986149946E-4},598265.4976,{"$f":"AB51/AB104","v":3.3631864097436325E-3},721762.1,{"$f":"AD51/AD104","v":2.9594433371131377E-3}]
[null,null,null,null,null,null,null,null,null,null,null,null,null,null,null,null,null,null,null,321,null,"Vysokoškolské vzdělávání",null,46001484.004359998,{"$f":"X52/X104","v":0.24545177217210626},{"$f":"SUM(Z53:Z56)","v":0},{"$f":"-Z52/Z104","v":0},15913.121370000001,{"$f":"AB52/AB104","v":8.9456593674348267E-5},{"$f":"SUM(AD53:AD56)","v":46017397.12573},{"$f":"AD52/AD104","v":0.18868527360335341}]
[{"$f":"IF(COUNTBLANK(C53:IU53)=254,\"odstr\",IF(AND($A$1=\"TISK\",SUM(J53:Q53)=0),\"odstr\",\"OK\"))","v":{"$error":"#REF!"}},"OK",null,null,3211,null," Vysoké školy",null,null,22625790.358630002,0.14364537810818864,0,0,6834.8329999999996,4.7941142485899673E-5,22632625.191630002,0.11687861922313042,null,null,3211,null," Vysoké školy",null,31139822.96212,{"$f":"X53/X104","v":0.16615387300230511},0,{"$f":"-Z53/Z104","v":0},13343.152620000001,{"$f":"AB53/AB104","v":7.5009355770542678E-5},{"$f":"X53+AB53","v":31153166.114739999},{"$f":"AD53/AD104","v":0.12773742191263032}]
[{"$f":"IF(COUNTBLANK(C54:IU54)=254,\"odstr\",IF(AND($A$1=\"TISK\",SUM(J54:Q54)=0),\"odstr\",\"OK\"))","v":{"$error":"#REF!"}},"OK",null,null,3212,null," Výzkum, vývoj a inovace na vysokých školách",null,null,9852317.9520100001,6.2549856381868482E-2,0,0,3920.7,2.7500721282358596E-5,9856238.6520099994,5.0899246314855408E-2,null,null,3212,null," Výzkum, vývoj a inovace na vysokých školách",null,14861661.042239999,{"$f":"X54/X104","v":7.929789916980115E-2},0,{"$f":"-Z54/Z104","v":0},2436.96875,{"$f":"AB54/AB104","v":1.3699570197260073E-5},{"$f":"X54+AB54","v":14864098.010989999},{"$f":"AD54/AD104","v":6.0947306350417958E-2}]
[{"$f":"IF(COUNTBLANK(C55:IU55)=254,\"odstr\",IF(AND($A$1=\"TISK\",SUM(J55:Q55)=0),\"odstr\",\"OK\"))","v":{"$error":"#REF!"}},"OK",null,null,3213,null," Bakalářské studium",null,null,0,0,0,0,604,4.2365994986978331E-6,604,3.1191558828481862E-6,null,null,3213,null," Bakalářské studium",null,0,0,0,{"$f":"-Z55/Z104","v":0},85,{"$f":"AB55/AB104","v":4.7783274478472741E-7},{"$f":"X55+AB55","v":85},{"$f":"AD55/AD104","v":3.4852575890950319E-7}]
[{"$f":"IF(COUNTBLANK(C56:IU56)=254,\"odstr\",IF(AND($A$1=\"TISK\",SUM(J56:Q56)=0),\"odstr\",\"OK\"))","v":{"$error":"#REF!"}},"OK",null,null,3214,null," Magisterské a doktorské studium",null,null,0,0,0,0,50,3.5071187903127757E-7,50,2.5820826844769752E-7,null,null,3214,null," Magisterské a doktorské studium",null,0,0,0,{"$f":"-Z56/Z104","v":0},48,{"$f":"AB56/AB104","v":2.6983496176078723E-7},{"$f":"X56+AB56","v":48},{"$f":"AD56/AD104","v":1.9681454620771945E-7}]
[null,null,null,null,null,null,null,null,null,null,null,null,null,null,null,null,null,null,null,322,null,"Zařízení související s vysokoškolským vzděláváním ",null,122900,{"$f":"X57/X104","v":6.5576194883392759E-4},{"$f":"SUM(Z58:Z59)","v":0},{"$f":"-Z57/Z104","v":0},4733.9220000000005,{"$f":"AB57/AB104","v":2.6612034621844785E-5},{"$f":"SUM(AD58:AD59)","v":127633.92200000001},{"$f":"AD57/AD104","v":5.2333775914878043E-4}]
[{"$f":"IF(COUNTBLANK(C58:IU58)=254,\"odstr\",IF(AND($A$1=\"TISK\",SUM(J58:Q58)=0),\"odstr\",\"OK\"))","v":{"$error":"#REF!"}},"OK",null,null,3221,null," Vysokoškolské koleje a menzy",null,null,129947,8.2500039349586902E-4,0,0,0,0,129947,6.7106779719945902E-4,null,null,3221,null," Vysokoškolské koleje a menzy",null,122900,{"$f":"X58/X104","v":6.5576194883392759E-4},0,{"$f":"-Z58/Z104","v":0},0,{"$f":"AB58/AB104","v":0},{"$f":"X58+AB58","v":122900},{"$f":"AD58/AD104","v":5.0392724435268169E-4}]
[{"$f":"IF(COUNTBLANK(C59:IU59)=254,\"odstr\",IF(AND($A$1=\"TISK\",SUM(J59:Q59)=0),\"odstr\",\"OK\"))","v":{"$error":"#REF!"}},"OK",null,null,3229,null," Ostatní zařízení související s vysokoškolským vzděláváním",null,null,0,0,0,0,3027.9810000000002,2.123897812362014E-5,3027.9810000000002,1.5636994618050553E-5,null,null,3229,null," Ostatní zařízení související s vysokoškolským vzděláváním",null,0,0,0,{"$f":"-Z59/Z104","v":0},4733.9220000000005,{"$f":"AB59/AB104","v":2.6612034621844785E-5},{"$f":"X59+AB59","v":4733.9220000000005},{"$f":"AD59/AD104","v":1.9410514796098744E-5}]
[null,null,null,null,null,null,null,null,null,null,null,null,null,null,null,null,null,null,null,323,null,"Základní umělecké, jazykové a zájmové vzdělávání",null,242744.18979999999,{"$f":"X60/X104","v":1.2952189013129439E-3},{"$f":"Z61+Z62+Z63+Z64","v":-89207.098800000007},{"$f":"-Z60/Z104","v":-7.3471265733037025E-4},6805162.2446000008,{"$f":"AB60/AB104","v":3.8255639459324885E-2},{"$f":"SUM(AD61:AD64)","v":6958699.2335899994},{"$f":"AD60/AD104","v":2.8532775663646266E-2}]
[{"$f":"IF(COUNTBLANK(C61:IU61)=254,\"odstr\",IF(AND($A$1=\"TISK\",SUM(J61:Q61)=0),\"odstr\",\"OK\"))","v":{"$error":"#REF!"}},"OK",null,null,3231,null," Základní umělecké školy",null,null,18015.726999999999,1.143772604532167E-4,0,0,4957731.7971099997,3.4774708685951207E-2,4975747.5241099996,2.5695583048667221E-2,null,null,3231,null," Základní umělecké školy",null,79160.349000000002,{"$f":"X61/X104","v":4.2237872034673598E-4},-51815.953000000001,{"$f":"-Z61/Z104","v":-4.2675792658706624E-4},5732816.3041700004,{"$f":"AB61/AB104","v":3.2227380587861038E-2},5760160.5999999996,{"$f":"AD61/AD104","v":2.3618404053595519E-2}]
[{"$f":"IF(COUNTBLANK(C62:IU62)=254,\"odstr\",IF(AND($A$1=\"TISK\",SUM(J62:Q62)=0),\"odstr\",\"OK\"))","v":{"$error":"#REF!"}},null,null,null,3232,null," Jazykové školy s právem státní jazykové zkoušky",null,null,0,0,0,0,1104.9000000000001,7.7500311028331711E-6,1104.9000000000001,5.7058863161572201E-6,null,null,3232,null," Jazykové školy s právem státní jazykové zkoušky",null,0,0,0,{"$f":"-Z62/Z104","v":0},30274.77,{"$f":"AB62/AB104","v":1.7019148760972144E-4},{"$f":"X62+AB62","v":30274.77},{"$f":"AD62/AD104","v":1.2413573164777247E-4}]
[{"$f":"IF(COUNTBLANK(C63:IU63)=254,\"odstr\",IF(AND($A$1=\"TISK\",SUM(J63:Q63)=0),\"odstr\",\"OK\"))","v":{"$error":"#REF!"}},null,null,null,3233,null," Střediska volného času",null,null,106034.5122,6.7318610117311306E-4,-4472.5731999999998,-4.202105666412904E-5,854459.2476,5.9933801656289528E-3,956021.18660000002,4.9370515038259823E-3,null,null,3233,null," Střediska volného času",null,163583.84080000001,{"$f":"X63/X104","v":8.72840180966208E-4},-37391.145799999998,{"$f":"-Z63/Z104","v":-3.0795473074330391E-4},1016252.10684,{"$f":"AB63/AB104","v":5.7129239247602267E-3},1142444.8,{"$f":"AD63/AD104","v":4.6843698933201833E-3}]
[{"$f":"IF(COUNTBLANK(C64:IU64)=254,\"odstr\",IF(AND($A$1=\"TISK\",SUM(J64:Q64)=0),\"odstr\",\"OK\"))","v":{"$error":"#REF!"}},"OK",null,null,3239,null," Záležitosti zájmového vzdělávání jinde nezařazené",null,null,0,0,0,0,4863.23387,3.4111877774325033E-5,4863.23387,2.5114543932577897E-5,null,null,3239,null," Záležitosti zájmového vzdělávání jinde nezařazené",null,0,0,0,{"$f":"-Z64/Z104","v":0},25819.063590000002,{"$f":"AB64/AB104","v":1.4514345909389552E-4},{"$f":"X64+AB64","v":25819.063590000002},{"$f":"AD64/AD104","v":1.058659850827938E-4}]
[null,null,null,null,null,null,null,null,null,null,null,null,null,null,null,null,null,null,null,326,null,"Správa ve vzdělávání",null,901799.84317000001,{"$f":"X65/X104","v":4.8117658471545114E-3},{"$f":"Z66+Z67+Z68","v":-10403.786039999999},{"$f":"-Z65/Z104","v":-8.5685930722645672E-5},32490.346649999999,{"$f":"AB65/AB104","v":1.8264648845619732E-4},{"$f":"SUM(AD66:AD68)","v":923886.34664999996},{"$f":"AD65/AD104","v":3.7882140013214068E-3}]
[{"$f":"IF(COUNTBLANK(C66:IU66)=254,\"odstr\",IF(AND($A$1=\"TISK\",SUM(J66:Q66)=0),\"odstr\",\"OK\"))","v":{"$error":"#REF!"}},"OK",null,null,3261,null," Činnost ústředního orgánu státní správy ve vzdělávání",null,null,471826.32829999994,2.9955051406281869E-3,0,0,0,0,471826.32829999994,2.436589184767557E-3,null,null,3261,null," Činnost ústředního orgánu státní správy ve vzdělávání",null,492686.8015,{"$f":"X66/X104","v":2.6288466811748936E-3},-5591.1000400000003,{"$f":"-Z66/Z104","v":-4.6048487430333729E-5},0,{"$f":"AB66/AB104","v":0},487095.7,{"$f":"AD66/AD104","v":1.9972399824006552E-3}]
[{"$f":"IF(COUNTBLANK(C67:IU67)=254,\"odstr\",IF(AND($A$1=\"TISK\",SUM(J67:Q67)=0),\"odstr\",\"OK\"))","v":{"$error":"#REF!"}},"OK",null,null,3262,null," Činnost ostatních orgánů státní správy ve vzdělávání",null,null,378274.29704000003,2.40156713050223E-3,0,0,0,0,378274.29704000003,1.9534710247393681E-3,null,null,3262,null," Činnost ostatních orgánů státní správy ve vzdělávání",null,409113.04167000001,{"$f":"X67/X104","v":2.1829191659796178E-3},-4812.6859999999997,{"$f":"-Z67/Z104","v":-3.963744329231195E-5},0,{"$f":"AB67/AB104","v":0},404300.3,{"$f":"AD67/AD104","v":1.6577537515863508E-3}]
[{"$f":"IF(COUNTBLANK(C68:IU68)=254,\"odstr\",IF(AND($A$1=\"TISK\",SUM(J68:Q68)=0),\"odstr\",\"OK\"))","v":{"$error":"#REF!"}},"OK",null,null,3269,null," Ostatní správa ve vzdělávání jinde nezařazená",null,null,0,0,0,0,21444.638200000001,1.5041778716535828E-4,21444.638200000001,1.1074365794218699E-4,null,null,3269,null," Ostatní správa ve vzdělávání jinde nezařazená",null,0,0,0,{"$f":"-Z68/Z104","v":0},32490.346649999999,{"$f":"AB68/AB104","v":1.8264648845619732E-4},{"$f":"AB68","v":32490.346649999999},{"$f":"AD68/AD104","v":1.3322026733440098E-4}]
[null,null,null,null,null,null,null,null,null,null,null,null,null,null,null,null,null,null,null,328,null,"Výzkum školství a vzdělávání",null,0,0,{"$f":"Z70","v":0},{"$f":"-Z69/Z104","v":0},1863.8298300000001,{"$f":"AB69/AB104","v":1.0477634393888846E-5},{"$f":"AD70","v":1863.8298300000001},{"$f":"AD69/AD104","v":7.6422671291637689E-6}]
[{"$f":"IF(COUNTBLANK(C70:IU70)=254,\"odstr\",IF(AND($A$1=\"TISK\",SUM(J70:Q70)=0),\"odstr\",\"OK\"))","v":{"$error":"#REF!"}},"OK",null,null,3280,null," Výzkum školství a vzdělávání",null,null,0,0,0,0,834.69065999999987,5.8547185955691433E-6,834.69065999999987,4.3104806001613153E-6,null,null,3280,null," Výzkum školství a vzdělávání",null,0,0,0,{"$f":"-Z70/Z104","v":0},1863.8298300000001,{"$f":"AB70/AB104","v":1.0477634393888846E-5},{"$f":"AB70","v":1863.8298300000001},{"$f":"AD70/AD104","v":7.6422671291637689E-6}]
[null,null,null,null,null,null,null,null,null,null,null,null,null,null,null,null,null,null,null,329,null,"Ostatní činnost a nespecifikované výdaje",null,120235892.00474,{"$f":"X71/X104","v":0.641546972016387},{"$f":"Z72+Z73+Z74+Z75+Z76","v":-117956991.88751},{"$f":"-Z71/Z104","v":-0.9714977409440132},1599333.5530900001,{"$f":"AB71/AB104","v":8.9907522529330038E-3},{"$f":"SUM(AD72:AD76)","v":3878233.9},{"$f":"AD71/AD104","v":1.5901934273247792E-2}]
[{"$f":"IF(COUNTBLANK(C72:IU72)=254,\"odstr\",IF(AND($A$1=\"TISK\",SUM(J72:Q72)=0),\"odstr\",\"OK\"))","v":{"$error":"#REF!"}},"OK",null,null,3291,null," Mezinárodní spolupráce ve vzdělávání",null,null,17503.67021,1.1112634236166992E-4,0,0,3505.7649200000001,2.4590268050702728E-5,21009.435130000002,1.0849619731963055E-4,null,null,3291,null," Mezinárodní spolupráce ve vzdělávání",null,20428.55327,{"$f":"X72/X104","v":1.0900136618545894E-4},0,{"$f":"-Z72/Z104","v":0},3960.5252499999997,{"$f":"AB72/AB104","v":2.2264337070549632E-5},24389.1,{"$f":"AD72/AD104","v":1.0000270101905605E-4}]
[{"$error":"#REF!"},"OK",null,null,3292,null," Vzdělávání národnostních menšin a multikulturní výchova",null,null,10200.973,6.4763378446910938E-5,-878.26700000000005,-8.2515602815029666E-6,6181.7025100000001,4.3359930057889295E-5,15504.408510000001,8.0067329493456924E-5,null,null,3292,null," Vzdělávání národnostních menšin a multikulturní výchova",null,12589.97184,{"$f":"X73/X104","v":6.7176765415481439E-5},-1923.444,{"$f":"-Z73/Z104","v":-1.584154928784834E-5},6262.5719499999996,{"$f":"AB73/AB104","v":3.5205434638592267E-5},16929.2,{"$f":"AD73/AD104","v":6.9414850326244255E-5}]
[{"$error":"#REF!"},"OK",null,null,3293,null," Vzdělávací akce k integraci Romů",null,null,14328.255999999999,9.0966446613692856E-5,-4364.62,-4.1006806626975026E-5,1086.8230000000001,7.6232347300882038E-6,11050.458999999999,5.7066397678845494E-5,null,null,3293,null," Vzdělávací akce k integraci Romů",null,17358.6031,{"$f":"X74/X104","v":9.2620922684220157E-5},-4404.5091000000002,{"$f":"-Z74/Z104","v":-3.6275684655454767E-5},1203.5540000000001,{"$f":"AB74/AB104","v":6.7658530743133866E-6},14157.7,{"$f":"AD74/AD104","v":5.8050860434271455E-5}]
[{"$error":"#REF!"},null,null,null,3294,null," Zařízení pro další vzdělávání pedagogických pracovníků",null,null,181720.49931000001,1.1536971491224561E-3,-5100,-4.7915904201871557E-5,35245.263740000002,2.4721865346416706E-4,211865.76305000001,1.0941098364098136E-3,null,null,3294,null," Zařízení pro další vzdělávání pedagogických pracovníků",null,246165.58592000001,{"$f":"X75/X104","v":1.3134745676057352E-3},0,{"$f":"-Z75/Z104","v":0},57608.784910000002,{"$f":"AB75/AB104","v":3.238513390265681E-4},303774.40000000002,{"$f":"AD75/AD104","v":1.2455670976150471E-3}]
[{"$error":"#REF!"},"OK",null,null,3299,null," Ostatní záležitosti vzdělávání",null,null,105129122.58363001,0.66743801318514628,-103482701.60187,-0.97224847382471835,711178.15824000002,4.9883725640470734E-3,2357599.1400000099,1.2175031832663667E-2,null,null,3299,null," Ostatní záležitosti vzdělávání",null,119939349.29061,{"$f":"X76/X104","v":0.6399646983944961},-117950663.93441001,{"$f":"-Z76/Z104","v":-0.97144562371006993},1530298.1169799999,{"$f":"AB76/AB104","v":8.6026652891229797E-3},3518983.5,{"$f":"AD76/AD104","v":1.4428898763853172E-2}]
[{"$error":"#REF!"},"OK",null,null,null,null,"33 – kultura, církve a sdělovací prostředky",null,null,201678.92905999999,1.2804081343495844E-3,0,0,0,0,201678.92905999999,1.0415033410993725E-3,null,null,null,null,"33 – kultura, církve a sdělovací prostředky",null,212209.72,{"$f":"X77/X104","v":1.1322950329430601E-3},{"$f":"Z78+Z79","v":0},{"$f":"-Z77/Z104","v":0},{"$f":"AB78+AB79","v":5278085.53149},{"$f":"AB77/AB104","v":2.9671083490828514E-2},{"$f":"SUM(AD78:AD79)","v":5490295.2514900006},{"$f":"AD77/AD104","v":2.2511874343091695E-2}]
[{"$error":"#REF!"},"OK",null,null,3314,null,"činnosti knihovnické",null,null,159061.82399999999,1.0098429928368539E-3,0,0,0,0,159061.82399999999,8.2142156302344831E-4,null,null,3314,null,"činnosti knihovnické",null,170364.424,{"$f":"X78/X104","v":9.0901958254035434E-4},0,{"$f":"-Z78/Z104","v":0},2585367.8416399993,{"$f":"AB78/AB104","v":1.4533804847635381E-2},{"$f":"X78+AB78","v":2755732.2656399994},{"$f":"AD78/AD104","v":1.1299337402748064E-2}]
[{"$error":"#REF!"},"OK",null,null,3315,null,"činnosti muzeí a galerií",null,null,42617.105060000002,2.7056514151273053E-4,0,0,0,0,42617.105060000002,2.2008177807592417E-4,null,null,3315,null,"činnosti muzeí a galerií",null,41845.296000000002,{"$f":"X79/X104","v":2.232754504027059E-4},0,{"$f":"-Z79/Z104","v":0},2692717.6898500007,{"$f":"AB79/AB104","v":1.5137278643193131E-2},{"$f":"X79+AB79","v":2734562.9858500008},{"$f":"AD79/AD104","v":1.121253694034363E-2}]
[{"$error":"#REF!"},"OK",null,null,null,null,"34 – tělovýchova a zájmová činnost",null,null,4533931.0726199998,2.8784773169020041E-2,-64910.576000000001,-6.0985273358907905E-4,2095480.25107,1.469819632651386E-2,6564500.7476899996,3.3900167425693011E-2,null,null,null,null,"34 – tělovýchova a zájmová činnost",null,5950965.80975,{"$f":"X80/X104","v":3.1752782236336305E-2},{"$f":"Z81+Z84","v":-424819.96084999997},{"$f":"-Z80/Z104","v":-3.49883144415282E-3},{"$f":"AB81+AB84","v":6586998.4025500044},{"$f":"AB80/AB104","v":3.7029217959800985E-2},{"$f":"AD81+AD84","v":12113144.299999999},{"$f":"AD80/AD104","v":4.9667562469856735E-2}]
[null,null,null,null,null,null,null,null,null,null,null,null,null,null,null,null,null,null,null,341,null,"Tělovýchova",null,5519010.8108999999,{"$f":"X81/X104","v":2.9447984418155403E-2},{"$f":"Z82+Z83","v":-253971.03563999999},{"$f":"-Z81/Z104","v":-2.0917139666020673E-3},{"$f":"AB82+AB83","v":4682880.4353800025},{"$f":"AB81/AB104","v":2.6325101316897952E-2},{"$f":"AD82+AD83","v":9947920.1999999993},{"$f":"AD81/AD104","v":4.0789487497366779E-2}]
[{"$f":"IF(COUNTBLANK(C82:IU82)=254,\"odstr\",IF(AND($A$1=\"TISK\",SUM(J82:Q82)=0),\"odstr\",\"OK\"))","v":{"$error":"#REF!"}},"OK",null,null,3411,null,"státní sportovní reprezentace",null,null,1342501.1238299999,8.5231975761533262E-3,0,0,0,0,1342501.1238299999,6.932897811464645E-3,null,null,3411,null,"státní sportovní reprezentace",null,1467660.76073,{"$f":"X82/X104","v":7.8310502903449104E-3},-1246.174,{"$f":"-Z82/Z104","v":-1.0263530855192622E-5},2.133,{"$f":"AB82/AB104","v":1.1990791113244984E-8},1466416.7,{"$f":"AD82/AD104","v":6.012752861706697E-3}]
[{"$f":"IF(COUNTBLANK(C83:IU83)=254,\"odstr\",IF(AND($A$1=\"TISK\",SUM(J83:Q83)=0),\"odstr\",\"OK\"))","v":{"$error":"#REF!"}},"OK",null,null,3419,null,"ostatní tělovýchovná činnost",null,null,2910807.4336800002,1.8479974744909086E-2,-20000,-1.8790550667400612E-4,0,0,2890807.4336800002,1.4928607637324901E-2,null,null,3419,null,"ostatní tělovýchovná činnost",null,4051350.0501700002,{"$f":"X83/X104","v":2.1616934127810492E-2},-252724.86163999999,{"$f":"-Z83/Z104","v":-2.0814504357468747E-3},4682878.3023800021,{"$f":"AB83/AB104","v":2.6325089326106839E-2},8481503.5,{"$f":"AD83/AD104","v":3.4776734635660091E-2}]
[null,null,null,null,null,null,null,null,null,null,null,null,null,null,null,null,null,null,null,342,null,"Zájmová činnost a rekreace",null,431954.99884999997,{"$f":"X84/X104","v":2.3047978181809027E-3},{"$f":"Z85","v":-170848.92520999999},{"$f":"-Z84/Z104","v":-1.4071174775507525E-3},1904117.9671700019,{"$f":"AB84/AB104","v":1.0704116642903029E-2},2165224.1,{"$f":"AD84/AD104","v":8.8780749724899528E-3}]
[{"$f":"IF(COUNTBLANK(C85:IU85)=254,\"odstr\",IF(AND($A$1=\"TISK\",SUM(J85:Q85)=0),\"odstr\",\"OK\"))","v":{"$error":"#REF!"}},"OK",null,null,3421,null,"využití volného času dětí a mládeže",{"$error":"#N/A"},null,280622.51511000004,1.7816008479576326E-3,-44910.576000000001,-4.2194722691507293E-4,2095480.25107,1.469819632651386E-2,2331192.1901799999,1.2038661976903467E-2,null,null,3421,null,"využití volného času dětí a mládeže",null,431954.99884999997,{"$f":"X85/X104","v":2.3047978181809027E-3},-170848.92520999999,{"$f":"-Z85/Z104","v":-1.4071174775507525E-3},1904117.9671700019,{"$f":"AB85/AB104","v":1.0704116642903029E-2},2165224.1,{"$f":"AD85/AD104","v":8.8780749724899528E-3}]
[{"$f":"IF(COUNTBLANK(C86:IU86)=254,\"odstr\",IF(AND($A$1=\"TISK\",SUM(J86:Q86)=0),\"odstr\",\"OK\"))","v":{"$error":"#REF!"}},"OK",null,null,null,null,"35 – zdravotnictví",null,null,12058.397999999999,7.6555696514192704E-5,-1194.259,-1.1220392124749593E-5,0,0,10864.138999999999,5.6104210387301998E-5,null,null,null,null,"35 – zdravotnictví",null,11982.615,{"$f":"X86/X104","v":6.3936069686954048E-5},{"$f":"Z87","v":-1110.905},{"$f":"-Z86/Z104","v":-9.1494508348655639E-6},{"$f":"AB87","v":121056.34682000004},{"$f":"AB86/AB104","v":6.8052572323073557E-4},{"$f":"AD87","v":131928},{"$f":"AD86/AD104","v":5.4094478025191691E-4}]
[null,null,null,null,null,null,null,null,null,null,null,null,null,null,null,null,null,null,null,354,null,"Zdravotnické programy",null,11982.615,{"$f":"X87/X104","v":6.3936069686954048E-5},{"$f":"Z88","v":-1110.905},{"$f":"-Z87/Z104","v":-9.1494508348655639E-6},{"$f":"AB88","v":121056.34682000004},{"$f":"AB87/AB104","v":6.8052572323073557E-4},{"$f":"AD88","v":131928},{"$f":"AD87/AD104","v":5.4094478025191691E-4}]
[{"$f":"IF(COUNTBLANK(C88:IU88)=254,\"odstr\",IF(AND($A$1=\"TISK\",SUM(J88:Q88)=0),\"odstr\",\"OK\"))","v":{"$error":"#REF!"}},"OK",null,null,3541,null,"prevence před drogami, alkoholem, nikotinem a jinými návykovými látkami",null,null,12058.397999999999,7.6555696514192704E-5,-1194.259,-1.1220392124749593E-5,null,0,10864.138999999999,5.6104210387301998E-5,null,null,3541,null,"prevence před drogami, alkoholem, nikotinem a jinými návykovými látkami",null,11982.615,{"$f":"X88/X104","v":6.3936069686954048E-5},-1110.905,{"$f":"-Z88/Z104","v":-9.1494508348655639E-6},121056.34682000004,{"$f":"AB88/AB104","v":6.8052572323073557E-4},131928,{"$f":"AD88/AD104","v":5.4094478025191691E-4}]
[{"$error":"#REF!"},"OK",null,null,null,null,"38 – výzkum a vývoj odvětvově nespecifikovaný",null,null,6838344.8546199985,4.3414909123888588E-2,-104412.65728,-9.8098566346888766E-4,225225.77622999999,1.5797871037580269E-3,6959157.9735699985,3.5938242604189936E-2,null,null,null,null,"38 – výzkum a vývoj odvětvově nespecifikovaný",null,6134419.9000800001,{"$f":"X89/X104","v":3.2731644822148805E-2},-107488.42687,{"$f":"-Z89/Z104","v":-8.8527828839019321E-4},147121.67543999999,{"$f":"AB89/AB104","v":8.2705357638615312E-4},6174053.2000000002,{"$f":"AD89/AD104","v":2.5315489142089961E-2}]
[{"$error":"#REF!"},"OK",null,null,3809,null,"ostatní  výzkum a vývoj odvětvově nespecifikovaný",{"$error":"#N/A"},null,6838344.8546199985,4.3414909123888588E-2,-104412.65728,-9.8098566346888766E-4,225225.77622999999,1.5797871037580269E-3,6959157.9735699985,3.5938242604189936E-2,null,null,3809,null,"ostatní  výzkum a vývoj odvětvově nespecifikovaný",null,6134419.9000800001,{"$f":"X90/X104","v":3.2731644822148805E-2},-107488.42687,{"$f":"-Z90/Z104","v":-8.8527828839019321E-4},147121.67543999999,{"$f":"AB90/AB104","v":8.2705357638615312E-4},6174053.2000000002,{"$f":"AD90/AD104","v":2.5315489142089961E-2}]
[{"$error":"#REF!"},"OK",null,null,"SKUPINA 4 – sociální věci a politika zaměstnanosti",null,null,null,null,0,0,0,0,0,0,0,0,null,null,"SKUPINA 4 – sociální věci a politika zaměstnanosti",null,null,null,"x","x","x","x","x","x","x","x"]
[{"$error":"#REF!"},"OK",null,null,null,null,"43 – sociální služby a společné činnosti v sociálním zabezpečení a politice zaměstnanosti",null,null,0,0,0,0,0,0,0,0,null,null,null,null,"43 – sociální služby a společné činnosti v sociálním zabezpečení a politice zaměstnanosti",null,"x","x","x","x","x","x","x","x"]
[{"$error":"#REF!"},"OK",null,null,4322,null,"ústavy péče pro mládež",null,null,0,0,0,0,null,0,0,0,null,null,4322,null,"zrušen",null,"x","x","x","x","x","x","x","x"]
[{"$error":"#REF!"},"OK",null,null,"SKUPINA 5 – bezpečnost státu a právní ochrana",null,null,null,null,17728.292009999997,1.1255240893794907E-4,-11505.499,-1.0809733095661353E-4,". ",null,6222.7930099999976,3.2135532160410698E-5,null,null,"SKUPINA 5 – bezpečnost státu a právní ochrana",null,null,null,8389.5439999999999,{"$f":"X94/X104","v":4.4764391564426235E-5},{"$f":"Z97","v":-555.99},{"$f":"-Z94/Z104","v":-4.5791522854581666E-6},{"$f":"AB95+AB97","v":38379.578420000005},{"$f":"AB94/AB104","v":2.1575316823657995E-4},{"$f":"AD95+AD97","v":46213.164300000004},{"$f":"AD94/AD104","v":1.8948797834431836E-4}]
[{"$error":"#REF!"},"OK",null,null,null,null,"52 – civilní připravenost na krizové stavy",null,null,52.42501,3.3283303099744411E-7,0,0,". ",null,52.42501,2.7073142110906455E-7,null,null,null,null,"52 – civilní připravenost na krizové stavy",null,272.25,{"$f":"X95/X104","v":1.4526541136699495E-6},0,{"$f":"-Z95/Z104","v":0},{"$f":"AB96","v":3334.6142999999997},{"$f":"AB95/AB104","v":1.874574004432238E-5},{"$f":"AD96","v":3606.8642999999997},{"$f":"AD95/AD104","v":1.4789236675777575E-5}]
[{"$error":"#REF!"},"OK",null,null,5299,null,"ostatní záležitosti civilní připravenosti na krizové stavy",null,null,52.42501,3.3283303099744411E-7,0,0,". ",null,52.42501,2.7073142110906455E-7,null,null,5299,null,"ostatní záležitosti civilní připravenosti na krizové stavy",null,272.25,{"$f":"X96/X104","v":1.4526541136699495E-6},0,{"$f":"-Z96/Z104","v":0},3334.6142999999997,{"$f":"AB96/AB104","v":1.874574004432238E-5},{"$f":"X96+AB96","v":3606.8642999999997},{"$f":"AD96/AD104","v":1.4789236675777575E-5}]
[{"$error":"#REF!"},"OK",null,null,null,null,"53 – bezpečnost a veřejný pořádek",null,null,17675.866999999998,1.1221957590695163E-4,-11505.499,-1.0809733095661353E-4,". ",null,6170.3679999999986,3.1864800739301639E-5,null,null,null,null,"53 – bezpečnost a veřejný pořádek",null,8117.2939999999999,{"$f":"X97/X104","v":4.3311737450756283E-5},{"$f":"Z98","v":-555.99},{"$f":"-Z97/Z104","v":-4.5791522854581666E-6},{"$f":"AB98","v":35044.964120000004},{"$f":"AB97/AB104","v":1.9700742819225755E-4},{"$f":"AD98","v":42606.3},{"$f":"AD97/AD104","v":1.7469874166854078E-4}]
[{"$error":"#REF!"},"OK",null,null,5399,null,"ostatní záležitosti bezpečnosti, veřejného pořádku",null,null,17675.866999999998,1.1221957590695163E-4,-11505.499,-1.0809733095661353E-4,". ",null,6170.3679999999986,3.1864800739301639E-5,null,null,5399,null,"ostatní záležitosti bezpečnosti, veřejného pořádku",null,8117.2939999999999,{"$f":"X97/X104","v":4.3311737450756283E-5},-555.99,{"$f":"-Z98/Z104","v":-4.5791522854581666E-6},35044.964120000004,{"$f":"AB98/AB104","v":1.9700742819225755E-4},42606.3,{"$f":"AD98/AD104","v":1.7469874166854078E-4}]
[{"$error":"#REF!"},"OK",null,null,"SKUPINA 6 – všeobecná veřejná správa a služby",null,null,null,null,123498.61540000001,7.8406124266966535E-4,0,0,". ",null,123498.61540000001,6.3776727276244308E-4,null,null,"SKUPINA 6 – všeobecná veřejná správa a služby",null,null,null,127681.60941,{"$f":"X99/X104","v":6.8127535408424691E-4},{"$f":"Z100","v":-709.1},{"$f":"-Z99/Z104","v":-5.8401713800938618E-6},{"$f":"AB100","v":741.15899999999999},{"$f":"AB99/AB104","v":4.1664710504929855E-6},{"$f":"AD100","v":127713.68165000001},{"$f":"AD99/AD104","v":5.2366479788462292E-4}]
[{"$error":"#REF!"},"OK",null,null,null,null,"62 – jiné veřejné služby a činnosti",null,null,123498.61540000001,7.8406124266966535E-4,0,0,". ",null,123498.61540000001,6.3776727276244308E-4,null,null,null,null,"62 – jiné veřejné služby a činnosti",null,127681.60941,{"$f":"X100/X104","v":6.8127535408424691E-4},{"$f":"Z101+Z102+Z103","v":-709.1},{"$f":"-Z100/Z104","v":-5.8401713800938618E-6},{"$f":"SUM(AB101:AB103)","v":741.15899999999999},{"$f":"AB100/AB104","v":4.1664710504929855E-6},{"$f":"AD101+AD102+AD103","v":127713.68165000001},{"$f":"AD100/AD104","v":5.2366479788462292E-4}]
[{"$error":"#REF!"},"OK",null,null,6221,null,"humanitární zahraniční pomoc",null,null,7431.1220000000003,4.7178300184812345E-5,0,0,". ",null,7431.1220000000003,3.837554288487182E-5,null,null,6221,null,"humanitární zahraniční pomoc přímá",null,19779.607759999999,{"$f":"X101/X104","v":1.0553876429510396E-4},-709.1,{"$f":"-Z101/Z104","v":-5.8401713800938618E-6},144.37900000000002,{"$f":"AB101/AB104","v":8.1163545716793145E-7},19214.900000000001,{"$f":"AD101/AD104","v":7.8786912998473103E-5}]
[{"$error":"#REF!"},"OK",null,null,6222,null,"rozvojová zahraniční pomoc",null,null,115277.51640000001,7.3186757979196518E-4,0,0,". ",null,115277.51640000001,5.9531215801190106E-4,null,null,6222,null,"rozvojová zahraniční pomoc",null,107902.00165000001,{"$f":"X102/X104","v":5.7573658978914296E-4},0,{"$f":"-Z102/Z104","v":0},86.78,{"$f":"AB102/AB104","v":4.8783912461668991E-7},{"$f":"X102+AB102","v":107988.78165},{"$f":"AD102/AD104","v":4.4278673033269273E-4}]
[{"$error":"#REF!"},"OK",null,null,6229,null,"ostatní zahraniční pomoc",null,null,789.97699999999998,5.0153626928877626E-6,0,0,". ",null,789.97699999999998,4.079571865670135E-6,null,null,6229,null,"ostatní zahraniční pomoc",null,0,{"$f":"X103/X104","v":0},0,{"$f":"-Z103/Z104","v":0},510,{"$f":"AB103/AB104","v":2.8669964687083645E-6},{"$f":"X103+AB103","v":510},{"$f":"AD103/AD104","v":2.0911545534570189E-6}]
["konst","stop",null,null,"Celkem výdaje",null,null,null,null,157511440.02412003,1,-106436476.25877,-1,142567169.77511004,1,193642133.54046005,1,null,null,"Celkem výdaje",null,null,null,{"$f":"X15+X77+X80+X86+X89+X94+X99","v":187415570.87680998},{"$f":"X104/X104","v":1},-121417669.76513,{"$f":"-Z104/Z104","v":-1},{"$f":"AB15+AB77+AB80+AB86+AB89+AB94+AB99","v":177886511.39489004},{"$f":"AB104/AB104","v":1},{"$f":"AD99+AD94+AD89+AD86+AD80+AD77+AD15","v":243884412.63553998},{"$f":"AD104/AD104","v":1}]
[{"$f":"IF(COUNTBLANK(D105:E105)=2,\"odstr\",\"OK\")","v":"OK"},null,null,"Komentáře:",null,null,null,null,null,null,null,null,null,null,null,null,"Zdroj: Závěrečný účet – kapitola 333-MŠMT, 700-Obce a DSO; KÚ, (část: vzdělávání)",null,"Komentáře:",null,null,null,null,"Zdroj: Závěrečný účet – kapitola 333-MŠMT, 700-Obce a DSO; KÚ, (část: vzdělávání); monitor.statnipokladna.cz"]
[{"$f":"IF(COUNTBLANK(D106:E106)=2,\"odstr\",\"OK\")","v":"OK"},null,null,"1)","Tabulka neobsahuje z daných tříd následující položky: 5321, 5323, 5329, 5344, 5345, 5349, 5366, 5367, 5641, 5642, 5649, 6341, 6342, 6349, 6441, 6442, 6449.",null,null,null,null,null,null,null,null,null,null,null,null,null,"1)","Tabulka neobsahuje z daných tříd následující položky: 5321, 5323, 5329, 5344, 5345, 5349, 5366, 5367, 5641, 5642, 5649, 6341, 6342, 6349, 6441, 6442, 6449."]
["stop",null,null,"2)","V tabulce jsou za kapitolu 700-Obce a DSO;KÚ jsou započteny také paragrafy 3421, 3809 a 4322, které tabulkách B7 a B9 neuvádíme.",null,null,null,null,null,null,null,null,null,null,null,null,null,"2)","V tabulce jsou za kapitolu 700-Obce a DSO;KÚ jsou započteny také paragrafy 3421, 3809 a 4322, které tabulkách B7 a B9 neuvádíme."]

{"sheet":"B11","index":11,"n_rows":38,"n_cols":20,"rows_kept":38,"cut":false,"hidden":false,"merged":[[8,3,12,4],[8,6,12,7],[8,9,12,9],[8,12,12,13],[8,15,12,16],[8,19,12,19],[8,17,12,17],[8,18,12,18],[8,10,12,10],[34,13,34,19],[33,18,33,19]]}
[{"$f":"IF(#REF!=\"\",\"ŠABLONA\",IF(#REF!=\"T\",\"TISK\",\"ELEKTRO\"))","v":{"$error":"#REF!"}},0,{"$f":"CONCATENATE(D1,F1,IF(G1<>\"\",\".\",\"\"),G1,IF(H1<>\"\",\".\",\"\"),H1,IF(I1<>\"\",\".\",\"\"),I1,\"\")","v":{"$error":"#REF!"}},{"$f":"IF(#REF!=\"\",\" ?\",#REF!)","v":{"$error":"#REF!"}},{"$f":"CONCATENATE(C1,K1)","v":{"$error":"#REF!"}},11]
["konst"]
["konst","24x2",null,"Tab. B11:",null,null,null,"Poskytnuté dotace církevním školám – podle paragrafů",null,null,null,null,"Tab. B11:",null,null,null,"Poskytnuté dotace církevním školám – podle paragrafů"]
["konst",{"$f":"COUNTA(Datova_oblast)","v":40},null,{"$f":"IF(D1=\" ?\",\"\",CONCATENATE(\"Tab. \",E1,\":\"))","v":{"$error":"#REF!"}},null,null,null,{"$f":"IF(H3=\"Zadejte název tabulky\",\"\",H3)","v":"Poskytnuté dotace církevním školám – podle paragrafů"},null,null,null,null,{"$f":"IF(M1=\" ?\",\"\",CONCATENATE(\"Tab. \",N1,\":\"))","v":"Tab. :"},null,null,null,{"$f":"IF(Q3=\"Zadejte název tabulky\",\"\",Q3)","v":"Poskytnuté dotace církevním školám – podle paragrafů"}]
[{"$f":"IF(D5=\"\",\"odstr\",\"OK\")","v":"odstr"},0]
[{"$f":"IF(COUNTBLANK(C6:IU6)=254,\"odstr\",\"OK\")","v":"OK"},"Řádky pro"]
[{"$f":"IF(COUNTBLANK(C7:IU7)=254,\"odstr\",\"OK\")","v":"OK"},"ročenku PaM"]
["konst",null,null,"(podle stavu k: 31. 12. 2017)",null,null,null,null,null,null,"v tis. Kč",null,"(podle stavu k: 31. 12. 2018)",null,null,null,null,null,null,"v tis. Kč"]
["konst",null,null,"Paragraf",null,null,"Název",null,null,"Uvolněno","Čerpáno",null,"Paragraf",null,null,"Název",null,"Uvolněno 1)","Čerpáno 2)","Skutečnost 4)"]
["konst"]
["konst"]
["konst"]
["konst"]
[{"$f":"IF(COUNTBLANK(C14:IU14)=254,\"odstr\",IF(AND($A$1=\"TISK\",SUM(J14:K14)=0),\"odstr\",\"OK\"))","v":{"$error":"#REF!"}},"OK",null,null,3111,null," Mateřské školy",null,null,84531.373000000007,84496.402000000002,null,null,3111,null," Mateřské školy",null,97413.323000000004,97130.933000000005,97130.933000000005]
[{"$error":"#REF!"},"OK",null,null,3112,null," Mateřské školy pro děti se speciálními vzdělávacími  potřebami",null,{"$error":"#N/A"},10474.316999999999,10474.316999999999,null,null,3112,null," Mateřské školy pro děti se speciálními vzdělávacími  potřebami",null,15164.638999999999,15040.062,15040.062]
[{"$error":"#REF!"},"OK",null,null,3113,null," Základní školy",null,{"$error":"#N/A"},333558.84899999999,333142.42700000003,null,null,3113,null," Základní školy",null,387612.01199999999,385867.39760000003,385795.62771999999]
[{"$error":"#REF!"},"OK",null,null,3114,null," Základní školy pro žáky se speciálními vzdělávacími potřebami",null,{"$error":"#N/A"},99125.804999999993,98844.206000000006,null,null,3114,null," Základní školy pro žáky se speciálními vzdělávacími potřebami",null,127220.295,122798.77899999999,122798.77899999999]
[{"$error":"#REF!"},"OK",null,null,3121,null," Gymnázia",null,{"$error":"#N/A"},360065.11300000001,359657.84299999999,null,null,3121,null," Gymnázia",null,391975.47100000002,391202.79499999998,391182.79499999998]
[{"$error":"#REF!"},"OK",null,null,3122,null," Střední odborné školy",null,{"$error":"#N/A"},124135.734,124134.65300000001,null,null,3122,null," Střední odborné školy",null,138330.644,137923.87899999999,137923.87899999999]
[{"$error":"#REF!"},"OK",null,null,3123,null," Střední školy poskytující střední vzdělání s výučním listem",null,{"$error":"#N/A"},14653.138999999999,14653.138999999999,null,null,3123,null," Střední školy poskytující střední vzdělání s výučním listem",null,16146.198,16146.198,16146.198]
[{"$error":"#REF!"},"OK",null,null,3124,null," Střední školy a konzervatoře pro žáky se speciálními  vzdělávacími potřebami",null,{"$error":"#N/A"},36211.017999999996,36069.750999999997,null,null,3124,null," Střední školy a konzervatoře pro žáky se speciálními  vzdělávacími potřebami",null,47466.142999999996,46267.089,46267.089]
[{"$error":"#REF!"},"OK",null,null,3126,null," Konzervatoře",null,{"$error":"#N/A"},36487.271000000001,36487.271000000001,null,null,3126,null," Konzervatoře",null,41436.175000000003,41436.175000000003,41436.175000000003]
[{"$error":"#REF!"},"OK",null,null,3133,null," Dětské domovy",null,{"$error":"#N/A"},14410,14410,null,null,3133,null," Dětské domovy",null,16085.375,16085.375,15953.45853]
[{"$error":"#REF!"},"OK",null,null,3141,null," Školní stravování při předškolním a základním vzdělávání",null,{"$error":"#N/A"},64859.248,64859.248,null,null,3141,null," Školní stravování při předškolním a základním vzdělávání",null,73554.096999999994,73199.343999999997,73199.343999999997]
[{"$error":"#REF!"},"OK",null,null,3143,null," Školní družiny a kluby",null,{"$error":"#N/A"},91142.206999999995,91142.206999999995,null,null,3143,null," Školní družiny a kluby",null,107502.466,107478.978,107478.978]
[{"$error":"#REF!"},"OK",null,null,3145,null," Internáty",null,{"$error":"#N/A"},4889.7439999999997,4889.7439999999997,null,null,3145,null," Internáty",null,6448.7920000000004,6448.7920000000004,6448.7920000000004]
[{"$error":"#REF!"},"OK",null,null,3146,null," Zařízení výchovného poradenství a preventivně výchovné péče",null,{"$error":"#N/A"},9953,9953,null,null,3146,null," Zařízení výchovného poradenství a preventivně výchovné péče",null,12622.974,12622.974,12622.974]
[{"$error":"#REF!"},"OK",null,null,3147,null," Domovy mládeže",null,null,48663.65,48663.65,null,null,3147,null," Domovy mládeže",null,52856.078000000001,52832.237000000001,52832.237000000001]
[{"$error":"#REF!"},"OK",null,null,3150,null," Vyšší odborné školy",null,{"$error":"#N/A"},62055.887000000002,62055.887000000002,null,null,3150,null," Vyšší odborné školy",null,62552.843999999997,62546.879249999998,62546.879249999998]
[{"$error":"#REF!"},"OK",null,null,3231,null," Základní umělecké školy",null,{"$error":"#N/A"},15346.963,15346.963,null,null,3231,null," Základní umělecké školy",null,19749.494999999999,19749.494999999999,19749.494999999999]
[{"$error":"#REF!"},"OK",null,null,3392,null," Střediska volného času",null,{"$error":"#N/A"},100304.394,100304.394,null,null,3233,null," Střediska volného času",null,110721.63800000001,110718.079,110718.079]
[{"$error":"#REF!"},"OK",null,null,3299,null," Ostatní záležitosti vzdělávání",null,null,39950.334000000003,36397.362959999999,null,null,3299,null," Ostatní záležitosti vzdělávání 3)",null,"7 548 ,3",7535.5,12249.12]
[{"$error":"#REF!"},"OK",null,null,"Dotace celkem",null,null,null,null,1550818.0459999999,1545982.4649599998,null,null,"Dotace celkem",null,null,null,1724858.6590000002,1723030.9608499999,{"$f":"SUM(T14:T32)","v":1727520.8944999999}]
["konst","stop",null,"Komentáře:",null,null,null,null,null,null,"Zdroj: Centrální registr dotací MF",null,"Komentáře:",null,null,null,null,null,"Zdroj: Centrální registr dotací MF"]
["stop",null,null,null,null,null,null,null,null,null,null,null,"1)","Údaje odpovídající hodnotám, na co bylo příjemcům dotačních prostředků vystavena rozhodnutí o poskytnutí dotace a co příjemcům dotačních prostředků skutečně v součtu za všechna rozhodnutí o poskytnutí dotace v příslušném roce odešlo."]
[null,null,null,null,null,null,null,null,null,null,null,null,"2) ","Údaje představující rozdíl mezi poskytnutými dotačními prostředky a vratkami před koncem roku a nezahrnující vratky z finančního vypořádání."]
[null,null,null,null,null,null,null,null,null,null,null,null,"3)","Zahrnuty rozvojové programy."]
[null,null,null,null,null,null,null,null,null,null,null,null,"4)","Údaje představují spotřebované dotace církevními školami dle paragrafů (oddíl 31 - 32 rozpočtové skladby)."]

{"sheet":"B12","index":12,"n_rows":48,"n_cols":23,"rows_kept":48,"cut":false,"hidden":false,"merged":[[38,15,38,22],[39,15,39,22],[23,15,23,19],[24,16,24,19],[25,15,25,19],[26,15,30,15],[33,15,34,15],[33,16,33,19],[34,16,34,19],[7,14,11,19],[7,20,9,22],[10,22,11,22],[18,15,22,15],[20,16,20,18],[21,16,21,19],[22,16,22,19],[13,15,14,15],[7,9,9,11],[7,3,11,8],[29,4,29,11],[10,11,11,11],[28,4,28,11],[15,4,17,4],[17,5,17,7]]}
[{"$error":"#REF!"},0,{"$error":"#REF!"},{"$error":"#REF!"},{"$error":"#REF!"},12]
["konst"]
["konst","15x3",null,"Tab. B12:",null,null,null,"Porovnání dotací církevním školám v letech",null,null,null,null,null,null,"Tab. B12:",null,null,null,"Porovnání čerpaných dotací církevním školám v letech 2017 a 2018 - vybrané oblasti"]
["konst",45,null,{"$error":"#REF!"},null,null,null,"Porovnání dotací církevním školám v letech"]
[{"$error":"#REF!"},0,null,{"$error":"#REF!"},"2016 a 2017 – vybrané oblasti",null,null,null,null,null,null,null,null,null,"(podle stavu k: 31. 12. 2018)",null,null,null,null,null,null,null,"v tis. Kč"]
["odstr","Řádky pro"]
["odstr","ročenku PaM"]
["konst",null,null,null,null,null,null,null,null,"Dotace církevním školám",null,null,null,null,null,null,null,null,null,null,"Dotace církevním školám"]
["konst"]
["konst"]
["konst","Označte",null,null,null,null,null,null,null,"skutečnost1)",null,"Index 2017/2016",null,null,null,null,null,null,null,null,"čerpáno1)",null,"Index 2018/2017"]
["konst","nebo odstr",null,null,null,null,null,null,null,2016,2017,null,null,null,null,null,null,null,null,null,2017,2018]
[{"$error":"#REF!"},"OK",null,null,"Předškolní vzdělávání",null,null,null,null,82856,94775.91399999999,1.1438630153519358,null,null,null,"Předškolní vzdělávání",null,null,null,null,{"$f":"SUM(U14:U15)","v":94970.718999999997},{"$f":"SUM(V14:V15)","v":112170.99500000001},{"$f":"V13/U13","v":1.1811113591758742}]
[null,null,null,null,"Základní vzdělávání včetně školních družin a klubů",null,null,null,null,449704,523110.41499999998,1.1632327375340223,null,null,null,"z toho"," Mateřské školy",null,null,null,84496.402000000002,97130.933000000005,{"$f":"V14/U14","v":1.1495274437839378}]
[null,null,null,null,"Střední vzdělávání",null,null,null,null,490323,534515.38599999994,1.0901291312053483,null,null,null,null," Mateřské školy pro děti se speciálními vzdělávacími  potřebami",null,null,null,10474.316999999999,15040.062,1.4358990662589266]
[null,null,null,null,"z toho","gymnázia2)",null,null,null,334503,359657.84299999999,1.0752006499194326,null,null,null,"Základní školy",null,null,null,null,333142.42700000003,385867.39760000003,1.158265553489529]
[null,null,null,null,null,"střední odborné školy2)",null,null,null,113681,124134.65300000001,1.0919560260729586,null,null,null,"Základní školy pro žáky se speciálními vzdělávacími potřebami",null,null,null,null,98844.206000000006,122798.77899999999,1.2423467593032209]
[{"$error":"#REF!"},"OK",null,null,null," střední školy poskytující střední vzdělání s výučním listem 2)",null,null,null,13504,14653.138999999999,1.0850961937203791,null,null,null,"Střední vzdělávání a vzdělávání v konzervatořích",null,null,null,null,{"$f":"SUM(U19:U23)","v":571002.65700000001},{"$f":"SUM(V19:V23)","v":632976.13600000006},1.1085344844551224]
[{"$error":"#REF!"},"OK",null,null,"Konzervatoře",null,null,null,null,38817,36487.271000000001,0.93998173480691449,null,null,null,"z toho","Gymnázia",null,null,null,359657.84299999999,391202.79499999998,1.0877082277335461]
[{"$error":"#REF!"},"OK",null,null,"Vyšší odborné školy",null,null,null,null,66136,62055.887000000002,0.93830723055521958,null,null,null,null,"Střední odborné školy",null,null,null,124134.65300000001,137923.87899999999,1.1110828094069751]
[{"$error":"#REF!"},"OK",null,null,"Školní stravování",null,null,null,null,63747,64859.248,1.0174478485262051,null,null,null,null,"Střední školy poskytující střední vzdělání s výučním listem ",null,null,null,14653.138999999999,16146.198,1.1018934577772039]
[{"$error":"#REF!"},"OK",null,null,"Ubytovací zařízení",null,null,null,null,51498,53553.394,1.0399121130917706,null,null,null,null,"Střední školy a konzervatoře pro žáky se speciálními  vzdělávacími potřebami",null,null,null,36069.750999999997,46267.089,1.2827116272579759]
[null,null,null,null,"Ústavní a ochranná výchova",null,null,null,null,12344,14410,1.1673687621516526,null,null,null,null," Konzervatoře",null,null,null,36487.271000000001,41436.175000000003,1.1356337118224051]
[null,null,null,null,"Zařízení pro zájmové studium (ZUŠ)",null,null,null,null,12888,15346.963,1.1907947703289883,null,null,null,"Školská zařízení pro výkon ústavní a ochranné výchovy",null,null,null,null,{"$f":"SUM(U25)","v":14410},{"$f":"SUM(V25)","v":16085.375},1.1162647467036779]
[null,null,null,null,"Domy a stanice dětí a mládeže",null,null,null,null,90826,100304.394,1.1043577169532952,null,null,null,"z toho","Dětské domovy",null,null,null,14410,16085.375,1.1162647467036779]
[null,null,null,null,"Zařízení výchovného poradenství",null,null,null,null,8004,9953,1.2435032483758122,null,null,null,"Ostatní zařízení související s výchovou a vzděláváním mládeže",null,null,null,null,{"$f":"SUM(U27:U31)","v":219507.84899999999},{"$f":"SUM(V27:V31)","v":252582.32499999995},1.1506755961150161]
[null,null,null,null,"Provozní dotace celkem",null,null,null,null,1367143,{"$f":"SUM(K13:K26)","v":2007817.5069999998},1.4686228924114009,null,null,null,"z toho"," Školní stravování",null,null,null,64859.248,73199.343999999997,1.1285876148301934]
[null,null,null,"Komentáře:",null,null,null,null,null,null,null,"Zdroj: Centrální registr dotací MF",null,null,null,null," Školní družiny a kluby",null,null,null,91142.206999999995,107478.978,1.1792448475600334]
[null,null,null,"1)","Tabulka uvádí pouze spotřebované finanční prostředky, to znamená dotace zmenšené o vratky.",null,null,null,null,null,null,null,null,null,null,null," Internáty",null,null,null,4889.7439999999997,6448.7920000000004,1.3188404137312713]
[null,null,null,"2)","Bez škol pro děti, žáky, studenty se speciálními vzdělávacími potřebami.",null,null,null,null,null,null,null,null,null,null,null," Zařízení výchovného poradenství. Školská poradenská zařízení.",null,null,null,9953,12622.974,1.2682582136039384]
[null,null,null,null,null,null,null,null,null,null,null,null,null,null,null,null," Domovy mládeže",null,null,null,48663.65,52832.237000000001,1.0856612070816718]
[null,null,null,null,null,null,null,null,null,null,null,null,null,null,null,"Vyšší odborné školy",null,null,null,null,62055.887000000002,62546.879249999998,1.0079120978481864]
[null,null,null,null,null,null,null,null,null,null,null,null,null,null,null,"Základní umělecké, jazykové a zájmové vzdělávání",null,null,null,null,{"$f":"SUM(U34:U35)","v":115651.357},{"$f":"SUM(V34:V35)","v":130467.57399999999},1.1281110519092308]
[null,null,null,null,null,null,null,null,null,null,null,null,null,null,null,"z toho"," Základní umělecké školy",null,null,null,15346.963,19749.494999999999,1.2868666588953137]
[null,null,null,null,null,null,null,null,null,null,null,null,null,null,null,null," Střediska volného času",null,null,null,100304.394,110718.079,1.1038208256360136]
[null,null,null,null,null,null,null,null,null,null,null,null,null,null,null,"Ostatní záležitosti vzdělávání",null,null,null,null,36397.362959999999,7535.5,0.20703422960288001]
[{"$error":"#REF!"},"OK",null,null,null,null,null,null,null,null,null,null,null,null,null,"Čerpané dotace celkem",null,null,null,null,{"$f":"U13+U16+U17+U18+U24+U26+U32+U33+U36","v":1545982.4649600002},{"$f":"V13+V16+V17+V18+V24+V26+V32+V33+V36","v":1723030.9608499999},{"$f":"V37/U37","v":1.1145216714308468}]
[{"$error":"#REF!"},"OK",null,null,null,null,null,null,null,null,null,null,null,null,"Komentáře:",null,null,null,null,null,null,null,"Zdroj: Centrální registr dotací MF"]
[{"$error":"#REF!"},"OK",null,null,null,null,null,null,null,null,null,null,null,null,"1)","Údaje představující rozdíl mezi poskytnutými dotačními prostředky a vratkami před koncem roku a nezahrnující vratky z finančního vypořádání."]
[{"$error":"#REF!"},"OK"]
[{"$error":"#REF!"},"OK"]
[{"$error":"#REF!"},"OK"]
[{"$error":"#REF!"},"OK"]
[{"$error":"#REF!"},"OK"]
["konst","stop"]
["OK"]
["OK"]
["stop"]

{"sheet":"Paragrafy","index":13,"n_rows":74,"n_cols":2,"rows_kept":74,"cut":false,"hidden":true,"merged":[]}
["SKUPINA 3 – služby pro obyvatelstvo"]
[null,"31–32 – vzdělávání"]
[3111,"předškolní zařízení "]
[3112,"speciální předškolní zařízení"]
[3113,"základní školy"]
[3114,"speciální základní školy"]
[3115,"internátní speciální mateřské školy"]
[3116,"internátní speciální základní školy"]
[3117,"první stupeň základních škol"]
[3118,"druhý stupeň základních škol"]
[3119,"ostatní záležitosti předškolní výchovy a základního vzdělávání"]
[3121,"gymnázia"]
[3122,"střední odborné školy"]
[3123,"střední odborná učiliště a učiliště"]
[3124,"speciální střední školy"]
[3125,"střediska praktického vyučování a školní hospodářství"]
[3126,"konzervatoře"]
[3127,"internátní speciální střední odborná učiliště a odborná učiliště"]
[3128,"sportovní školy – gymnázia"]
[3129,"ostatní zařízení středního vzdělávání "]
[3131,"výchovné ústavy a dětské domovy se školou"]
[3132,"diagnostické ústavy"]
[3139,"ostatní školská zařízení pro výkon ústavní a ochranné výchovy"]
[3141,"školní stravování při předškolním a základním vzdělávání"]
[3142,"ostatní školní stravování"]
[3143,"školní družiny a kluby"]
[3144,"školy v přírodě"]
[3145,"internáty"]
[3146,"zařízení výchovného poradenství a preventivně výchovné péče"]
[3147,"domovy mládeže"]
[3149,"ostatní zařízení související s výchovou a vzděláváním mládeže"]
[3150,"vyšší odborné školy"]
[3211,"činnost vysokých škol"]
[3212,"výzkum a vývoj na vysokých školách"]
[3213,"bakalářské studium"]
[3214,"magisterské a doktorské studium"]
[3221,"vysokoškolské koleje a menzy"]
[3229,"ostatní zařízení související s vysokoškolským vzděláváním"]
[3231,"základní umělecké školy"]
[3239,"záležitosti zájmového studia jinde nezařazené"]
[3261,"činnost ústředního orgánu státní správy ve vzdělávání (MŠMT)"]
[3262,"činnost ostatních orgánů státní správy ve vzdělávání"]
[3269,"ostatní správa ve vzdělávání jinde nezařazená"]
[3280,"výzkum školství a vzdělávání"]
[3291,"mezinárodní spolupráce ve vzdělávání "]
[3292,"vzdělávání národnostních menšin a multikulturní výchova"]
[3293,"vzdělávací akce k integraci Romů"]
[3299,"ostatní záležitosti vzdělávání "]
[null,"33 – kultura, církve a sdělovací prostředky"]
[3314,"činnosti knihovnické"]
[3315,"činnosti muzeí a galerií"]
[null,"34 – tělovýchova a zájmová činnost"]
[3411,"státní sportovní reprezentace"]
[3419,"ostatní tělovýchovná činnost"]
[3421,"využití volného času dětí a mládeže"]
[null,"35 – zdravotnictví"]
[3541,"prevence před drogami, alkoholem, nikotinem a jinými návykovými látkami"]
[null,"37 – ochrana životního prostředí"]
[3745,"péče o vzhled obcí a veřejnou zeleň"]
[null,"38 – ostatní výzkum a vývoj "]
[3809,"ostatní  výzkum a vývoj odvětvově nespecifikovaný"]
["SKUPINA 4 – sociální věci a politika zaměstnanosti"]
[null,"43 – sociální služby a společné činnosti v sociálním zabezpečení a politice zaměstnanosti"]
[4313,"soc. ústavy pro zdr. postiž. mládež včetně diag. ústavů"]
[4322,"ústavy péče pro mládež"]
["SKUPINA 5 – bezpečnost státu a právní ochrana"]
[null,"52 – civilní připravenost na krizové stavy"]
[5299,"ostatní záležitosti civilní připravenosti na krizové stavy"]
[null,"53 – bezpečnost a veřejný pořádek"]
[5399,"ostatní záležitosti bezpečnosti, veřejného pořádku"]
["SKUPINA 6 – všeobecná veřejná správa a služby"]
[null,"62 – jiné veřejné služby a činnosti"]
[6221,"humanitární zahraniční pomoc"]
[6222,"rozvojová zahraniční pomoc"]

{"sheet":"Komentáře","index":14,"n_rows":103,"n_cols":5,"rows_kept":103,"cut":false,"hidden":true,"merged":[]}
[]
[]
[null,null,"KOMENTÁŘE K TABULKÁM V SEŠITU - texty delší než 255 znaků zkraťte, nebo rozdělte do 2 řádků.",null,"   21.5.2004 12:52:48"]
[null,null,null,"Počet znaků","   Použití komentářů"]
[null,null,"Výdaje z rozpočtu kapitol 333-MŠMT, 700-obce a DSO a KÚ (část: vzdělávání).",{"$f":"LEN(C5)","v":75}]
[null,null,"Uváděné výdaje neobsahují z daných tříd rozpočtové skladby následující položky: 5321; 5323; 5329; 5344; 5345; 5349; 5366; 5367; 5641; 5642; 5649; 6341; 6342; 6349; 6441; 6442; 6449. ",182,"   B1"]
[null,null,"Vzhledem k transformaci veřejné správy došlo k podstatným změnám v metodice financování vzdělávání - údaje v letech 2000 a 2001 nelze u kapitoly 333-MŠMT porovnávat.",165]
[null,null,"Údaje za soukromé a církevní školy z registru CEDR ze dne 10. 6. 2002.",70]
[null,null,"Tabulka neobsahuje z daných tříd následující položky: 5321, 5323, 5329, 5344, 5345, 5349, 5366, 5367, 5641, 5642, 5649, 6341, 6342, 6349, 6441, 6442, 6449.",155,"   B7   B9   B10"]
[null,null,"Tabulka neobsahuje z daných tříd následující položky: 2223, 2441, 2442, 2449, 4121, 4122, 4129, 4133, 4134, 4139, 4221, 4222, 4229.",131,"   B5"]
[null,null,"Poskytnuté finanční prostředky k 31. 12. 2012.",46,"   B11"]
[null,null,"Tabulka uvádí pouze spotřebované finanční prostředky, to znamená dotace zmenšené o vratky.",90,"   B13"]
[null,null,"Uvedené údaje zahrnují pouze dotace rozdělené konkrétním subjektům. ",68,"   B12"]
[null,null,"Přijaté dotace (skutečnost) zahrnují převody z vlastních fondů (především z rezervního).",88,"   B4"]
[null,null,"Vysoké plnění příjmů kapitoly 333 v roce 2006 bylo ovlivněno operacemi spojenými s rezervním fondem.",100,"   B1   B2   B4"]
[null,null,"Bez škol pro děti, žáky, studenty se speciálními vzdělávacími potřebami.",72]
[null,null,"V roce 2007 bylo vykázáno nulové naplnění (skutečnost) příjmů z rozpočtu Evropské unie bez SZP na programovací období  2007 až 2013.",132]
[null,null,"Překročení rozpočtu bylo kryto použitím prostředků rezervního fondu.",68]
[null,null,"Jsou zahrnuty finanční prostředky nerozdělené krajským úřadem či magistrátem jednotlivým školám/školským zařízením a dále pak finanční prostředky určené pro rozvojové programy zaslané pod účelovým znakem 33155.",210]
[null,null,null,0]
[null,null,null,0]
[null,null,null,0]
[null,null,null,0]
[null,null,null,0]
[null,null,null,0]
[null,null,null,0]
[null,null,null,0]
[null,null,null,0]
[null,null,null,0]
[null,null,null,0]
[null,null,null,0]
[null,null,null,0]
[null,null,null,0]
[null,null,null,0]
[null,null,null,0]
[null,null,null,0]
[null,null,null,{"$f":"LEN(C37)","v":0}]
[null,null,null,0]
[null,null,null,0]
[null,null,null,0]
[null,null,null,0]
[null,null,null,0]
[null,null,null,0]
[null,null,null,0]
[null,null,null,0]
[null,null,null,0]
[null,null,null,0]
[null,null,null,0]
[null,null,null,0]
[null,null,null,0]
[null,null,null,0]
[null,null,null,0]
[null,null,null,0]
[null,null,null,0]
[null,null,null,0]
[null,null,null,0]
[null,null,null,0]
[null,null,null,0]
[null,null,null,0]
[null,null,null,0]
[null,null,null,0]
[null,null,null,0]
[null,null,null,0]
[null,null,null,0]
[null,null,null,0]
[null,null,null,0]
[null,null,null,0]
[null,null,null,0]
[null,null,null,{"$f":"LEN(C69)","v":0}]
[null,null,null,0]
[null,null,null,0]
[null,null,null,0]
[null,null,null,0]
[null,null,null,0]
[null,null,null,0]
[null,null,null,0]
[null,null,null,0]
[null,null,null,0]
[null,null,null,0]
[null,null,null,0]
[null,null,null,0]
[null,null,null,0]
[null,null,null,0]
[null,null,null,0]
[null,null,null,0]
[null,null,null,0]
[null,null,null,0]
[null,null,null,0]
[null,null,null,0]
[null,null,null,0]
[null,null,null,0]
[null,null,null,0]
[null,null,null,0]
[null,null,null,0]
[null,null,null,0]
[null,null,null,0]
[null,null,null,0]
[null,null,null,0]
[null,null,null,0]
[null,null,null,0]
[null,null,null,{"$f":"LEN(C101)","v":0}]
[null,null,null,{"$f":"LEN(C102)","v":0}]
[null,null,null,{"$f":"LEN(C103)","v":0}]