{"text_format":"1","workbook":"xlsx","n_sheets":15,"sheets":["Obsah","B1","B2","B3","B4","B5","B6","B7","B8","B9","B10","B11","B12","Paragrafy","Komentáře"],"not_rendered":{"charts":0,"images":0,"macros":1,"external_links":1,"defined_names":33,"comments":0,"pivot_tables":0},"unopened":[],"bounds":{"document_bytes":16777216,"sheet_cells":100000,"rows_first":2000,"rows_last":500,"rows_between":2000,"halvings":0,"cell_chars":16384,"cell_head_chars":4096},"cells_cut":0,"cells_raw":0,"read":"whole","date_system":"1900"}

{"sheet":"Obsah","index":0,"n_rows":30,"n_cols":5,"rows_kept":30,"cut":false,"hidden":false,"merged":[]}
[null,null,null,null,100]
[]
[null,null,"B. Příjmy a výdaje"]
[null,null,"Zdroje dat jsou uvedeny v zápatí jednotlivých tabulek"]
[null,null,null,"   "]
[null,null,"Text",null,"Obsah"]
[]
[null,null,"Tabulka 1",null,"Veřejné výdaje a příjmy v oblasti školství "]
[]
[null,null,"Tabulka 2",null,"Přehled běžných a kapitálových výdajů, příjmů a plnění rozpočtu kapitoly 333-MŠMT"]
[]
[null,null,"Tabulka 3",null,"Přehled výdajů kapitoly 333-MŠMT – státní správa a vzdělávání "]
[]
[null,null,"Tabulka 4",null,"Příjmy kapitoly 333-MŠMT – podle položek "]
[]
[null,null,"Tabulka 5",null,"Příjmy kapitoly 700-Obce a DSO; KÚ (část: vzdělávání) – podle položek "]
[]
[null,null,"Tabulka 6",null,"Výdaje kapitoly 333-MŠMT – podle položek "]
[]
[null,null,"Tabulka 7",null,"Výdaje kapitoly 700-Obce a DSO; KÚ (část: 31–32– vzdělávání) – podle položek "]
[]
[null,null,"Tabulka 8",null,"Běžné a kapitálové výdaje kapitoly 333-MŠMT – podle paragrafů "]
[]
[null,null,"Tabulka 9",null,"Běžné a kapitálové výdaje kapitoly 700-Obce a DSO; KÚ (část: 31–32–vzdělávání) – podle paragrafů "]
[]
[null,null,"Tabulka 10",null,"Výdaje kapitol 333-MŠMT a 700-Obce a DSO; KÚ  (vzdělávání) – podle paragrafů "]
[]
[null,null,"Tabulka 11",null,"Poskytnuté dotace církevním školám – podle paragrafů "]
[]
[null,null,"Tabulka 12",null,"Porovnání čerpaných dotací církevním školám v letech 20018 a 2019 – vybrané oblasti"]

{"sheet":"B1","index":1,"n_rows":27,"n_cols":25,"rows_kept":27,"cut":false,"hidden":false,"merged":[[25,15,25,24],[25,4,25,13],[8,12,12,12],[8,13,12,13],[24,4,24,13],[8,9,11,11],[8,3,12,8],[25,26,25,33],[8,23,12,23],[8,24,12,24],[8,25,12,30],[8,31,11,33],[24,15,24,24],[24,26,24,33],[8,20,11,22],[23,21,23,24]]}
[{"$f":"IF(#REF!=\"\",\"ŠABLONA\",IF(#REF!=\"T\",\"TISK\",\"ELEKTRO\"))","v":{"$error":"#REF!"}},0,{"$f":"CONCATENATE(D1,F1,IF(G1<>\"\",\".\",\"\"),G1,IF(H1<>\"\",\".\",\"\"),H1,IF(I1<>\"\",\".\",\"\"),I1,\"\")","v":{"$error":"#REF!"}},{"$f":"IF(#REF!=\"\",\" ?\",#REF!)","v":{"$error":"#REF!"}},{"$f":"CONCATENATE(C1,N1)","v":{"$error":"#REF!"}},1]
["konst"]
["konst","9x5",null,"Tab. B1:",null,null,null,"Veřejné výdaje a příjmy v oblasti školství",null,null,null,null,null,3843471,"Tab. B1:",null,"Veřejné výdaje a příjmy v oblasti vzdělávání a školských služeb "]
["konst",{"$f":"COUNTA(Datova_oblast)","v":45},null,{"$f":"IF(D1=\" ?\",\"\",CONCATENATE(\"Tab. \",E1,\":\"))","v":{"$error":"#REF!"}},null,null,null,{"$f":"IF(H3=\"Zadejte název tabulky\",\"\",H3)","v":"Veřejné výdaje a příjmy v oblasti školství"}]
[{"$f":"IF(D5=\"\",\"odstr\",\"OK\")","v":"odstr"},0]
[{"$f":"IF(COUNTBLANK(C6:IK6)=254,\"odstr\",\"OK\")","v":"OK"},"Řádky pro"]
[{"$f":"IF(COUNTBLANK(C7:IK7)=254,\"odstr\",\"OK\")","v":"OK"},"ročenku PaM"]
["konst",null,null,"(podle stavu k: 31. 12. 2017)",null,null,null,null,null,null,null,null,null,"v tis. Kč","(podle stavu k: 31. 12. 2020)",null,null,null,null,null,null,null,null,null,"v tis. Kč"]
["konst",null,null,null,null,null,null,null,null,"Výdaje",null,null,"Podíl výdajů na HDP","Příjmy celkem",null,null,null,null,null,null,"Výdaje",null,null,"Podíl výdajů na HDP","Příjmy celkem"]
["konst"]
["konst"]
["konst"]
["konst","nebo odstr",null,null,null,null,null,null,null,"běžné","kapitálové","celkem",null,null,null,null,null,null,null,null,"běžné","kapitálové","celkem"]
["konst","OK",null,null,"Kapitola 333-MŠMT",null,null,null,null,151878791.01672998,5632649.0073900009,157511440.02411997,3.115935438236259E-2,3274552.8891199999,"Kapitola 333-MŠMT",null,null,null,null,null,218320357.40586001,9102348.7597599998,227422706,4.02E-2,13488337]
["konst","OK",null,null,"Kapitola 700-Obce a DSO1)",null,null,null,null,33100413.150529996,10117079.32487,43217492.475399993,8.5494054485938647E-3,783585.08624999993,"Kapitola 700-Obce a DSO1)",null,null,null,null,null,40760074.802430004,15763895.647230003,56523970.449660003,0,1091261.3526400002]
["konst","OK",null,null,"Kapitola 700-Krajské úřady1)",null,null,null,null,97280924.71187003,2068752.5878400004,99349677.299710035,1.9653631522135687E-2,472146.35280999995,"Kapitola 700-Krajské úřady1)",null,null,null,null,null,145721709.54393998,4419792.2698600003,150141501.81379995,1.2999999999999999E-2,606855.14702999988]
["konst","OK",null,null,"Transfery z MŠMT veřejným rozpočtům místní úrovně",null,null,null,null,-106016383.94771999,-420092.31105000002,-106436476.25876999,-2.1055561948065973E-2,"(neuvedeno)","Transfery z MŠMT veřejným rozpočtům místní úrovně",null,null,null,null,null,-160125570.81244999,-586812.23809999996,{"$f":"SUM(U17:V17)","v":-160712383.05054998},2.8400000000000002E-2,5185.4644500000004]
["konst","OK",null,null,"Celkem",null,null,null,null,176243744.93141001,17398388.609050002,193642133.54045999,3.8306829405026159E-2,4530284.3281800002,"Celkem",null,null,null,null,null,{"$f":"SUM(U14:U17)","v":244676570.93978},{"$f":"SUM(V14:V17)","v":28699224.438750003},{"$f":"SUM(W14:W17)","v":273375795.21290994},2.5899999999999999E-2,{"$f":"SUM(Y14,Y15,Y16,Y17)","v":15191638.964119999}]
["konst","OK",null,null,"Ministerstvo obrany (kapitola 307)",null,null,null,null,1106057.17243,74874.33064,1180931.5030700001,2.3361517868047843E-4,"(neuvedeno)","Ministerstvo obrany (kapitola 307)",null,null,null,null,null,1450790.370240001,304842.89976,{"$f":"SUM(U19:V19)","v":1755633.2700000009},3.0000000000000001E-6,"(neuvedeno)"]
["konst","OK",null,null,null,"z toho transfer krajským úřadům",null,null,null,0,0,0,0,"(neuvedeno)",null,"z toho transfer krajským úřadům",null,null,null,null,0,0,0,0,"(neuvedeno)"]
["konst","OK",null,null,"Ministerstvo spravedlnosti (kapitola 336)",null,null,null,null,"x ","x ","x ","x ","x ","Ministerstvo spravedlnosti (kapitola 336)",null,null,null,null,null,"x","x","x","x","x"]
["konst","OK",null,null,"Ministerstvo vnitra (kapitola 314)",null,null,null,null,".",".",".",".",".","Ministerstvo vnitra (kapitola 314)",null,null,null,null,null,734333.54958000011,74808.972569999998,809142.52215000009,0,"."]
["konst","OK",null,null,"Celkem oblast školství",null,null,null,null,177349802.10384002,17473262.939690001,194823065.04352999,3.8540444583706639E-2,4530284.3281800002,"Celkem oblast školství",null,null,null,null,null,{"$f":"SUM(U18,U19,U22)","v":246861694.85960001},{"$f":"SUM(V18,V19,V22)","v":29078876.311080001},{"$f":"SUM(W18,W19,W22)","v":275940571.0050599},2.5999999999999998E-4,{"$f":"Y18","v":15191638.964119999}]
["konst","stop",null,"Komentáře:",null,null,null,null,null,null,null,null,null,"Zdroj: Závěrečný účet – kapitola 333-MŠMT, 700-Obce a DSO; KÚ, 307-MO",null,null,null,null,null,null,null,"Zdroj: Závěrečný účet kapitoly 333-MŠMT; monitor.statnipokladna.cz"]
[{"$f":"IF(COUNTBLANK(D25:E25)=2,\"odstr\",\"OK\")","v":"OK"},null,null,"1)","Uváděné výdaje neobsahují z daných tříd rozpočtové skladby následující položky: 5321; 5323; 5329; 5344; 5345; 5349; 5366; 5367; 5641; 5642; 5649; 6341; 6342; 6349; 6441; 6442; 6449. "]
[{"$f":"IF(COUNTBLANK(D26:E26)=2,\"odstr\",\"OK\")","v":"odstr"}]
["stop"]

{"sheet":"B2","index":2,"n_rows":21,"n_cols":35,"rows_kept":21,"cut":false,"hidden":false,"merged":[[18,4,18,12],[8,12,12,12],[8,9,11,11],[8,3,12,8],[8,41,11,41],[18,36,18,41],[19,16,19,24],[19,36,19,41],[18,16,18,24],[8,15,12,20],[8,21,11,23],[8,24,12,24],[8,25,12,30],[8,31,11,33],[8,34,12,34],[8,35,12,40],[16,16,16,20],[16,26,16,30],[18,25,18,34]]}
[{"$f":"IF(#REF!=\"\",\"ŠABLONA\",IF(#REF!=\"T\",\"TISK\",\"ELEKTRO\"))","v":{"$error":"#REF!"}},0,{"$f":"CONCATENATE(D1,F1,IF(G1<>\"\",\".\",\"\"),G1,IF(H1<>\"\",\".\",\"\"),H1,IF(I1<>\"\",\".\",\"\"),I1,\"\")","v":{"$error":"#REF!"}},{"$f":"IF(#REF!=\"\",\" ?\",#REF!)","v":{"$error":"#REF!"}},{"$f":"CONCATENATE(C1,M1)","v":{"$error":"#REF!"}},2]
["konst"]
["konst","3x4",null,"Tab. B2:",null,null,null,"Přehled běžných a kapitálových výdajů, příjmů a plnění rozpočtu kapitoly 333-MŠMT",null,null,null,null,null,null,null,"Tab. B2:",null,null,null,"Přehled běžných a kapitálových výdajů, příjmů a plnění rozpočtu kapitoly 333-MŠMT",null,null,null,null,null,"Tab. B2:",null,null,null,"Přehled běžných a kapitálových výdajů, příjmů a plnění rozpočtu kapitoly 333-MŠMT"]
["konst",{"$f":"COUNTA(Datova_oblast)","v":12},null,{"$f":"IF(D1=\" ?\",\"\",CONCATENATE(\"Tab. \",E1,\":\"))","v":{"$error":"#REF!"}},null,null,null,{"$f":"IF(H3=\"Zadejte název tabulky\",\"\",H3)","v":"Přehled běžných a kapitálových výdajů, příjmů a plnění rozpočtu kapitoly 333-MŠMT"}]
[{"$f":"IF(D5=\"\",\"odstr\",\"OK\")","v":"odstr"},0]
[{"$f":"IF(COUNTBLANK(C6:IX6)=254,\"odstr\",\"OK\")","v":"OK"},"Řádky pro"]
[{"$f":"IF(COUNTBLANK(C7:IX7)=254,\"odstr\",\"OK\")","v":"OK"},"ročenku PaM"]
["konst",null,null,"(podle stavu k: 31. 12. 2017)",null,null,null,null,null,null,null,null,null,null,null,"(podle stavu k: 31. 12. 2019)",null,null,null,null,null,null,null,null,"v tis. Kč","(podle stavu k: 31. 12. 2020)",null,null,null,null,null,null,null,null,"v tis. Kč"]
["konst",null,null,null,null,null,null,null,null,"Výdaje",null,null,"Příjmy celkem",null,null,null,null,null,null,null,null,"Výdaje",null,null,"Příjmy celkem",null,null,null,null,null,null,"Výdaje",null,null,"Příjmy celkem"]
["konst"]
["konst"]
["konst"]
["konst","nebo odstr",null,null,null,null,null,null,null,"běžné","kapitálové","celkem",null,null,null,null,null,null,null,null,null,"běžné","kapitálové","celkem",null,null,null,null,null,null,null,"běžné","kapitálové","celkem"]
["konst","OK",null,null,"Schválený rozpočet",null,null,null,null,148332711.70199999,8193150.466,156525862.16799998,8645045.5140000004,null,null,null,"Schválený rozpočet",null,null,null,null,196018803.21000001,9740363.1600000001,{"$f":"V14+W14","v":205759166.37},10151242.74,null,"Schválený rozpočet",null,null,null,null,220068774.935,6898225.2750000004,226967000.21000001,12282724.856000001]
["konst","OK",null,null,"Rozpočet po změnách",null,null,null,null,151760634.234,7741115.0270000007,159501749.26100001,8645045.5140000004,null,null,null,"Rozpočet po změnách",null,null,null,null,200513347.00999999,10006419.949999999,{"$f":"V15+W15","v":210519766.95999998},15310027.99,null,"Rozpočet po změnách",null,null,null,null,218168675.74599999,10991306.276000001,229159982.02000001,14145579.59]
["konst","OK",null,null,"Skutečnost",null,null,null,null,151878791.01672998,5632649.0073899999,157511440.02411997,3274552.8891199999,null,null,null,"Skutečnost",null,null,null,null,199521703.06,11010103.439999999,{"$f":"SUM(V16:W16)","v":210531806.5},14807842.52,null,"Skutečnost",null,null,null,null,218320357.41,9102348.7599999998,227422706.16999999,13488337.31879]
[null,null,null,null,"Plnění rozpočtu v procentech",null,null,null,null,1.0007785733324479,0.72762760761777268,0.98752170903390413,0.37877798142498015,null,null,null,"Odečtení transferů územním rozpočtům",null,null,null,null,null,10305306.9,null,null,null,"Odečtení transferů územním rozpočtům"]
["konst","OK",null,"",null,null,null,null,null,null,null,null,null,null,null,null,"Plnění rozpočtu v procentech",null,null,null,null,{"$f":"V16/V15","v":0.99505447410465631},{"$f":"W16/W15","v":1.1003039543628188},{"$f":"X16/X15","v":1.0000571895939934},{"$f":"Y16/Y15","v":0.96719891888323051},null,"Plnění rozpočtu v procentech",null,null,null,null,{"$f":"AF16/AF15","v":1.0006952495058301},{"$f":"AG16/AG15","v":0.82814076247473678},{"$f":"AH16/AH15","v":0.99241893879251397},{"$f":"AI16/AI15","v":0.95353726816010942}]
[{"$f":"IF(COUNTBLANK(#REF!)=2,\"odstr\",\"OK\")","v":{"$error":"#REF!"}},null,null,null,null,null,null,null,null,null,null,null,null,null,null,null,null,null,null,null,null,null,null,null,null,"Zdroj: Závěrečný účet - kapitola 333 - MŠMT_přílohová tabulka k Závěrečnému účtu_bilance příjmů a výdajů státního rozpočtu v druhovém členění rozpočtové skladby"]
[{"$f":"IF(COUNTBLANK(D19:E19)=2,\"odstr\",\"OK\")","v":"odstr"}]
["stop"]

{"sheet":"B3","index":3,"n_rows":22,"n_cols":57,"rows_kept":22,"cut":false,"hidden":false,"merged":[[20,45,20,56],[8,44,12,49],[8,50,11,52],[8,53,11,55],[8,56,12,56],[19,45,19,56],[19,17,19,28],[20,17,20,28],[8,16,12,21],[8,22,11,24],[8,25,11,27],[8,28,12,28],[20,4,20,15],[8,15,12,15],[19,4,19,15],[8,3,12,8],[8,9,11,11],[8,12,11,14],[8,30,12,35],[8,36,11,38],[8,42,12,42],[19,31,19,42],[20,31,20,42],[8,39,11,41]]}
[{"$f":"IF(#REF!=\"\",\"ŠABLONA\",IF(#REF!=\"T\",\"TISK\",\"ELEKTRO\"))","v":{"$error":"#REF!"}},0,{"$f":"CONCATENATE(D1,F1,IF(G1<>\"\",\".\",\"\"),G1,IF(H1<>\"\",\".\",\"\"),H1,IF(I1<>\"\",\".\",\"\"),I1,\"\")","v":{"$error":"#REF!"}},{"$f":"IF(#REF!=\"\",\" ?\",#REF!)","v":{"$error":"#REF!"}},{"$f":"CONCATENATE(C1,P1)","v":{"$error":"#REF!"}},3]
["konst"]
["konst","3x7",null,"Tab. B3:",null,null,null,"Přehled výdajů kapitoly 333-MŠMT – státní správa a vzdělávání",null,null,null,null,null,null,null,null,null,null,null,null,null,null,null,null,null,null,null,null,null,null,"Tab. B3:",null,null,null,"Přehled výdajů kapitoly 333-MŠMT – státní správa a vzdělávání",null,null,null,null,null,null,null,null,null,"Tab. B3:",null,null,null,"Přehled výdajů kapitoly 333-MŠMT – státní správa a vzdělávání"]
["konst",{"$f":"COUNTA(Datova_oblast)","v":21},null,{"$f":"IF(D1=\" ?\",\"\",CONCATENATE(\"Tab. \",E1,\":\"))","v":{"$error":"#REF!"}},null,null,null,{"$f":"IF(H3=\"Zadejte název tabulky\",\"\",H3)","v":"Přehled výdajů kapitoly 333-MŠMT – státní správa a vzdělávání"}]
[{"$f":"IF(D5=\"\",\"odstr\",\"OK\")","v":"odstr"},0]
[{"$f":"IF(COUNTBLANK(C6:IW6)=254,\"odstr\",\"OK\")","v":"OK"},"Řádky pro"]
[{"$f":"IF(COUNTBLANK(C7:IW7)=254,\"odstr\",\"OK\")","v":"OK"},"ročenku PaM"]
["konst",null,null,"(podle stavu k: 31. 12. 2017)",null,null,null,null,null,null,null,null,null,null,null,"v tis. Kč","(podle stavu k: 31. 12. 2018)",null,null,null,null,null,null,null,null,null,null,null,"v tis. Kč",null,"(podle stavu k: 31. 12. 2019)",null,null,null,null,null,null,null,null,null,null,null,"v tis. Kč",null,"(podle stavu k: 31. 12. 2020)",null,null,null,null,null,null,null,null,null,null,null,"v tis. Kč"]
["konst",null,null,null,null,null,null,null,null,"Běžné výdaje",null,null,"Kapitálové výdaje",null,null,"Výdaje         celkem",null,null,null,null,null,null,"Běžné výdaje",null,null,"Kapitálové výdaje",null,null,"Výdaje         celkem",null,null,null,null,null,null,null,"Běžné výdaje",null,null,"Kapitálové výdaje",null,null,"Výdaje         celkem",null,null,null,null,null,null,null,"Běžné výdaje",null,null,"Kapitálové výdaje",null,null,"Výdaje         celkem"]
["konst"]
["konst"]
["konst"]
["konst","nebo odstr",null,null,null,null,null,null,null,"státní správa","vzdělávání","ostatní","státní správa ","vzdělávání","ostatní",null,null,null,null,null,null,null,"státní správa","vzdělávání","ostatní","státní správa 1)","vzdělávání 2)","ostatní 3)",null,null,null,null,null,null,null,null,"státní správa","vzdělávání","ostatní","státní správa 1)","vzdělávání 2)","ostatní 3)",null,null,null,null,null,null,null,null,"státní správa","vzdělávání","ostatní","státní správa 1)","vzdělávání 2)","ostatní 3)"]
["konst","OK",null,null,"Schválený rozpočet",null,null,null,null,842175.071,134134545.154,13355991.476999993,12869.07,3652457.9190000002,4527823.477,156525862.16799998,null,"Schválený rozpočet",null,null,null,null,910931.45,160779210.66,155146.69,125469.07,4059136.4509999999,1618657.199,176111709.90799999,null,null,"Schválený rozpočet",null,null,null,null,956931.57,37696828.461000003,144593956.61699998,284439.87700000004,2928121.9989999998,1980209.3459999999,{"$f":"SUM(AK14:AP14)","v":188440487.87},null,null,"Schválený rozpočet",null,null,null,null,1038238.787,39885748.045000002,164246452.20500001,143405.723,2974824.2110000001,932185.16099999996,{"$f":"SUM(AY14:BD14)","v":209220854.132}]
["konst","OK",null,null,"Rozpočet po změnách",null,null,null,null,850712.34,137712361.28600001,13197560.607999984,13171.572,3774579.227,3953364.2280000006,159501749.26100001,null,"Rozpočet po změnách",null,null,null,null,908081.94,170377927,161733.07,35046.978999999999,8151432.6600000001,1054503.304,183552679.92700002,null,null,"Rozpočet po změnách",null,null,null,null,973942.22,45528284.476000004,142198213.13999999,153375.27400000003,6392053.159,667670.20299999998,{"$f":"SUM(AK15:AP15)","v":195913538.472},null,null,"Rozpočet po změnách",null,null,null,null,1055009.99,44329438.232000001,161333624.817,105289.9,6661167.733,1322216.4469999999,{"$f":"SUM(AY15:BD15)","v":214806747.11900002}]
["konst","OK",null,null,"Skutečnost",null,null,null,null,827390.06492999999,141528772.13253999,9522628.8192599937,22710.560409999998,3405327.1045300001,2204611.3424499999,157511440.02411997,null,"Skutečnost",null,null,null,null,845264.4,174969921.68000001,164044.12,105594.239,10594528.837789999,910491.71725999995,187716388.57187998,null,null,"Skutečnost",null,null,null,null,919836.2,47241435.49137,140424006.65659001,17101.684680000002,7573014.6442900002,504683.31304000004,{"$f":"SUM(AK16:AP16)","v":196680077.98997003},null,null,"Skutečnost",null,null,null,null,975504.89613999997,45160137.519100003,161616071.56147999,51872.949589999997,5216317.8685499998,359279.57610000001,{"$f":"SUM(AY16:BD16)","v":213379184.37095997}]
["konst","OK",null,null,"Plnění rozpočtu v procentech",null,null,null,null,0.97258500438585394,1.0277129141560073,0.72154461738085507,1.7242103228073307,0.90217396423190777,0.55765449761387365,0.98752170903390413,null,"Plnění rozpočtu v procentech",null,null,null,null,0.93079999999999996,1.0269999999999999,1.0143,3.0129299999999999,1.2997099999999999,0.86343000000000003,1.0226839981118003,null,null,"Plnění rozpočtu v procentech",null,null,null,null,{"$f":"AK16/AK15","v":0.94444637588459812},{"$f":"AL16/AL15","v":1.0376282795428646},0.98752300437373852,0.11150222740596374,1.1847546407881806,0.75588712926282864,{"$f":"AQ16/AQ15","v":1.0039126418926867},null,null,"Plnění rozpočtu v procentech",null,null,null,null,{"$f":"AY16/AY15","v":0.92464043505407945},1.0187392243220521,1.0017506997986338,0.49266785883546282,0.78309360725266097,0.27172523599685644,0.99335419968326599]
["konst","stop",null,null,null,null,null,null,null,null,null,null,null,null,null,"Zdroj: Závěrečný účet – kapitola 333-MŠMT",null,null,null,null,null,null,null,null,null,null,null,null,"Zdroj: Závěrečný účet – kapitola 333-MŠMT",null,null,null,null,null,null,null,null,null,null,null,null,null,"Zdroj: Závěrečný účet – kapitola 333-MŠMT",null,null,null,null,null,null,null,null,null,null,null,null,null,"Zdroj: Závěrečný účet – kapitola 333-MŠMT"]
[null,null,null,null,null,null,null,null,null,null,null,null,null,null,null,null,null,"1)","§ 326x",null,null,null,null,null,null,null,null,null,null,null,null,"1)","§ 326x",null,null,null,null,null,null,null,null,null,null,null,null,"1)","§ 326x"]
[{"$f":"IF(COUNTBLANK(D20:E20)=2,\"odstr\",\"OK\")","v":"odstr"},null,null,null,null,null,null,null,null,null,null,null,null,null,null,null,null,"2) § 3111, 3112, 3113, 3114, 3115, 3117, 3118, 3119, 312x, 313x , 3143, 3141, 3142, 3150, 321x, 322x, 3231",null,null,null,null,null,null,null,null,null,null,null,null,null,"2) § 3111, 3112, 3113, 3114, 3115, 3117, 3118, 3119, 312x, 313x , 3143, 3141, 3142, 3150, 321x, 322x, 3231",null,null,null,null,null,null,null,null,null,null,null,null,null,"2) § 3111, 3112, 3113, 3114, 3115, 3117, 3118, 3119, 312x, 313x , 3143, 3141, 3142, 3150, 321x, 322x, 3231"]
[{"$f":"IF(COUNTBLANK(D21:E21)=2,\"odstr\",\"OK\")","v":"odstr"},null,null,null,null,null,null,null,null,null,null,null,null,null,null,null,null,"3) § 3144,3145, 3146,3147,3148,3149,3232,3233,3239,3280,329x",null,null,null,null,null,null,null,null,null,null,null,null,null,"3) § 3144,3145, 3146,3147,3148,3149,3232,3233,3239,3280,329x",null,null,null,null,null,null,null,null,null,null,null,null,null,"3) § 3144,3145, 3146,3147,3148,3149,3232,3233,3239,3280,329x"]
["stop"]

{"sheet":"B4","index":4,"n_rows":79,"n_cols":36,"rows_kept":79,"cut":false,"hidden":false,"merged":[[42,6,42,7],[52,6,52,7],[28,6,28,7],[8,11,12,11],[8,12,12,12],[45,6,45,7],[8,22,12,22],[8,23,12,23],[8,24,12,24],[8,13,12,14],[8,26,12,27],[8,3,12,4],[8,6,12,6],[8,9,12,9],[8,10,12,10],[8,21,12,21],[8,15,12,16],[8,17,12,20],[17,18,17,19],[40,15,41,16],[59,26,59,27],[54,26,54,27],[40,26,41,27],[52,26,52,35],[8,32,12,32],[8,33,12,33],[8,34,12,34],[8,35,12,35],[17,29,17,30],[8,28,12,31]]}
[{"$f":"IF(#REF!=\"\",\"ŠABLONA\",IF(#REF!=\"T\",\"TISK\",\"ELEKTRO\"))","v":{"$error":"#REF!"}},0,{"$f":"CONCATENATE(D1,F1,IF(G1<>\"\",\".\",\"\"),G1,IF(H1<>\"\",\".\",\"\"),H1,IF(I1<>\"\",\".\",\"\"),I1,\"\")","v":{"$error":"#REF!"}},{"$f":"IF(#REF!=\"\",\" ?\",#REF!)","v":{"$error":"#REF!"}},{"$f":"CONCATENATE(C1,M1)","v":{"$error":"#REF!"}},4]
["konst"]
["konst","35x3",null,"Tab. B4:",null,null,null,"Příjmy kapitoly 333-MŠMT – podle položek",null,null,null,null,null,null,null,"Tab. B4: Příjmy kapitoly 333-MŠMT - podle položek",null,null,null,null,null,null,null,null,null,null,"Tab. B4: Příjmy kapitoly 333-MŠMT - podle položek"]
["konst",{"$f":"COUNTA(Datova_oblast)","v":108},null,{"$f":"IF(D1=\" ?\",\"\",CONCATENATE(\"Tab. \",E1,\":\"))","v":{"$error":"#REF!"}},null,null,null,{"$f":"IF(H3=\"Zadejte název tabulky\",\"\",H3)","v":"Příjmy kapitoly 333-MŠMT – podle položek"}]
[{"$f":"IF(D5=\"\",\"odstr\",\"OK\")","v":"odstr"},0]
[{"$f":"IF(COUNTBLANK(C6:IL6)=254,\"odstr\",\"OK\")","v":"OK"},"Řádky pro"]
[{"$f":"IF(COUNTBLANK(C7:IL7)=254,\"odstr\",\"OK\")","v":"OK"},"ročenku PaM"]
["konst",null,null,"(podle stavu k: 31. 12. 2017)",null,null,null,null,null,null,null,null,"v tis. Kč",null,null,"(podle stavu k: 31. 12. 2019)",null,null,null,null,null,null,null,null,"v tis. Kč",null,"(podle stavu k: 31. 12. 2020)",null,null,null,null,null,null,null,null,"v tis. Kč"]
["konst",null,null,"Položka",null,null,"Popis položky",null,null,"Schválený\nrozpočet","Rozpočet\npo změnách","Skutečnost","% plnění\nrozpočtu",null,null,null,"Položka","Popis položky",null,null,null,"Schválený rozpočet","Rozpočet pod změnách","Skutečnost","% plnění rozpočtu",null,null,"Položka","Popis položky",null,null,null,"Schválený rozpočet","Rozpočet po změnách","Skutečnost","% plnění rozpočtu"]
["konst"]
["konst"]
["konst"]
["konst"]
[null,null,null,null,1361,null,"Správní poplatky",null,null,200,200,796.08622000000003,3.9804311000000001,null,null,null,1,"Daňové příjmy",null,null,null,{"$f":"SUM(V15)","v":700},{"$f":"SUM(W15)","v":700},{"$f":"SUM(X15)","v":541.59402},{"$f":"X14/W14","v":0.77370574285714289},null,null,1,"Daňové příjmy",null,null,null,{"$f":"AG15","v":700},{"$f":"AH15","v":700},{"$f":"AI15","v":1152.0082399999999},{"$f":"AI14/AH14","v":1.6457260571428569}]
[null,null,null,null,1,null,"Daňové příjmy",null,null,200,200,796.08622000000003,3.9804311000000001,null,null,null,1361,"Správní poplatky",null,null,null,700,700,541.59402,{"$f":"X15/W15","v":0.77370574285714289},null,null,1361,"Správní poplatky",null,null,null,700,700,1152.0082399999999,1.6457260571428569]
[{"$f":"IF(COUNTBLANK(C16:IL16)=254,\"odstr\",IF(AND($A$1=\"TISK\",SUM(J16:M16)=0),\"odstr\",\"OK\"))","v":{"$error":"#REF!"}},"OK",null,null,2111,null,"Příjmy z poskytování služeb a výrobků",null,null,66,66,73.099999999999994,1.1075757575757574,null,null,null,2,"Nedaňové příjmy",null,null,null,{"$f":"SUM(V17,V24,V29,V35)","v":92056},{"$f":"SUM(W17+W24+W29+W35)","v":92056},{"$f":"SUM(X17+X24+X29+X35)","v":158121.98252000002},{"$f":"X16/W16","v":1.7176716620318069},null,null,2,"Nedaňové příjmy",null,null,null,{"$f":"SUM(AG17,AG24,AG29,AG35)","v":93698.6},{"$f":"SUM(AH17,AH24,AH29,AH35)","v":93698.6},{"$f":"SUM(AI17,AI24,AI29,AI35)","v":146289.96833},1.5612823279109826]
[null,null,null,null,null,null,null,null,null,null,null,null,null,null,null,null,21,"Příjmy z vlastní činnosti a odvody přebytků organizací s přímým vztahem",null,null,null,{"$f":"SUM(V18:V23)","v":2967.65},{"$f":"SUM(W18:W23)","v":2967.65},{"$f":"SUM(X18:X23)","v":5556.42407},{"$f":"X17/W17","v":1.8723313295031421},null,null,21,"Příjmy z vlastní činnosti a odvody přebytků organizací s přímým vztahem",null,null,null,{"$f":"SUM(AG18:AG23)","v":4852.25},{"$f":"SUM(AH18:AH23)","v":4852.25},{"$f":"SUM(AI18:AI23)","v":4553.6204400000006},0.93845544644237222]
[{"$f":"IF(COUNTBLANK(C18:IL18)=254,\"odstr\",IF(AND($A$1=\"TISK\",SUM(J18:M18)=0),\"odstr\",\"OK\"))","v":{"$error":"#REF!"}},"OK",null,null,2119,null,"Ostatní příjmy z vlastní činnosti",null,null,0,0,4,"x ",null,null,null,2111,"Příjmy z poskytování služeb a výrobků",null,null,null,66,66,0,"x",null,null,2111,"Příjmy z poskytování služeb a výrobků",null,null,null,66,66,0,0]
[{"$f":"IF(COUNTBLANK(C19:IL19)=254,\"odstr\",IF(AND($A$1=\"TISK\",SUM(J19:M19)=0),\"odstr\",\"OK\"))","v":{"$error":"#REF!"}},"OK",null,null,2123,null,"Ostatní odvody příspěvkových organizací",null,null,0,0,9119.1080000000002,"x ",null,null,null,2131,"Příjmy z pronájmu pozemků",null,null,null,15,15,3.6,{"$f":"X19/W19","v":0.24000000000000002},null,null,2131,"Příjmy z pronájmu pozemků",null,null,null,3.6,3.6,3.6,1]
[{"$f":"IF(COUNTBLANK(C20:IL20)=254,\"odstr\",IF(AND($A$1=\"TISK\",SUM(J20:M20)=0),\"odstr\",\"OK\"))","v":{"$error":"#REF!"}},"OK",null,null,2131,null,"Příjmy z pronájmu pozemků",null,null,15,3.6,3.6,1,null,null,null,2132,"Příjmy z pronájmu ostatních nemovitostí a jejich částí",null,null,null,2884,2884,5521.3829999999998,{"$f":"X20/W20","v":1.9144878640776699},null,null,2132,"Příjmy z pronájmu ostatních nemovitostí a jejich částí",null,null,null,4780,4780,4542.2089999999998,0.95025292887029289]
[{"$f":"IF(COUNTBLANK(C21:IL21)=254,\"odstr\",IF(AND($A$1=\"TISK\",SUM(J21:M21)=0),\"odstr\",\"OK\"))","v":{"$error":"#REF!"}},"OK",null,null,2132,null,"Příjmy z pronájmu ostatních nemovitostí a jejich částí",null,null,1279,1261.6210000000001,9827.7079400000002,7.7897466354792755,null,null,null,2133,"Příjmy z pronájmu movitých věcí",null,null,null,0.5,0.5,21.995000000000001,{"$f":"X21/W21","v":43.99},null,null,2133,"Příjmy z pronájmu movitých věcí",null,null,null,0.5,0.5,4.8259999999999996,9.6519999999999992]
[{"$f":"IF(COUNTBLANK(C22:IL22)=254,\"odstr\",IF(AND($A$1=\"TISK\",SUM(J22:M22)=0),\"odstr\",\"OK\"))","v":{"$error":"#REF!"}},"OK",null,null,2133,null,"Příjmy z pronájmu movitých věcí",null,null,0,0,0.59,"x ",null,null,null,2141,"Příjmy z úroků (část)",null,null,null,0.15,0.15,2.9973299999999998,{"$f":"X22/W22","v":19.982199999999999},null,null,2141,"Příjmy z úroků (část)",null,null,null,0.15,0.15,2.7E-2,0.18]
[null,null,null,null,null,null,null,null,null,null,null,null,null,null,null,null,2143,"Kursové rozdíly v příjmech",null,null,null,2,2,6.4487399999999999,{"$f":"X23/W23","v":3.22437},null,null,2143,"Kursové rozdíly v příjmech",null,null,null,2,2,2.95844,1.47922]
[null,null,null,null,null,null,null,null,null,null,null,null,null,null,null,null,22,"Přijaté sankční platby a vratky transferů",null,null,null,{"$f":"SUM(V26:V28)","v":0},0,{"$f":"SUM(X26:X28)","v":49012.536570000004},"x",null,null,22,"Přijaté sankční platby a vratky transferů",null,null,null,{"$f":"SUM(AG26:AG28)","v":0},{"$f":"SUM(AH26:AH28)","v":0},{"$f":"SUM(AI25:AI28)","v":43112.300069999998},"x"]
[null,null,null,null,null,null,null,null,null,null,null,null,null,null,null,null,null,null,null,null,null,null,null,null,null,null,null,2212,"Sankční platby přijaté od jiných subjektů",null,null,null,null,null,11.255000000000001,"x"]
[{"$f":"IF(COUNTBLANK(C26:IL26)=254,\"odstr\",IF(AND($A$1=\"TISK\",SUM(J26:M26)=0),\"odstr\",\"OK\"))","v":{"$error":"#REF!"}},"OK",null,null,2141,null,"Příjmy z úroků (část)",null,null,0,0,1.3728800000000001,"x ",null,null,null,2221,"Přijaté vratky transferů od jiných veřejných rozpočtů",null,null,null,0,0,2046.10473,"x",null,null,2221,"Přijaté vratky transferů od jiných veřejných rozpočtů",null,null,null,0,0,5922.9181799999997,"x"]
[{"$f":"IF(COUNTBLANK(C27:IL27)=254,\"odstr\",IF(AND($A$1=\"TISK\",SUM(J27:M27)=0),\"odstr\",\"OK\"))","v":{"$error":"#REF!"}},"OK",null,null,2143,null,"Realizované kursové zisky",null,null,0,0,35.327769999999994,"x ",null,null,null,2222,"Ostatní příjmy z finančního vypořádání předchozích let od jiných veřejných rozpočtů",null,null,null,0,0,15.282249999999999,"x",null,null,2222,"Ostatní příjmy z finančního vypořádání předchozích let od jiných veřejných rozpočtů",null,null,null,0,0,150,"x"]
[null,null,null,null,null,null,null,null,null,null,null,null,null,null,null,null,2229,"Ostatní přijaté vratky transferů",null,null,null,0,0,46951.149590000001,"x",null,null,2229,"Ostatní přijaté vratky transferů",null,null,null,0,0,37028.12689,"x"]
[null,null,null,null,21,null,"Příjmy z vlastní činnosti a odvody přebytků organizací s přímým vztahem",null,null,1360,1331.221,19064.80659,14.321293451650778,null,null,null,23,"Příjmy z prodeje nekapitálového majetku a ostatní nedaňové příjmy",null,null,null,{"$f":"SUM(V30:V34)","v":1088.3499999999999},{"$f":"SUM(W30:W34)","v":1088.3499999999999},{"$f":"SUM(X30:X34)","v":15553.02188},{"$f":"X29/W29","v":14.29045976018744},null,null,23,"Příjmy z prodeje nekapitálového majetku a ostatní nedaňové příjmy",null,null,null,{"$f":"SUM(AG30:AG34)","v":846.35},{"$f":"SUM(AH30:AH34)","v":846.35},{"$f":"SUM(AI30:AI34)","v":10624.04782},{"$f":"AI29/AH29","v":12.552782914869734}]
[{"$f":"IF(COUNTBLANK(C30:IL30)=254,\"odstr\",IF(AND($A$1=\"TISK\",SUM(J29:M29)=0),\"odstr\",\"OK\"))","v":{"$error":"#REF!"}},"OK",null,null,2211,null,"Příjmy z poskytování služeb a výrobků",null,null,0,0,163.97262000000001,"x ",null,null,null,2322,"Přijaté pojistné náhrady",null,null,null,0,0,221.51400000000001,"x",null,null,2322,"Přijaté pojistné náhrady",null,null,null,0,0,6.5270000000000001,"x"]
[{"$f":"IF(COUNTBLANK(C31:IL31)=254,\"odstr\",IF(AND($A$1=\"TISK\",SUM(J30:M30)=0),\"odstr\",\"OK\"))","v":{"$error":"#REF!"}},"OK",null,null,2212,null,"Sankční platby přijaté od jiných subjektů",null,null,0,0,6.23719,"x ",null,null,null,2324,"Přijaté nekapitálové příspěvky a náhrady",null,null,null,1086.3499999999999,1086.3499999999999,1619.3379499999999,{"$f":"X31/W31","v":1.4906226814562527},null,null,2324,"Přijaté nekapitálové příspěvky a náhrady",null,null,null,846.35,846.35,5007.9837699999998,{"$f":"AI31/AH31","v":5.9171545696224959}]
[{"$f":"IF(COUNTBLANK(C32:IL32)=254,\"odstr\",IF(AND($A$1=\"TISK\",SUM(J31:M31)=0),\"odstr\",\"OK\"))","v":{"$error":"#REF!"}},"OK",null,null,2221,null,"Přijaté vratky transferů od jiných veřejných rozpočtů",null,null,0,0,1387.3312900000001,"x ",null,null,null,2328,"Neidentifikované příjmy",null,null,null,0,0,0,"x",null,null,2328,"Neidentifikované příjmy",null,null,null,0,0,0,0]
[null,null,null,null,null,null,null,null,null,null,null,null,null,null,null,null,2329,"Ostatní nedaňové příjmy jinde nazařazené",null,null,null,2,2,13712.16993,{"$f":"X33/W33","v":6856.084965},null,null,2329,"Ostatní nedaňové příjmy jinde nazařazené",null,null,null,0,0,5609.5370499999999,"x"]
[null,null,null,null,null,null,null,null,null,null,null,null,null,null,null,null,2391,"Dočasné zatřídění příjmů",null,null,null,0,0,0,"x",null,null,2391,"Dočasné zatřídění příjmů",null,null,null,0,0,0,0]
[null,null,null,null,null,null,null,null,null,null,null,null,null,null,null,null,24,"Přijaté splátky půjčených prostředků",null,null,null,{"$f":"SUM(V36)","v":88000},{"$f":"SUM(W36)","v":88000},{"$f":"SUM(X36)","v":88000},{"$f":"X35/W35","v":1},null,null,24,"Přijaté splátky půjčených prostředků",null,null,null,{"$f":"AG36","v":88000},{"$f":"AH36","v":88000},{"$f":"AI36","v":88000},{"$f":"AI35/AH35","v":1}]
[{"$f":"IF(COUNTBLANK(C36:IL36)=254,\"odstr\",IF(AND($A$1=\"TISK\",SUM(J32:M32)=0),\"odstr\",\"OK\"))","v":{"$error":"#REF!"}},"OK",null,null,2222,null,"Ostatní příjmy z finančního vypořádání předchozích let od jiných veřejných rozpočtů",null,null,0,0,5359.9221399999997,"x ",null,null,null,2452,"Splátky půjčených prostředků od vysokých škol",null,null,null,88000,88000,88000,{"$f":"X36/W36","v":1},null,null,2452,"Splátky půjčených prostředků od vysokých škol",null,null,null,88000,88000,88000,{"$f":"AI36/AH36","v":1}]
[null,null,null,null,22,null,"Přijaté sankční platby a vratky transferů",null,null,0,0,6917.46324,"x ",null,null,null,3,"Kapitálové příjmy",null,null,null,0,0,{"$f":"SUM(X38:X39)","v":123},"x",null,null,3,"Kapitálové příjmy",null,null,null,0,{"$f":"SUM(AH38:AH39)","v":0},{"$f":"SUM(AI38:AI39)","v":302.89999999999998},"x"]
[null,null,null,null,2322,null,"Přijaté pojistné náhrady",null,null,0,0,90.765000000000001,"x ",null,null,null,3111,"Příjmy z prodeje pozemků",null,null,null,null,null,null,null,null,null,3111,"Příjmy z prodeje pozemků",null,null,null,null,null,null,"x"]
[null,null,null,null,2324,null,"Přijaté nekapitálové příspěvky a náhrady",null,null,390,418.779,2370.39743,5.6602585850770932,null,null,null,3113,"Příjmy z prodeje ostatního hmotného dlouhodobého majetku",null,null,null,0,0,123,"x",null,null,3113,"Příjmy z prodeje ostatního hmotného dlouhodobého majetku",null,null,null,0,0,302.89999999999998,"x"]
[null,null,null,null,2328,null,"Neidentifikované příjmy",null,null,0,0,0,"x ",null,null,null,4,"Přijaté transfery",null,null,null,{"$f":"SUM(V41:V50)","v":10058486.744000001},{"$f":"SUM(W43:W50)","v":15217271.993000001},{"$f":"SUM(X43:X49)","v":14649055.947069999},{"$f":"X40/W40","v":0.96265979564593551},null,null,4,"Přijaté transfery",null,null,null,{"$f":"SUM(AG41:AG50)","v":12188326.255999999},{"$f":"SUM(AH41:AH50)","v":14051180.99},{"$f":"SUM(AI41:AI50)","v":13340592.442220001},{"$f":"AI40/AH40","v":0.94942855349413591}]
[null,null,null,null,2329,null,"Ostatní nedaňové příjmy jinde nezařazené",null,null,2,2,4316.2980700000007,2158.1490350000004,null,null,"v tom",null,"       příjmy z rozpočtu Evropské unie bez SZP",null,null,null,null,null,null,null,null,"v tom",null,"       příjmy z rozpočtu Evropské unie bez SZP",null,null,null,null,null,null,"x"]
[null,null,null,null,2391,null,"Dočasné zatřídění příjmů",null,null,0,0,0,"x ",null,null,null,null,"       příjmy z prostředků finančních mechanizmů",null,null,null,null,null,null,null,null,null,null,"       příjmy z prostředků finančních mechanizmů",null,null,null,null,null,null,"x"]
[{"$f":"IF(COUNTBLANK(C43:IL43)=254,\"odstr\",IF(AND($A$1=\"TISK\",SUM(J36:M36)=0),\"odstr\",\"OK\"))","v":{"$error":"#REF!"}},"OK",null,null,23,null,"Příjmy z prodeje nekapitálového majetku a ostatní nedaňové příjmy",null,null,392,420.779,6777.460500000001,16.106936182651705,null,null,null,4118,"NIV převody z Národního fondu",null,null,null,6816886.9910000004,11466689.467,8513732.2496499997,{"$f":"X43/W43","v":0.74247517334028101},null,null,4118,"NIV převody z Národního fondu",null,null,null,11942124.952,9376846.8509999998,9240114.86252,{"$f":"AI43/AH43","v":0.98541812715375443}]
[{"$f":"IF(COUNTBLANK(C44:IL44)=254,\"odstr\",IF(AND($A$1=\"TISK\",SUM(J37:M37)=0),\"odstr\",\"OK\"))","v":{"$error":"#REF!"}},"OK",null,null,2452,null,"Splátky půjčených prostředků od vysokých škol",null,null,88000,88000,88000,1,null,null,null,4122,"NIV přijaté transfery krajů",null,null,null,0,0,2470.4055400000002,"x",null,null,4122,"NIV přijaté transfery krajů",null,null,null,0,0,5185.4644500000004,"x"]
[null,null,null,null,null,null,null,null,null,null,null,null,null,null,null,null,4132,"Převod z ostatních vlastních fondů",null,null,null,0,0,72.57289999999999,"x",null,null,4132,"Převod z ostatních vlastních fondů",null,null,null,0,0,1634.78872,"x"]
[{"$f":"IF(COUNTBLANK(C46:IL46)=254,\"odstr\",IF(AND($A$1=\"TISK\",SUM(J38:M38)=0),\"odstr\",\"OK\"))","v":{"$error":"#REF!"}},"OK",null,null,24,null,"Přijaté splátky půjčených prostředků",null,null,88000,88000,88000,1,null,null,null,4135,"Převody z rezervních fondů (RF) OSS",null,null,null,0,0,180.94539,"x",null,null,4135,"Převody z rezervních fondů (RF) OSS",null,null,null,0,0,5653.33565,"x"]
[null,null,null,null,null,null,null,null,null,null,null,null,null,null,null,null,4151,"Neinvestiční přijaté transfery od cizích států",null,null,null,584,584,0,{"$f":"X47/W47","v":0},null,null,4151,"Neinvestiční přijaté transfery od cizích států",null,null,null,220.863,0,0,0]
[{"$f":"IF(COUNTBLANK(C48:IL48)=254,\"odstr\",IF(AND($A$1=\"TISK\",SUM(J39:M39)=0),\"odstr\",\"OK\"))","v":{"$error":"#REF!"}},"OK",null,null,2,null,"Nedaňové příjmy",null,null,89752,89752,120759.73033000001,1.345482332761387,null,null,null,4153,"NIV převody přijaté od EU",null,null,null,9881.5,9881.5,15853.7088,{"$f":"X48/W48","v":1.6043828163740324},null,null,4153,"NIV převody přijaté od EU",null,null,null,11250,11250,5522.0312199999998,{"$f":"AI48/AH48","v":0.49084721955555555}]
[{"$f":"IF(COUNTBLANK(C49:IL49)=254,\"odstr\",IF(AND($A$1=\"TISK\",SUM(J40:M40)=0),\"odstr\",\"OK\"))","v":{"$error":"#REF!"}},"OK",null,null,3111,null,"Příjmy z prodeje pozemků",null,null,0,0,107.333,"x ",null,null,null,4218,"INV převody z NF",null,null,null,3231134.253,3740117.0260000001,6116746.0647900002,{"$f":"X49/W49","v":1.6354424266055039},null,null,4218,"INV převody z NF",null,null,null,234730.44099999999,4663084.1390000004,4082481.9596599997,{"$f":"AI49/AH49","v":0.8754896626281955}]
[null,null,null,null,null,null,null,null,null,null,null,null,null,null,null,null,4233,"INV převody přijaté od EU",null,null,null,null,null,null,null,null,null,4233,"INV převody přijaté od EU",null,null,null,null,null,null,"x"]
[{"$f":"IF(COUNTBLANK(C51:IL51)=254,\"odstr\",IF(AND($A$1=\"TISK\",SUM(J41:M41)=0),\"odstr\",\"OK\"))","v":{"$error":"#REF!"}},null,null,null,null,null,null,null,null,null,null,null,null,null,null,null,"Příjmy kapitoly 333-MŠMT celkem",null,null,null,null,{"$f":"SUM(V40,V37,V16,V14)","v":10151242.744000001},{"$f":"SUM(W14+W16+W37+W40)","v":15310027.993000001},{"$f":"SUM(X14,X16,X37,X40)","v":14807842.52361},{"$f":"X51/W51","v":0.96719891892950105},null,null,"Příjmy kapitoly 333-MŠMT celkem",null,null,null,null,{"$f":"SUM(AG14,AG16,AG37,AG40)","v":12282724.855999999},{"$f":"SUM(AH14,AH16,AH37,AH40)","v":14145579.59},{"$f":"SUM(AI14,AI16,AI37,AI40)","v":13488337.31879},{"$f":"AI51/AH51","v":0.95353726816010942}]
[{"$f":"IF(COUNTBLANK(C52:IL52)=254,\"odstr\",IF(AND($A$1=\"TISK\",SUM(J42:M42)=0),\"odstr\",\"OK\"))","v":{"$error":"#REF!"}},null,null,null,3113,null,"Příjmy z prodeje ostatního hmotného dlouhodobého majetku",null,null,0,0,0,"x ",null,null,null,"Příjmy po konsolidaci (- RF)",null,null,null,null,null,null,null,null,null,null,"Příjmy po konsolidaci (- RF)"]
[{"$f":"IF(COUNTBLANK(C53:IL53)=254,\"odstr\",IF(AND($A$1=\"TISK\",SUM(J43:M43)=0),\"odstr\",\"OK\"))","v":{"$error":"#REF!"}},"OK",null,null,31,null,"Příjmy z prodeje dlouhodobého majetku a ostatní kapitálové příjmy",null,null,0,0,107.333,"x ",null,null,null,null,null,null,null,null,null,null,null,"Zdroj: Závěrečný účet – kapitola 333-MŠMT; monitor.statnipokladna.cz",null,"Zdroj: Závěrečný účet – kapitola 333-MŠMT_přílohová tabulka k Závěrečnému účtu_bilance příjmů a výdajů státního rozpočtu v druhovém členění rozpočtové skladb; monitor.statnipokladna.cz"]
[{"$f":"IF(COUNTBLANK(C54:IL54)=254,\"odstr\",IF(AND($A$1=\"TISK\",SUM(J44:M44)=0),\"odstr\",\"OK\"))","v":{"$error":"#REF!"}},"OK",null,null,3,null,"Kapitálové příjmy",null,null,0,0,107.333,"x "]
[{"$f":"IF(COUNTBLANK(C55:IL55)=254,\"odstr\",IF(AND($A$1=\"TISK\",SUM(J46:M46)=0),\"odstr\",\"OK\"))","v":{"$error":"#REF!"}},"OK",null,null,4118,null,"Neinvestiční převody z Národního fondu",null,null,8543882.7630000003,4916646.1260000002,1995659.5159799999,0.40589854645560874]
[{"$f":"IF(COUNTBLANK(C56:IL56)=254,\"odstr\",IF(AND($A$1=\"TISK\",SUM(J48:M48)=0),\"odstr\",\"OK\"))","v":{"$error":"#REF!"}},"OK",null,null,4122,null,"Neinvestiční přijaté transfery od krajů",null,null,0,0,6884.6094899999998,"x "]
[null,null,null,null,4132,null,"Převody z ostatních vlastních fondů",null,null,0,0,498.0421,"x "]
[{"$f":"IF(COUNTBLANK(C58:IL58)=254,\"odstr\",IF(AND($A$1=\"TISK\",SUM(J49:M49)=0),\"odstr\",\"OK\"))","v":{"$error":"#REF!"}},"OK",null,null,4135,null,"Převody z fondů organizačních složek státu",null,null,0,0,160,"x "]
[{"$f":"IF(COUNTBLANK(C59:IL59)=254,\"odstr\",IF(AND($A$1=\"TISK\",SUM(J52:M52)=0),\"odstr\",\"OK\"))","v":{"$error":"#REF!"}},"OK",null,null,4153,null,"Neinvestiční transfery přijaté od Evropské unie",null,null,11210.751,14781.436,10197.091480000001,0.68985797320368614]
[{"$error":"#REF!"},"OK",null,null,"4159",null,"Neinvestiční transfery přijaté od Evropské unie",null,null,0,0,0,"x "]
[{"$error":"#REF!"},"OK",null,null,41,null,"Neivestiční přijaté dotace",null,null,8555093.5140000004,4931427.5619999999,2013399.2590499998,0.40827919172221228]
[{"$error":"#REF!"},"OK",null,null,4218,null,"Investiční převody z Národního fondu",null,null,0,3623665.952,1139444.65552,0.31444528017024015]
[{"$error":"#REF!"},"OK",null,null,4233,null,"Investiční transfery přijaté od Evropské unie",null,null,0,0,45.825000000000003,"x "]
[{"$error":"#REF!"},null,null,null,42,null,"Investiční přijaté transfery",null,null,0,3623665.952,1139490.48052,0.31445792620345814]
[{"$error":"#REF!"},null,null,null,4,null,"Přijaté dotace",null,null,8555093.5140000004,8555093.5140000004,3152889.7395699997,0.36853948287186422]
[{"$error":"#REF!"},"OK",null,null,"Příjmy kapitoly 333-MŠMT celkem",null,null,null,null,8645045.5140000004,8645045.5140000004,3274552.8891199999,0.37877798142498015]
[{"$error":"#REF!"},"OK",null,null,null,null,null,null,null,null,null,null,"Zdroj: Závěrečný účet – kapitola 333-MŠMT"]
[null,null,null,""]
[]
[]
[]
[{"$f":"IF(COUNTBLANK(C72:IL72)=254,\"odstr\",IF(AND($A$1=\"TISK\",SUM(J61:M61)=0),\"odstr\",\"OK\"))","v":{"$error":"#REF!"}},"OK"]
[]
[]
[{"$f":"IF(COUNTBLANK(C75:IL75)=254,\"odstr\",IF(AND($A$1=\"TISK\",SUM(J62:M62)=0),\"odstr\",\"OK\"))","v":{"$error":"#REF!"}},"OK"]
[{"$f":"IF(COUNTBLANK(C76:IL76)=254,\"odstr\",IF(AND($A$1=\"TISK\",SUM(J63:M63)=0),\"odstr\",\"OK\"))","v":{"$error":"#REF!"}},"OK"]
["konst","stop"]
[{"$f":"IF(COUNTBLANK(D66:E66)=2,\"odstr\",\"OK\")","v":"OK"}]
["stop"]

{"sheet":"B5","index":5,"n_rows":69,"n_cols":57,"rows_kept":69,"cut":false,"hidden":false,"merged":[[42,42,42,43],[43,42,43,43],[44,42,44,43],[49,42,49,43],[50,42,50,43],[48,42,48,44],[46,42,46,44],[45,42,45,44],[62,41,62,52],[47,42,47,44],[51,42,51,43],[58,42,58,43],[57,42,57,44],[56,42,56,44],[55,42,55,44],[54,42,54,44],[53,42,53,44],[52,42,52,44],[59,42,59,44],[60,40,60,44],[39,42,39,44],[40,42,40,44],[37,42,37,44],[36,42,36,44],[35,42,35,44],[34,42,34,44],[33,42,33,44],[32,42,32,44],[41,42,41,43],[23,42,23,43],[25,42,25,43],[26,42,26,43],[27,42,27,43],[29,42,29,43],[30,42,30,43],[24,42,24,44],[22,42,22,44],[38,42,38,43],[13,42,13,43],[17,42,17,43],[14,42,14,44],[21,42,21,44],[20,42,20,44],[19,42,19,44],[18,42,18,44],[16,42,16,44],[15,42,15,44],[8,40,12,41],[8,45,9,48],[8,49,9,52],[8,53,9,56],[10,45,12,45],[10,46,12,46],[10,47,12,47],[10,48,12,48],[10,49,12,49],[10,50,12,50],[10,51,12,51],[10,52,12,52],[10,53,12,53],[10,54,12,54],[10,55,12,55],[10,56,12,56],[8,42,12,44],[60,23,60,25],[62,23,62,34],[63,23,63,38],[51,24,51,25],[52,24,52,25],[53,24,53,25],[54,24,54,25],[55,24,55,25],[56,24,56,25],[57,24,57,25],[58,24,58,25],[59,24,59,25],[41,24,41,25],[42,24,42,25],[43,24,43,25],[44,24,44,25],[45,24,45,25],[46,24,46,25],[48,24,48,25],[49,24,49,25],[50,24,50,25],[32,24,32,25],[33,24,33,25],[34,24,34,25],[35,24,35,25],[36,24,36,25],[37,24,37,25],[38,24,38,25],[39,24,39,25],[40,24,40,25],[22,24,22,25],[23,24,23,25],[24,24,24,25],[25,24,25,25],[26,24,26,25],[27,24,27,25],[29,24,29,25],[30,24,30,25],[31,24,31,25],[13,24,13,25],[14,24,14,25],[15,24,15,25],[16,24,16,25],[17,24,17,25],[18,24,18,25],[19,24,19,25],[20,24,20,25],[21,24,21,25],[8,22,12,23],[8,24,12,24],[8,27,9,30],[8,31,9,34],[8,35,9,38],[10,27,12,27],[10,28,12,28],[10,29,12,29],[10,30,12,30],[10,31,12,31],[10,32,12,32],[10,33,12,33],[10,34,12,34],[10,35,12,35],[10,36,12,36],[10,37,12,37],[10,38,12,38],[64,4,64,20],[65,4,65,20],[8,3,12,4],[8,6,12,6],[10,16,12,16],[10,9,12,9],[10,10,12,10],[47,6,47,7],[48,6,48,7],[49,6,49,7],[8,17,9,20],[8,9,9,12],[8,13,9,16],[10,20,12,20],[10,12,12,12],[10,13,12,13],[10,11,12,11],[10,15,12,15],[10,14,12,14],[10,19,12,19],[10,17,12,17],[10,18,12,18],[13,6,13,7],[14,6,14,7],[15,6,15,7],[16,6,16,7],[41,6,41,7],[39,6,39,7],[40,6,40,7],[27,6,27,7],[33,6,33,7],[30,6,30,7],[31,6,31,7],[34,6,34,7],[32,6,32,7],[17,6,17,7],[18,6,18,7],[19,6,19,7],[20,6,20,7],[26,6,26,7],[21,6,21,7],[22,6,22,7],[23,6,23,7],[24,6,24,7],[25,6,25,7],[62,4,62,7],[35,6,35,7],[36,6,36,7],[37,6,37,7],[59,6,59,7],[60,6,60,7],[61,6,61,7],[38,6,38,7],[42,6,42,7],[50,6,50,7],[45,6,45,7],[58,6,58,7],[51,6,51,7],[52,6,52,7],[53,6,53,7],[54,6,54,7],[55,6,55,7],[56,6,56,7],[57,6,57,7],[43,6,43,7],[44,6,44,7]]}
[{"$f":"IF(#REF!=\"\",\"ŠABLONA\",IF(#REF!=\"T\",\"TISK\",\"ELEKTRO\"))","v":{"$error":"#REF!"}},0,{"$f":"CONCATENATE(D1,F1,IF(G1<>\"\",\".\",\"\"),G1,IF(H1<>\"\",\".\",\"\"),H1,IF(I1<>\"\",\".\",\"\"),I1,\"\")","v":{"$error":"#REF!"}},{"$f":"IF(#REF!=\"\",\" ?\",#REF!)","v":{"$error":"#REF!"}},{"$f":"CONCATENATE(C1,U1)","v":{"$error":"#REF!"}},5]
["konst"]
["konst","47x11",null,"Tab. B5:",null,null,null,"Příjmy kapitoly 700-Obce a DSO; KÚ (část: vzdělávání) – podle položek",null,null,null,null,null,null,null,null,null,null,null,null,null,null,"Tab. B5:",null,null,"Příjmy kapitoly 700-Obce a DSO; KÚ (část: vzdělávání) – podle položek",null,null,null,null,null,null,null,null,null,null,null,null,null,null,"Tab. B5:",null,null,"Příjmy kapitoly 700-Obce a DSO; KÚ (část: vzdělávání) – podle položek"]
["konst",{"$f":"COUNTA(Datova_oblast)","v":517},null,{"$f":"IF(D1=\" ?\",\"\",CONCATENATE(\"Tab. \",E1,\":\"))","v":{"$error":"#REF!"}},null,null,null,{"$f":"IF(H3=\"Zadejte název tabulky\",\"\",H3)","v":"Příjmy kapitoly 700-Obce a DSO; KÚ (část: vzdělávání) – podle položek"},null,null,null,null,null,null,null,null,null,null,null,null,null,null,{"$f":"IF(W1=\" ?\",\"\",CONCATENATE(\"Tab. \",X1,\":\"))","v":"Tab. :"},null,null,{"$f":"IF(Z3=\"Zadejte název tabulky\",\"\",Z3)","v":"Příjmy kapitoly 700-Obce a DSO; KÚ (část: vzdělávání) – podle položek"},null,null,null,null,null,null,null,null,null,null,null,null,null,null,{"$f":"IF(AO1=\" ?\",\"\",CONCATENATE(\"Tab. \",AP1,\":\"))","v":"Tab. :"},null,null,{"$f":"IF(AR3=\"Zadejte název tabulky\",\"\",AR3)","v":"Příjmy kapitoly 700-Obce a DSO; KÚ (část: vzdělávání) – podle položek"}]
[{"$f":"IF(D5=\"\",\"odstr\",\"OK\")","v":"odstr"},0]
[{"$f":"IF(COUNTBLANK(C6:ID6)=254,\"odstr\",\"OK\")","v":"OK"},"Řádky pro"]
[{"$f":"IF(COUNTBLANK(C7:ID7)=254,\"odstr\",\"OK\")","v":"OK"},"ročenku PaM"]
["konst",null,null,"(podle stavu k: 31. 12. 2017)",null,null,null,null,null,null,null,null,null,null,null,null,null,null,null,null,"v tis. Kč",null,"(podle stavu k: 31. 12. 2019)",null,null,null,null,null,null,null,null,null,null,null,null,null,null,null,"v tis. Kč",null,"(podle stavu k: 31. 12. 2020)",null,null,null,null,null,null,null,null,null,null,null,null,null,null,null,"v tis. Kč"]
["konst",null,null,"Položka",null,null,"Popis položky",null,null,"Celkem 1)",null,null,null,"Obce a DSO1)",null,null,null,"Krajské úřady1)",null,null,null,null,"Položka",null,"Popis položky",null,null,"Celkem 1)",null,null,null,"Obce a DSO1)",null,null,null,"Krajské úřady1)",null,null,null,null,"Položka",null,"Popis položky",null,null,"Celkem 1)",null,null,null,"Obce a DSO1)",null,null,null,"Krajské úřady1)"]
["konst"]
["konst",null,null,null,null,null,null,null,null,"schválený\nrozpočet","rozpočet po\nzměnách","skutečnost","% plnění\nrozpočtu","schválený\nrozpočet","rozpočet po\nzměnách","skutečnost","% plnění\nrozpočtu","schválený\nrozpočet","rozpočet po\nzměnách","skutečnost","% plnění\nrozpočtu",null,null,null,null,null,null,"schválený\nrozpočet","rozpočet po\nzměnách","skutečnost","% plnění\nrozpočtu","schválený\nrozpočet","rozpočet po\nzměnách","skutečnost","% plnění\nrozpočtu","schválený\nrozpočet","rozpočet po\nzměnách","skutečnost","% plnění\nrozpočtu",null,null,null,null,null,null,"schválený\nrozpočet","rozpočet po\nzměnách","skutečnost","% plnění\nrozpočtu","schválený\nrozpočet","rozpočet po\nzměnách","skutečnost","% plnění\nrozpočtu","schválený\nrozpočet","rozpočet po\nzměnách","skutečnost","% plnění\nrozpočtu"]
["konst"]
["konst"]
[null,null,null,null,2111,null,"Příjmy z poskytování služeb a výrobků",null,null,31472.244999999999,35823.962650000009,34397.465230000009,0.96018035654132194,31472.244999999999,34668.062650000007,33329.465230000009,0.96138816773483593,0,1155.9000000000001,1068,0.92395535946016083,null,null,2,"Nedaňové příjmy",null,null,{"$f":"AF14+AJ14","v":1058367.4135199999},1547220.5812200001,1553281.1589999998,{"$f":"AD14/AC14","v":1.0039170741738848},{"$f":"SUM(AF15+AF32+AF40)","v":635187.27352000005},{"$f":"SUM(AG15+AG32+AG40)","v":1053853.4300500001},{"$f":"SUM(AH15+AH32+AH40)","v":1054209.7357699999},{"$f":"AH14/AG14","v":1.0003380979838752},{"$f":"SUM(AJ15,AJ32,AJ40)","v":423180.14},{"$f":"SUM(AK15+AK32+AK40)","v":493367.15116999991},{"$f":"SUM(AL15+AL32+AL40)","v":499071.4232299999},{"$f":"AL14/AK14","v":1.0115619210692737},null,null,2,"Nedaňové příjmy",null,null,{"$f":"SUM(AX14,BB14)","v":1174698.7248799999},{"$f":"SUM(AY14,BC14)","v":1693412.7352500001},{"$f":"SUM(AZ14,BD14)","v":1698116.49967},{"$f":"AV14/AU14","v":1.0027776833857964},{"$f":"SUM(AX15,AX32,AX40)","v":705045.06487999996},{"$f":"SUM(AY15,AY32,AY40)","v":1087479.8810400001},{"$f":"SUM(AZ15,AZ32,AZ40)","v":1091261.3526400002},{"$f":"AZ14/AY14","v":1.0034772795947118},{"$f":"SUM(BB15,BB32,BB40)","v":469653.66},{"$f":"SUM(BC15,BC32,BC40)","v":605932.85421000002},{"$f":"SUM(BD15,BD32,BD40)","v":606855.14702999988},{"$f":"BD14/BC14","v":1.0015221039981441}]
[null,null,null,null,2112,null,"Příjmy z prodeje zboží (jinak nakoupeného za účelem prodeje)",null,null,316.78100000000001,320.161,335.84899999999999,1.0490003467005662,316.78100000000001,320.161,335.84899999999999,1.0490003467005662,0,0,0,"x ",null,null,21,"Příjmy z vlastní činnosti a odvody přebytků organizací s přímým vztahem",null,null,906560.86952000007,1140855.2779700002,1133366.26706,{"$f":"AD15/AC15","v":0.99343561707202177},{"$f":"SUM(AF16:AF31)","v":484220.72952000005},{"$f":"SUM(AG16:AG31)","v":664182.40737000015},{"$f":"SUM(AH16:AH31)","v":650996.30189999996},{"$f":"AH15/AG15","v":0.98014686127834383},{"$f":"SUM(AJ16:AJ31)","v":422340.14},{"$f":"SUM(AK16:AK31)","v":476672.87059999991},{"$f":"SUM(AL16:AL31)","v":482369.96515999991},{"$f":"AL15/AK15","v":1.0119517910738844},null,null,21,"Příjmy z vlastní činnosti a odvody přebytků organizací s přímým vztahem",null,null,{"$f":"SUM(AX15,BB15)","v":935401.1031699999},{"$f":"SUM(AY15,BC15)","v":1252124.4599299999},1221172.50208,{"$f":"AV15/AU15","v":0.97528044628109078},{"$f":"SUM(AX16:AX31)","v":508587.44316999993},{"$f":"SUM(AY16:AY31)","v":704578.58593000006},{"$f":"SUM(AZ16:AZ31)","v":677052.70520000008},{"$f":"AZ15/AY15","v":0.96093284513654709},{"$f":"SUM(BB16:BB31)","v":426813.66},{"$f":"SUM(BC16:BC31)","v":547545.87399999995},{"$f":"SUM(BD16:BD31)","v":544119.79687999992},{"$f":"BD15/BC15","v":0.99374284916993083}]
[{"$f":"IF(COUNTBLANK(C16:ID16)=254,\"odstr\",IF(AND($A$1=\"TISK\",SUM(J14:U14)=0),\"odstr\",\"OK\"))","v":{"$error":"#REF!"}},"OK",null,null,2113,null,"Příjmy ze školného",null,null,0,14.5,14.565,1.0044827586206897,0,14.5,14.565,1.0044827586206897,0,0,0,"x ",null,null,2111,"Příjmy z poskytování služeb a výrobků",null,null,34682.263999999996,39735.899770000004,37957.375870000003,{"$f":"AD16/AC16","v":0.95524138347704513},34682.263999999996,39130.899770000004,37231.375870000003,{"$f":"AH16/AG16","v":0.95145718827921544},0,605,726,{"$f":"AL16/AK16","v":1.2},null,null,2111,"Příjmy z poskytování služeb a výrobků",null,null,38172.977590000002,47793.699089999995,39757.853620000002,{"$f":"AV16/AU16","v":0.83186391463720466},38172.977590000002,47391.199089999995,39334.353620000002,{"$f":"AZ16/AY16","v":0.82999279138940241},0,402.5,423.5,{"$f":"BD16/BC16","v":1.0521739130434782}]
[{"$error":"#REF!"},"OK",null,null,2119,null,"Ostatní příjmy z vlastní činnosti",null,null,705.6,2203.8559999999998,2265.5401200000001,1.0279891789663209,705.6,2094.29,2072.75758,0.98971851080795881,0,109.566,192.78254000000001,1.7595106146067212,null,null,2112,"Příjmy z prodeje zboží (jinak nakoupeného za účelem prodeje)",null,null,302.51599999999996,304.22399999999999,629.92566999999997,{"$f":"AD17/AC17","v":2.0705982105290839},302.51599999999996,304.22399999999999,629.92566999999997,{"$f":"AH17/AG17","v":2.0705982105290839},null,null,null,null,null,null,2112,"Příjmy z prodeje zboží (jinak nakoupeného za účelem prodeje)",null,null,312.76,312.76,349.33109999999999,{"$f":"AV17/AU17","v":1.1169302340452743},312.76,312.76,349.33109999999999,{"$f":"AZ17/AY17","v":1.1169302340452743},0,0,0,0]
[{"$error":"#REF!"},"OK",null,null,2122,null,"Odvody příspěvkových organizací",null,null,687422.80403,903579.66990999994,885012.06365999999,0.97945105797715726,305182.80403,474885.21791000001,456173.87004999997,0.96059816740064075,382240,428694.45199999999,428838.19361000002,1.0003353008403291,null,null,2113,"Příjmy ze školného",null,null,{"$f":"AF18+AJ18","v":432},{"$f":"AG18+AK18","v":0},0,"x",432,0,0,"x",null,null,null,null,null,null,2113,"Příjmy ze školného",null,null,100,0,0,0,100,0,0,0,null,null,null,0]
[{"$error":"#REF!"},"OK",null,null,2123,null,"Ostatní odvody příspěvkových organizací",null,null,2456,3626.3378400000001,10194.34297,2.8111950457434487,2456,2381.2925399999999,2403.4095400000001,1.0092878130798664,0,1245.0453,7790.93343,6.2575501710660646,null,null,2119,"Ostatní příjmy z vlastní činnosti",null,null,711.4,3097.4025000000001,{"$f":"AH19+AL19","v":3085.1497900000004},{"$f":"AD19/AC19","v":0.99604419832424107},711.4,3076.86,2958.8420400000005,{"$f":"AH19/AG19","v":0.96164337668922228},0,20.5425,126.30775,{"$f":"AL19/AK19","v":6.1486065474017275},null,null,2119,"Ostatní příjmy z vlastní činnosti",null,null,1637.1,{"$f":"SUM(AY19,BC19)","v":3157.7570000000001},2844.1406299999999,{"$f":"AV19/AU19","v":0.90068381765918015},1637.1,3156.547,2761.9369699999997,0.87498680361800396,0,1.21,82.203659999999999,{"$f":"BD19/BC19","v":67.936909090909097}]
[{"$error":"#REF!"},"OK",null,null,2124,null,"Odvody školských právnických osob zřízených státem, kraji a obcemi",null,null,2822.0590000000002,3053.0315000000001,3090.7345,1.0123493648853608,2822.0590000000002,3053.0315000000001,3052.9814999999999,0.99998362283520492,0,0,37.753,"x ",null,null,2122,"Odvody příspěvkových organizací",null,null,774404.54752000002,997887.33623000002,988337.26960999984,0.99042971458473439,368694.40752000001,538637.83342000004,527966.48818999995,0.98018827388665963,405710.14,459249.50280999992,460370.7814199999,{"$f":"AL20/AK20","v":1.0024415456154863},null,null,2122,"Odvody příspěvkových organizací",null,null,792723.61257999996,1099710.9750099997,1080634.7196599999,0.98265339186068745,382549.95257999992,570766.5820099999,553689.83006000007,0.97008102350725811,410173.66,528944.39299999992,526944.88959999999,0.99621982305425449]
[{"$error":"#REF!"},"OK",null,null,2129,null,"Ostatní odvody přebytků organizací s přímým vztahem",null,null,0,1076.0360000000001,1076.0371499999999,1.000001068737477,0,0,0,"x ",0,1076.0360000000001,1076.0371499999999,1.000001068737477,null,null,2123,"Ostatní odvody příspěvkových organizací",null,null,2350,2966.6270500000001,8048.8040900000005,2.7131162611087229,2350,2777.0270500000001,2413.88627,0.86923397811339287,0,189.60000000000002,5634.9178200000006,{"$f":"AL21/AK21","v":29.720030696202532},null,null,2123,"Ostatní odvody příspěvkových organizací",null,null,{"$f":"SUM(BB21)","v":0},4915.8574700000008,5453.3224700000001,1.1093329095239206,5033,3356.8764700000002,3755.1096399999997,1.1186320597611981,0,1558.9810000000002,1698.2128300000002,1.0893095105071837]
[{"$error":"#REF!"},"OK",null,null,2131,null,"Příjmy z pronájmu pozemků",null,null,602.1,602.1,607.16300000000001,1.0084089021757183,602.1,602.1,607.16300000000001,1.0084089021757183,0,0,0,"x ",null,null,2124,"Odvody školských právnických osob zřízených státem, kraji a obcemi",null,null,3325.998,3647.6570000000002,3647.6570000000002,1,3325.998,3647.6570000000002,3647.6570000000002,1,null,null,null,null,null,null,2124,"Odvody školských právnických osob zřízených státem, kraji a obcemi",null,null,{"$f":"SUM(AX22,BB22)","v":3479.5210000000002},{"$f":"SUM(AY22,BC22)","v":3698.0149999999999},3560.0149999999999,0.96268268246613387,3479.5210000000002,3698.0149999999999,3560.0149999999999,0.96268268246613387,0,0,0,0]
[{"$error":"#REF!"},"OK",null,null,2132,null,"Příjmy z pronájmu ostatních nemovitostí a jejich částí",null,null,83254.966,87581.11228999999,87302.194130000018,0.99681531608006513,66614.966,71200.678289999996,71118.311220000018,0.99884317014980539,16640,16380.433999999999,16183.88291,0.98800086188192582,null,null,2129,"Ostatní odvody přebytků organizací s přímým vztahem",null,null,0,20.733599999999999,33.54307,1.617812150326041,0,20.733599999999999,33.54307,1.617812150326041,null,null,null,null,null,null,2129,"Ostatní odvody přebytků organizací s přímým vztahem",null,null,2000,1124.3420000000001,24.341999999999999,2.1649996175540892E-2,2000,1124.3420000000001,24.341999999999999,2.1649996175540892E-2,0,0,0,0]
[{"$error":"#REF!"},"OK",null,null,2133,null,"Příjmy z pronájmu movitých věcí",null,null,1750.021,1770.1210000000001,1456.7352500000002,0.82295800682552211,1750.021,1770.1210000000001,1456.7352500000002,0.82295800682552211,0,0,0,"x ",null,null,2131,"Příjmy z pronájmu pozemků",null,null,592.6,712.6,711.04899999999998,0.99782346337356154,592.6,712.6,711.04899999999998,0.99782346337356154,null,null,null,null,null,null,2131,"Příjmy z pronájmu pozemků",null,null,592.6,627.601,616.23299999999995,0.98188658080532054,592.6,627.601,616.23299999999995,0.98188658080532054,0,0,0,0]
[{"$error":"#REF!"},"OK",null,null,2139,null,"Ostatní příjmy z pronájmu majetku",null,null,134.5,134,66.55,0.49664179104477607,134.5,134,66.55,0.49664179104477607,0,0,0,"x ",null,null,2132,"Příjmy z pronájmu ostatních nemovitostí a jejich částí",null,null,89406.743999999992,91690.419099999999,89566.170230000003,0.97683237909859222,72776.743999999992,75080.961599999995,74052.980089999997,0.98630835982793275,16630,16609.4575,15513.190140000001,{"$f":"AL25/AK25","v":0.93399740117941843},null,null,2132,"Příjmy z pronájmu ostatních nemovitostí a jejich částí",null,null,90969.182000000001,{"$f":"SUM(AY25,BC25)","v":90153.133369999996},{"$f":"SUM(AZ25,BD25)","v":87223.29634999999},0.96750155085596878,74329.182000000001,73514.343370000002,72252.305829999983,0.98283277137295311,16640,16638.79,14970.990519999999,0.89976437709713253]
[{"$error":"#REF!"},"OK",null,null,2141,null,"Příjmy z úroků (část)",null,null,0.02,0.72,1.1250199999999999,1.5625277777777777,0.02,0.72,0.80220999999999987,1.1141805555555555,0,0,0.32280999999999999,"x ",null,null,2133,"Příjmy z pronájmu movitých věcí",null,null,223.89999999999998,286.78848999999997,805.2449499999999,2.8078007942368957,223.89999999999998,286.78848999999997,805.2449499999999,2.8078007942368957,null,null,null,null,null,null,2133,"Příjmy z pronájmu movitých věcí",null,null,309.89999999999998,{"$f":"SUM(AY26,BC26)","v":448.5},506.04292000000004,1.1283008249721294,309.89999999999998,448.5,506.04292000000004,1.1283008249721294,0,0,0,0]
[{"$error":"#REF!"},"OK",null,null,2143,null,"Realizované kursové zisky",null,null,0,0,0,"x ",0,0,0,"x ",0,0,0,"x ",null,null,2139,"Ostatní příjmy z pronájmu majetku",null,null,128.9,108.30000000000001,109.67848000000001,1.0127283471837487,128.9,108.30000000000001,109.67848000000001,1.0127283471837487,null,null,null,null,null,null,2139,"Ostatní příjmy z pronájmu majetku",null,null,70.3,69.3,73.080279999999988,1.0545494949494949,70.3,69.3,73.080279999999988,1.0545494949494949,0,0,0,0]
[{"$error":"#REF!"},null,null,null,2149,null,"Ostatní příjmy z výnosů finančního majetku",null,null,0,0,0,"x ",0,0,0,"x ",0,0,0,"x ",null,null,2141,"Příjmy z úroků (část)",null,null,0,0.1,37.209069999999997,372.09069999999997,0,0.1,37.208829999999999,372.08829999999995,0,0,2.3999999999999998E-4,"x",null,null,2141,"Příjmy z úroků (část)",null,null,0.15,46.55,63.247099999999996,1.3586917293233083,0.15,46.55,63.246829999999996,1.3586859291084854,0,0,2.7E-4,0]
[null,null,null,null,null,null,null,null,null,null,null,null,null,null,null,null,null,null,null,null,null,null,null,2142,"Příjmy z podílu na zisku a dividend",null,null,0,398.42243999999999,398.42243999999999,1,0,398.42243999999999,398.42243999999999,1,null,null,null,null,null,null,2142,"Příjmy z podílu na zisku a dividend",null,null,0,65.96999000000001,65.96999000000001,1,0,65.96999000000001,65.96999000000001,1,0,0,0,0]
[null,null,null,null,null,null,null,null,null,null,null,null,null,null,null,null,null,null,null,null,null,null,null,2143,"Realizované kursové zisky",null,null,0,-1.23221,-1.23221,1,null,null,null,null,0,-1.23221,-1.23221,{"$f":"AL30/AK30","v":1},null,null,2143,"Realizované kursové zisky",null,null,0,0,0.90795999999999999,0,0,0,0.90795999999999999,0,0,0,0,0]
[{"$f":"IF(COUNTBLANK(C31:ID31)=254,\"odstr\",IF(AND($A$1=\"TISK\",SUM(J28:U28)=0),\"odstr\",\"OK\"))","v":{"$error":"#REF!"}},"OK",null,null,21,null,"Příjmy z vlastní činnosti a odvody přebytků organizací s přímým vztahem",null,null,810937.09603000002,1039785.6081899999,1025820.36503,0.9865691128536489,412057.09603000002,591124.17488999991,570632.45958000002,0.96533433044958261,398880,448661.43330000003,455187.90544999996,1.0145465414800563,null,null,2149,"Ostatní příjmy z výnosů finančního majetku",null,null,0,0,0,"x",null,null,null,null,null,null,null,null,null,null,2149,"Ostatní příjmy z výnosů finančního majetku",null,null,{"$f":"SUM(AX31,BB31)","v":0},0,0,0,0,0,0,0,0,0,0,0]
[null,null,null,null,2210,null,"Přijaté sankční platby",null,null,0,0,0,"x ",0,0,0,"x ",0,0,0,"x ",null,null,22,"Přijaté sankční platby a vratky transferů",null,null,{"$f":"AF32+AJ32","v":66898.094000000012},{"$f":"AG32+AK32","v":257530.71843999997},{"$f":"AH32+AL32","v":273595.06832999998},{"$f":"AD32/AC32","v":1.062378383391738},{"$f":"SUM(AF33:AF39)","v":66058.094000000012},{"$f":"SUM(AG33:AG39)","v":242376.35319999998},{"$f":"SUM(AH33:AH39)","v":258475.13433999999},{"$f":"AH32/AG32","v":1.0664205931290496},{"$f":"SUM(AJ33:AJ39)","v":840},{"$f":"SUM(AK33:AK39)","v":15154.365239999999},{"$f":"SUM(AL33:AL39)","v":15119.93399},{"$f":"AL32/AK32","v":0.99772796488307425},null,null,22,"Přijaté sankční platby a vratky transferů",null,null,101741.94471000001,305670.16501,340360.11481,{"$f":"AV32/AU32","v":1.1134881770318183},{"$f":"SUM(AX33:AX39)","v":100901.94471000001},{"$f":"SUM(AY33:AY39)","v":254210.05802999999},{"$f":"SUM(AZ33:AZ39)","v":285791.55919},{"$f":"AZ32/AY32","v":1.1242338773089497},{"$f":"SUM(BB33:BB39)","v":840},{"$f":"SUM(BC33:BC39)","v":51460.106980000004},{"$f":"SUM(BD33:BD39)","v":54568.555620000014},{"$f":"BD32/BC32","v":1.0604050170592942}]
[{"$f":"IF(COUNTBLANK(C33:ID33)=254,\"odstr\",IF(AND($A$1=\"TISK\",SUM(J31:U31)=0),\"odstr\",\"OK\"))","v":{"$error":"#REF!"}},"OK",null,null,2211,null,"Příjmy z poskytování služeb a výrobků",null,null,0,458.96625,1900.5192500000001,4.1408692904979398,0,0,0,"x ",0,458.96625,1900.5192500000001,4.1408692904979398,null,null,2210,"Přijaté sankční platby",null,null,null,null,null,"x",null,null,null,null,null,null,null,null,null,null,2210,"Přijaté sankční platby",null,null,{"$f":"SUM(AX33,BB33)","v":0},{"$f":"SUM(AY33,BC33)","v":0},0,0,0,0,0,0,0,0,0,0]
[{"$error":"#REF!"},"OK",null,null,2212,null,"Sankční platby přijaté od jiných subjektů",null,null,1349.1,16512.092430000004,19368.23432,1.1729727411657902,509.1,5837.7890800000005,11042.23272,1.891509365734056,840,10674.303350000002,8326.0015999999996,0.78000421451391466,null,null,2211,"Příjmy z poskytování služeb a výrobků",null,null,{"$f":"AF34+AJ34","v":0},382.63400000000001,382.63400000000001,{"$f":"AD34/AC34","v":1},null,null,null,null,0,382.63400000000001,382.63400000000001,{"$f":"AL34/AK34","v":1},null,null,2211,"Příjmy z poskytování služeb a výrobků",null,null,0,0,0,0,0,0,0,0,0,0,0,0]
[{"$error":"#REF!"},null,null,null,2221,null,"Přijaté vratky transferů od jiných veřejných rozpočtů",null,null,0,219.25239000000002,217.79730000000001,0.99336340187671379,0,219.25239000000002,217.79730000000001,0.99336340187671379,0,0,0,"x ",null,null,2212,"Sankční platby přijaté od jiných subjektů",null,null,892.6,17537.435879999997,19074.529909999997,{"$f":"AD35/AC35","v":1.0876464518825657},52.6,10478.018599999999,14174.17294,{"$f":"AH35/AG35","v":1.3527531760632685},840,7059.4172799999988,4900.3569699999989,{"$f":"AL35/AK35","v":0.69415884847651332},null,null,2212,"Sankční platby přijaté od jiných subjektů",null,null,966.15499999999997,29274.670700000002,26755.54955,{"$f":"AV35/AU35","v":0.91394877927696028},126.155,21676.444600000003,22665.83986,{"$f":"AZ35/AY35","v":1.0456437980608682},840,7598.2260999999999,4089.7096899999997,0.53824532676120285]
[{"$error":"#REF!"},null,null,null,2222,null,"Ostatní příjmy z finančního vypořádání předchozích let od jiných veřejných rozpočtů",null,null,0,88.1,88.045429999999996,0.99938059023836556,0,88.1,88.045429999999996,0.99938059023836556,0,0,0,"x ",null,null,2221,"Přijaté vratky transferů od jiných veřejných rozpočtů",null,null,null,null,null,"x",null,null,null,null,null,null,null,null,null,null,2221,"Přijaté vratky transferů od jiných veřejných rozpočtů",null,null,14500,0,0,0,14500,0,0,0,0,0,0,0]
[{"$error":"#REF!"},"OK",null,null,2226,null,"Příjmy z finančního vypořádání minulých let mezi obcemi",null,null,43,281.82400000000001,298.03282000000002,1.0575139803565345,43,281.82400000000001,298.03282000000002,1.0575139803565345,0,0,0,"x ",null,null,2222,"Ostatní příjmy z finančního vypořádání předchozích let od jiných veřejných rozpočtů",null,null,{"$f":"AF37+AJ37","v":0},129.08000000000001,129.06,{"$f":"AD37/AC37","v":0.99984505732878826},0,129.08000000000001,129.06,{"$f":"AH37/AG37","v":0.99984505732878826},null,null,null,null,null,null,2222,"Ostatní příjmy z finančního vypořádání předchozích let od jiných veřejných rozpočtů",null,null,0,38.521999999999998,38.521999999999998,{"$f":"AV37/AU37","v":1},0,38.521999999999998,38.521999999999998,{"$f":"AZ37/AY37","v":1},0,0,0,0]
[{"$error":"#REF!"},"OK",null,null,2229,null,"Ostatní přijaté vratky transferů",null,null,10561.7269,64597.497010000014,74410.651670000007,1.1519123048758511,10561.7269,61774.056180000014,71344.301879999999,1.1549233819471685,0,2823.4408300000005,3066.3497900000007,1.0860329557534947,null,null,2226,"Příjmy z finančního vypořádání minulých let mezi obcemi",null,null,150,50.53,49.283999999999999,0.97534138135760928,150,50.53,49.283999999999999,0.97534138135760928,null,null,null,null,null,null,2226,"Příjmy z finančního vypořádání minulých let mezi obcemi",null,null,0,0,0,0,0,0,0,0,null,null,null,0]
[{"$error":"#REF!"},"OK",null,null,22,null,"Přijaté sankční platby a vratky transferů",null,null,11953.8269,82157.732080000016,96283.28078999999,1.1719320671637503,11113.8269,68201.02165000001,82990.410149999996,1.2168499553554706,840,13956.710430000003,13292.870639999999,0.95243579829720637,null,null,2229,"Ostatní přijaté vratky transferů",null,null,65855.494000000006,239431.03855999999,253959.56041999999,1.0606793586469754,65855.494000000006,231718.72459999999,244122.61739999999,1.0535299545663044,0,7712.3139600000013,9836.9430200000006,{"$f":"AL39/AK39","v":1.2754852915764854},null,null,2229,"Ostatní přijaté vratky transferů",null,null,86275.789710000012,{"$f":"SUM(AY39,BC39)","v":276356.97230999998},{"$f":"SUM(AZ39,BD39)","v":313566.04326000001},{"$f":"AV39/AU39","v":1.1346413323281788},86275.789710000012,232495.09142999997,263087.19733,{"$f":"AZ39/AY39","v":1.1315817280779485},0,43861.880880000004,50478.84593000001,1.1508591268145363]
[{"$error":"#REF!"},"OK",null,null,2310,null,"Příjmy z prodeje krátkodobého a drobného dlouhodobého majetku",null,null,5,478.00063,495.80763000000002,1.0372530889760543,5,65.926000000000002,83.733000000000004,1.2701058762855324,0,412.07463000000001,412.07463000000001,1,null,null,23,"Příjmy z prodeje nekapitálového majetku a ostatní nedaňové příjmy",null,null,{"$f":"AF40+AJ40","v":84908.45},{"$f":"AK40","v":1539.9153299999998},{"$f":"AH40+AL40","v":146319.82360999999},95.018096618338106,{"$f":"SUM(AF41:AF47)","v":84908.45},{"$f":"SUM(AG41:AG47)","v":147294.66948000001},{"$f":"SUM(AH41:AH47)","v":144738.29952999999},0.98264451823664178,0,{"$f":"SUM(AK41:AK47)","v":1539.9153299999998},{"$f":"SUM(AL41:AL47)","v":1581.5240799999999},{"$f":"AL40/AK40","v":1.0270201544132951},null,null,23,"Příjmy z prodeje nekapitálového majetku a ostatní nedaňové příjmy",null,null,137555.677,{"$f":"SUM(AY40,BC40)","v":135618.11031000002},{"$f":"SUM(AZ40,BD40)","v":136583.88278000004},1.007121264761708,{"$f":"SUM(AX41:AX47)","v":95555.676999999996},{"$f":"SUM(AY41:AY47)","v":128691.23708000001},{"$f":"SUM(AZ41:AZ47)","v":128417.08825000004},0.9978697164141056,{"$f":"SUM(BB41:BB47)","v":42000},{"$f":"SUM(BC41:BC47)","v":6926.8732299999992},{"$f":"SUM(BD41:BD47)","v":8166.7945300000001},1.1790015868386263]
[{"$error":"#REF!"},"OK",null,null,2321,null,"Přijaté neinvestiční dary",null,null,1902.1,18225.438999999998,18269.126800000002,1.0023970780621527,1902.1,18125.438999999998,18169.126800000002,1.0024103030001097,0,100,100,1,null,null,2310,"Příjmy z prodeje krátkodobého a drobného dlouhodobého majetku",null,null,10,{"$f":"AG41+AK41","v":269.22199999999998},308.56200000000001,1.1461247594921664,10,157.642,196.982,1.2495527841565066,0,111.58,111.58,{"$f":"AL41/AK41","v":1},null,null,2310,"Příjmy z prodeje krátkodobého a drobného dlouhodobého majetku",null,null,10,{"$f":"SUM(AY41,BC41)","v":99.1},161.87869999999998,1.6334883955600403,10,99.1,161.87869999999998,1.6334883955600403,0,0,0,0]
[{"$error":"#REF!"},"OK",null,null,2322,null,"Přijaté pojistné náhrady",null,null,181.23400000000001,12407.419749999999,12341.138000000001,0.99465789412016969,181.23400000000001,12407.419749999999,12341.138000000001,0.99465789412016969,0,0,0,"x ",null,null,2321,"Přijaté neinvestiční dary",null,null,1558,28615.741300000002,28338.04826,0.99029579429417047,1558,28515.741300000002,28238.04826,0.99026176324583215,0,100,100,{"$f":"AL42/AK42","v":1},null,null,2321,"Přijaté neinvestiční dary",null,null,2868,{"$f":"SUM(AY42,BC42)","v":18469.200159999997},22884.027479999997,1.239037277291601,2868,16779.867159999998,21194.694479999998,1.2631026382928767,0,1689.3330000000001,1689.3330000000001,1]
[{"$error":"#REF!"},"OK",null,null,2324,null,"Přijaté nekapitálové příspěvky a náhrady",null,null,65155.936000000002,89192.824870000011,80783.549679999996,0.90571803054498312,65155.936000000002,88455.067580000017,79755.631389999995,0.90165135330282653,0,737.75729000000001,1027.9182900000001,1.3933014338631613,null,null,2322,"Přijaté pojistné náhrady",null,null,2034.088,22067.963400000001,18228.335760000002,0.82600897190177514,2034.088,22067.963400000001,18228.335760000002,0.82600897190177514,null,null,null,null,null,null,2322,"Přijaté pojistné náhrady",null,null,969,21830.660999999996,24529.3004,1.1236169349155303,969,20615.343999999997,23313.983400000001,{"$f":"AZ43/AY43","v":1.1309044079012218},0,1215.317,1215.317,1]
[{"$error":"#REF!"},"OK",null,null,2328,null,"Neidentifikované příjmy",null,null,0,2,2,1,0,2,2,1,0,0,0,"x ",null,null,2324,"Přijaté nekapitálové příspěvky a náhrady",null,null,72469.317999999999,79681.718130000008,80676.889449999988,1.0124893305937048,72469.317999999999,79174.653130000006,80130.481759999995,1.0120724069157661,0,507.065,546.40769,{"$f":"AL44/AK44","v":1.0775890467691518},null,null,2324,"Přijaté nekapitálové příspěvky a náhrady",null,null,86035.337999999989,86083.524009999994,80038.429960000038,0.92977641053242988,86035.337999999989,83444.773639999999,76335.975810000033,{"$f":"AZ44/AY44","v":0.91480835144129025},0,2638.7503699999997,3702.45415,1.4031089079487273]
[{"$error":"#REF!"},"OK",null,null,2329,null,"Ostatní nedaňové příjmy jinde nezařazené",null,null,4542.7439999999997,14616.954619999999,11545.44253,0.7898664824615842,4542.7439999999997,14359.704619999999,11100.054830000001,0.77300021997249146,0,257.25,445.38769999999994,1.7313418853255587,null,null,2328,"Neidentifikované příjmy",null,null,0,6,6,1,0,6,6,1,null,null,null,null,null,null,2328,"Neidentifikované příjmy",null,null,0,{"$f":"SUM(AY45,BC45)","v":29.72401},29.72401,1,0,29.72401,29.72401,{"$f":"AZ45/AY45","v":1},0,0,0,0]
[{"$error":"#REF!"},"OK",null,null,2343,null,"Příjmy z úhrad dobývacího prostoru a z vydobytých nerostů",null,null,290,0,0,"x ",290,0,0,"x ",0,0,0,"x ",null,null,2329,"Ostatní nedaňové příjmy jinde nezařazené",null,null,8837.0439999999999,18193.939979999999,18761.988140000001,1.0312218332381242,8837.0439999999999,17372.66965,17938.45175,1.032567366524465,0,821.27032999999994,823.53638999999998,{"$f":"AL46/AK46","v":1.002759213278775},null,null,2329,"Ostatní nedaňové příjmy jinde nezařazené",null,null,47673.339,{"$f":"SUM(AY46,BC46)","v":9105.9011300000002},{"$f":"SUM(AZ46,BD46)","v":8940.5222299999987},0.98183827194706197,5673.3389999999999,7722.4282699999994,7380.8318499999996,{"$f":"AZ46/AY46","v":0.95576567265415335},42000,1383.4728600000001,1559.69038,1.1273733118262976]
[{"$error":"#REF!"},"OK",null,null,null,null,null,null,null,null,null,null,null,null,null,null,null,null,null,null,null,null,null,2343,"Příjmy z úhrad dobývacího prostoru a z vydobytých nerostů",null,null,null,null,null,"x",null,null,null,null,null,null,null,null,null,null,2343,"Příjmy z úhrad dobývacího prostoru a z vydobytých nerostů",null,null,0,{"$f":"SUM(AY47,BC47)","v":0},0,0,0,0,0,0,0,0,0,0]
[{"$error":"#REF!"},null,null,null,23,null,"Příjmy z prodeje nekapitálového majetku a ostatní nedaňové příjmy",null,null,72077.01400000001,134922.63887000002,123437.06464000001,0.9148728906713236,72077.01400000001,133415.55695000003,121451.68402000002,0.91032625277362744,0,1507.0819200000001,1985.3806200000001,1.3173674195494296,null,null,3,"Kapitálové příjmy",null,null,{"$f":"AF48+AJ48","v":19907.05},49221.560109999999,40068.172470000005,{"$f":"AD48/AC48","v":0.81403702727942662},{"$f":"SUM(AF49+AF58)","v":16707.05},{"$f":"SUM(AG49+AG58)","v":36193.988109999998},{"$f":"SUM(AH49+AH58)","v":26877.970470000004},{"$f":"AH48/AG48","v":0.74260870032650306},{"$f":"SUM(AJ49,AJ58)","v":3200},{"$f":"SUM(AK49+AK58)","v":13027.572},{"$f":"SUM(AL49+AL58)","v":13190.202000000001},{"$f":"AL48/AK48","v":1.0124835234071246},null,null,3,"Kapitálové příjmy",null,null,28704.879000000001,{"$f":"SUM(AY48,BC48)","v":67628.192549999992},64798.445920000006,{"$f":"AV48/AU48","v":0.95815729323376708},{"$f":"SUM(AX49,AX58)","v":28704.879000000001},{"$f":"SUM(AY49,AY58)","v":60422.142549999997},{"$f":"SUM(AZ49,AZ58)","v":56157.122990000003},{"$f":"AZ48/AY48","v":0.92941297047732718},{"$f":"SUM(BB49,BB58)","v":0},{"$f":"SUM(BC49,BC58)","v":7206.05},{"$f":"SUM(BD49,BD58)","v":8641.3229300000003},1.1991760992499358]
[null,null,null,null,2,null,"Nedaňové příjmy",null,null,894967.93693000008,1256865.97914,1245540.71046,0.99098927899397105,495247.93693000003,792740.75348999992,775074.55374999996,0.97771503525935122,399720,464125.22565000004,470466.15670999995,1.0136621125281857,null,null,31,"Příjmy z prodej dlouhodobého majetku a ostatní kapitálové příjmy",null,null,19907.05,49221.560109999999,40068.172470000005,{"$f":"AD49/AC49","v":0.81403702727942662},{"$f":"SUM(AF50:AF57)","v":16707.05},{"$f":"SUM(AG50:AG57)","v":36193.988109999998},{"$f":"SUM(AH50:AH57)","v":26877.970470000004},{"$f":"AH49/AG49","v":0.74260870032650306},{"$f":"SUM(AJ50:AJ57)","v":3200},{"$f":"SUM(AK50:AK57)","v":13027.572},{"$f":"SUM(AL50:AL57)","v":13190.202000000001},{"$f":"AL49/AK49","v":1.0124835234071246},null,null,31,"Příjmy z prodej dlouhodobého majetku a ostatní kapitálové příjmy",null,null,28704.879000000001,67628.192549999992,64798.445920000006,{"$f":"AV49/AU49","v":0.95815729323376708},{"$f":"SUM(AX50:AX57)","v":28704.879000000001},{"$f":"SUM(AY50:AY57)","v":60422.142549999997},{"$f":"SUM(AZ50:AZ57)","v":56157.122990000003},{"$f":"AZ49/AY49","v":0.92941297047732718},{"$f":"SUM(BB50:BB57)","v":0},{"$f":"SUM(BC50:BC57)","v":7206.05},{"$f":"SUM(BD50:BD57)","v":8641.3229300000003},1.1991760992499358]
[{"$f":"IF(COUNTBLANK(C50:ID50)=254,\"odstr\",IF(AND($A$1=\"TISK\",SUM(J48:U48)=0),\"odstr\",\"OK\"))","v":{"$error":"#REF!"}},"OK",null,null,3111,null,"Příjmy z prodeje pozemků",null,null,0,130,323.363,2.4874076923076922,0,0,8.1199999999999992,"x ",0,130,315.24299999999999,2.4249461538461539,null,null,3111,"Příjmy z prodeje pozemků",null,null,0,1307.7660000000001,1408.296,{"$f":"AD50/AC50","v":1.0768715504149824},null,null,null,null,0,1307.7660000000001,1408.296,{"$f":"AL50/AK50","v":1.0768715504149824},null,null,3111,"Příjmy z prodeje pozemků",null,null,0,1559.528,1574.8479200000002,{"$f":"AV50/AU50","v":1.0098234337568803},0,1373.7529999999999,0,{"$f":"AZ50/AY50","v":0},0,185.77500000000001,1574.8479200000002,8.4771789530345849]
[{"$error":"#REF!"},"OK",null,null,3112,null,"Příjmy z prodeje ostatních nemovitostí a jejich částí",null,null,0,300,300,1,0,0,0,"x ",0,300,300,1,null,null,3112,"Příjmy z prodeje ostatních nemovitostí a jejich částí",null,null,3200,11449.994000000001,11450.769,{"$f":"AD51/AC51","v":1.0000676856249882},0,0,0.77500000000000002,"x",3200,11449.994000000001,11449.994000000001,{"$f":"AL51/AK51","v":1},null,null,3112,"Příjmy z prodeje ostatních nemovitostí a jejich částí",null,null,0,6814.2250000000004,6821.2280099999998,{"$f":"AV51/AU51","v":1.0010277045445373},0,0,7.0030000000000001,0,0,6814.2250000000004,6814.2250100000001,1.0000000014675183]
[{"$error":"#REF!"},"OK",null,null,3113,null,"Příjmy z prodeje ostatního hmotného dlouhodobého majetku",null,null,0,893.90409999999997,2220.7231000000002,2.4842968054403154,0,47.9,1156.32,24.140292275574112,0,846.00409999999999,1064.4031,1.2581535952367133,null,null,3113,"Příjmy z prodeje ostatního hmotného dlouhodobého majetku",null,null,0,338.41200000000003,414.01200000000006,{"$f":"AD52/AC52","v":1.2233963334633524},0,68.599999999999994,82.1,{"$f":"AH52/AG52","v":1.1967930029154519},null,269.81200000000001,331.91200000000003,{"$f":"AL52/AK52","v":1.2301602597364092},null,null,3113,"Příjmy z prodeje ostatního hmotného dlouhodobého majetku",null,null,20,563.02300000000002,649.76199999999994,{"$f":"AV52/AU52","v":1.1540594256362526},20,356.97300000000001,397.512,{"$f":"AZ52/AY52","v":1.1135632106629914},0,206.05,252.25,1.2242174229555933]
[{"$error":"#REF!"},"OK",null,null,3114,null,"Příjmy z prodeje nehmotného dlouhodobého majetku",null,null,0,0,0,"x ",0,0,0,"x ",0,0,0,"x ",null,null,3114,"Příjmy z prodeje nehmotného dlouhodobého majetku",null,null,null,null,null,"x",null,null,null,null,null,null,null,null,null,null,3114,"Příjmy z prodeje nehmotného dlouhodobého majetku",null,null,0,{"$f":"SUM(AY53,BC53)","v":0},0,0,0,0,0,0,0,0,0,0]
[{"$error":"#REF!"},"OK",null,null,3119,null,"Ostatní příjmy z prodeje dlouhodobého majetku",null,null,0,0,0,"x ",0,0,0,"x ",0,0,0,"x ",null,null,3119,"Ostatní příjmy z prodeje dlouhodobého majetku",null,null,null,null,null,"x",null,null,null,null,null,null,null,null,null,null,3119,"Ostatní příjmy z prodeje dlouhodobého majetku",null,null,0,0,0,0,0,0,0,0,0,0,0,0]
[{"$error":"#REF!"},"OK",null,null,3121,null,"Přijaté dary na pořízení dlouhodobého majetku",null,null,500,5660,5807.5919999999996,1.0260763250883391,500,5660,5807.5919999999996,1.0260763250883391,0,0,0,"x ",null,null,3121,"Přijaté dary na pořízení dlouhodobého majetku",null,null,{"$f":"AF55+AJ55","v":8961},25530.545109999999,24694.754470000003,{"$f":"AD55/AC55","v":0.96726311027050393},8961,25530.545109999999,24694.754470000003,{"$f":"AH55/AG55","v":0.96726311027050393},null,null,null,null,null,null,3121,"Přijaté dary na pořízení dlouhodobého majetku",null,null,5592.3789999999999,52787.416549999994,52289.911990000001,{"$f":"AV55/AU55","v":0.99057531903405882},5592.3789999999999,52787.416549999994,52289.911990000001,0.99057531903405882,0,0,0,0]
[{"$error":"#REF!"},"OK",null,null,3122,null,"Přijaté příspěvky na pořízení dlouhodobého majetku",null,null,1006,1740.1445000000001,1538.5005000000001,0.88412226685772355,1006,1740.1445000000001,1538.5005000000001,0.88412226685772355,0,0,0,"x ",null,null,3122,"Přijaté příspěvky na pořízení dlouhodobého majetku",null,null,5774.05,1749.05,150,{"$f":"AD56/AC56","v":8.5760841599725565E-2},5774.05,1749.05,150,{"$f":"AH56/AG56","v":8.5760841599725565E-2},null,null,null,null,null,null,3122,"Přijaté příspěvky na pořízení dlouhodobého majetku",null,null,3930,2829,389.09300000000002,{"$f":"AV56/AU56","v":0.13753729232944503},3930,2829,389.09300000000002,0.13753729232944503,null,null,null,0]
[{"$error":"#REF!"},"OK",null,null,3129,null,"Ostatní investiční příjmy jinde nezařazené",null,null,2900,0,0.55000000000000004,"x ",2900,0,0,"x ",0,0,0.55000000000000004,"x ",null,null,3129,"Ostatní investiční příjmy jinde nezařazené",null,null,1972,8845.7929999999997,1950.3409999999999,{"$f":"AD57/AC57","v":0.2204823241963722},1972,8845.7929999999997,1950.3409999999999,{"$f":"AH57/AG57","v":0.2204823241963722},null,null,null,null,null,null,3129,"Ostatní investiční příjmy jinde nezařazené",null,null,19162.5,3075,3073.6030000000001,{"$f":"AV57/AU57","v":0.9995456910569106},19162.5,3075,3073.6030000000001,0.9995456910569106,null,null,null,0]
[{"$error":"#REF!"},"OK",null,null,31,null,"Příjmy z prodeje dlouhodobého majetku a ostatní kapitálové příjmy",null,null,4406,8724.0486000000001,10190.728599999999,1.168119191816515,4406,7448.0445,8510.5324999999993,1.1426532830194556,0,1276.0041000000001,1680.1960999999999,1.3167638724671809,null,null,32,"Příjmy z prodeje dlouhodobého finančního majetku",null,null,0,0,0,"x",0,0,0,"x",0,0,0,"x",null,null,32,"Příjmy z prodeje dlouhodobého finančního majetku",null,null,0,0,0,0,{"$f":"SUM(AX59:AX60)","v":0},{"$f":"SUM(AY59:AY60)","v":0},{"$f":"SUM(AZ59:AZ60)","v":0},0,{"$f":"SUM(BB59:BB60)","v":0},{"$f":"SUM(BC59:BC60)","v":0},{"$f":"SUM(BD59:BD60)","v":0},0]
[{"$error":"#REF!"},"OK",null,null,3201,null,"Příjmy z prodeje akcií",null,null,0,0,0,"x ",0,0,0,"x ",0,0,0,"x ",null,null,3201,"Příjmy z prodeje akcií",null,null,0,0,0,"x",0,0,0,"x",0,0,0,"x",null,null,3201,"Příjmy z prodeje akcií",null,null,0,0,0,0,0,0,0,0,null,null,null,0]
[{"$error":"#REF!"},"OK",null,null,3202,null,"Příjmy z prodeje majetkových podílů",null,null,0,0,0,"x ",0,0,0,"x ",0,0,0,"x ",null,null,3202,"Příjmy z prodeje majetkových podílů",null,null,0,0,0,"x",0,0,0,"x",0,0,0,"x",null,null,3202,"Příjmy z prodeje majetkových podílů",null,null,0,0,0,0,0,0,0,0,null,null,null,0]
[{"$error":"#REF!"},"OK",null,null,32,null,"Příjmy z prodeje dlouhodobého finančního majetku",null,null,0,0,0,"x ",0,0,0,"x ",0,0,0,"x ",null,null,"Příjmy kap. 700-Obce a DSO; KÚ\n(část vzdělávání)",null,null,null,{"$f":"SUM(AB48+AB14)","v":1078274.46352},{"$f":"AC48+AC14","v":1596442.14133},{"$f":"AD48+AD14","v":1593349.3314699999},{"$f":"AD61/AC61","v":0.99806268590640967},{"$f":"SUM(AF14+AF48)","v":651894.32352000009},{"$f":"SUM(AG48+AG14)","v":1090047.4181600001},{"$f":"SUM(AH14+AH48)","v":1081087.70624},{"$f":"AH61/AG61","v":0.99178043838209884},{"$f":"SUM(AJ14,AJ48)","v":426380.14},{"$f":"SUM(AK14+AK48)","v":506394.7231699999},{"$f":"SUM(AL48+AL14)","v":512261.62522999989},{"$f":"AL61/AK61","v":1.0115856303226731},null,"Příjmy kap. 700-Obce a DSO; KÚ\n(část vzdělávání)",null,null,null,null,1203403.6038799998,{"$f":"SUM(AY61,BC61)","v":1761040.9278000002},{"$f":"SUM(AZ61,BD61)","v":1762914.9455900001},{"$f":"AV61/AU61","v":1.0010641534562976},{"$f":"SUM(AX14,AX48)","v":733749.94387999992},{"$f":"SUM(AY14,AY48)","v":1147902.0235900001},{"$f":"SUM(AZ14,AZ48)","v":1147418.4756300002},{"$f":"AZ61/AY61","v":0.99957875502432902},{"$f":"SUM(BB14,BB48)","v":469653.66},{"$f":"SUM(BC14,BC48)","v":613138.90421000007},{"$f":"SUM(BD14,BD48)","v":615496.4699599999},1.0038450761056135]
[{"$error":"#REF!"},"OK",null,null,3,null,"Kapitálové příjmy",null,null,4406,8724.0486000000001,10190.728599999999,1.168119191816515,4406,7448.0445,8510.5324999999993,1.1426532830194556,0,1276.0041000000001,1680.1960999999999,1.3167638724671809,null,null,null,null,null,null,null,null,null,null,null,null,null,null,null,null,null,"Zdroj: Závěrečný účet – kapitola 700-Obce a DSO; KÚ (část: vzdělávání); monitor.statnipokladna.cz",null,null,"Komentář:"]
[{"$error":"#REF!"},"OK",null,null,"Příjmy kap. 700-Obce a DSO; KÚ\n(část vzdělávání)",null,null,null,null,899373.93693000008,1265590.0277399998,1255731.4390599998,0.99221028258447574,499653.93693000003,800188.79798999988,783585.08624999993,0.9792502572121643,399720,465401.22975000006,472146.35280999995,1.0144931354470705,null,null,"Tabulka neobsahuje z daných tříd následující položky: 2223, 2441, 2442, 2449, 4121, 4122, 4129, 4133, 4134, 4139, 4221, 4222, 4229.",null,null,null,null,null,null,null,null,null,null,null,null,null,null,null,null,"1)","Tabulka neobsahuje z daných tříd následující položky: 2223, 2441, 2442, 2449, 4121, 4122, 4129, 4133, 4134, 4139, 4221, 4222, 4229."]
[{"$error":"#REF!"},"OK",null,null,null,null,null,null,null,null,null,null,null,null,null,null,null,null,null,null,"Zdroj: Závěrečný účet – kapitola 700-Obce a DSO; KÚ (část: vzdělávání)"]
[{"$error":"#REF!"},"OK",null,null,"Tabulka neobsahuje z daných tříd následující položky: 2223, 2441, 2442, 2449, 4121, 4122, 4129, 4133, 4134, 4139, 4221, 4222, 4229."]
["konst","stop",null,"Komentáře:"]
[{"$f":"IF(COUNTBLANK(D67:E67)=2,\"odstr\",\"OK\")","v":"OK"},null,null,"1)"]
[{"$f":"IF(COUNTBLANK(D68:E68)=2,\"odstr\",\"OK\")","v":"odstr"}]
["stop"]

{"sheet":"B6","index":6,"n_rows":240,"n_cols":40,"rows_kept":240,"cut":false,"hidden":false,"merged":[[26,39,28,39],[87,29,89,29],[92,29,94,29],[159,29,159,33],[8,38,12,38],[8,39,12,39],[22,32,22,33],[103,31,103,34],[8,29,12,30],[8,32,12,32],[8,35,12,35],[8,36,12,36],[8,37,12,37],[26,29,28,29],[26,35,28,35],[26,36,28,36],[26,38,28,38],[103,17,103,20],[22,18,22,19],[8,24,12,24],[8,25,12,25],[8,15,12,16],[8,18,12,18],[8,21,12,21],[8,22,12,22],[8,23,12,23],[71,6,71,7],[8,11,12,11],[8,12,12,12],[8,13,12,13],[8,3,12,4],[8,6,12,6],[8,9,12,9],[8,10,12,10],[17,6,17,7],[59,6,59,7]]}
[{"$f":"IF(#REF!=\"\",\"ŠABLONA\",IF(#REF!=\"T\",\"TISK\",\"ELEKTRO\"))","v":{"$error":"#REF!"}},0,{"$f":"CONCATENATE(D1,F1,IF(G1<>\"\",\".\",\"\"),G1,IF(H1<>\"\",\".\",\"\"),H1,IF(I1<>\"\",\".\",\"\"),I1,\"\")","v":{"$error":"#REF!"}},{"$f":"IF(#REF!=\"\",\" ?\",#REF!)","v":{"$error":"#REF!"}},{"$f":"CONCATENATE(C1,N1)","v":{"$error":"#REF!"}},6]
["konst"]
["konst","102x4",null,"Tab. B6:",null,null,null,"Výdaje kapitoly 333-MŠMT – podle položek",null,null,null,null,null,null,null,"Tab. B6:",null,null,"Výdaje kapitoly 333-MŠMT - podle položek",null,null,null,null,null,null,null,null,null,null,"Tab. B6:",null,null,"Výdaje kapitoly 333-MŠMT - podle položek"]
["konst",{"$f":"COUNTA(Datova_oblast)","v":420},null,{"$f":"IF(D1=\" ?\",\"\",CONCATENATE(\"Tab. \",E1,\":\"))","v":{"$error":"#REF!"}},null,null,null,{"$f":"IF(H3=\"Zadejte název tabulky\",\"\",H3)","v":"Výdaje kapitoly 333-MŠMT – podle položek"},null,null,null,null,null,null,null,{"$f":"IF(P1=\" ?\",\"\",CONCATENATE(\"Tab. \",Q1,\":\"))","v":"Tab. :"},null,null,null,null,null,null,null,null,null,null,null,null,null,{"$f":"IF(AD1=\" ?\",\"\",CONCATENATE(\"Tab. \",AE1,\":\"))","v":"Tab. :"}]
[{"$f":"IF(D5=\"\",\"odstr\",\"OK\")","v":"odstr"},0]
[{"$f":"IF(COUNTBLANK(C6:IW6)=254,\"odstr\",\"OK\")","v":"OK"},"Řádky pro"]
[{"$f":"IF(COUNTBLANK(C7:IW7)=254,\"odstr\",\"OK\")","v":"OK"},"ročenku PaM"]
["konst",null,null,"(podle stavu k: 31. 12. 2017)",null,null,null,null,null,null,null,null,null,"v tis. Kč",null,"(podle stavu k: 31. 12. 2019)",null,null,null,null,null,null,null,null,null,"v tis. Kč",null,null,null,"(podle stavu k: 31. 12. 2020)",null,null,null,null,null,null,null,null,null,"v tis. Kč"]
["konst",null,null,"Položka",null,null,"Popis položky",null,null,"Schválený rozpočet","Rozpočet po změnách","Konečný rozpočet","Skutečnost\n","% plnění rozpočtu",null,"Položka",null,null,"Popis položky",null,null,"Schválený rozpočet","Rozpočet po změnách","Konečný rozpočet","Skutečnost\n","% plnění rozpočtu",null,null,null,"Položka",null,null,"Popis položky",null,null,"Schválený rozpočet","Rozpočet po změnách","Konečný rozpočet","Skutečnost\n","% plnění rozpočtu"]
["konst"]
["konst"]
["konst"]
["konst"]
[null,null,null,null,5011,null,"Platy zaměstnanců v pracovním poměru",null,null,107421.16499999999,111655.406,113405.00599999999,108242.683,0.96943521928530718,null,null,5,null,"Běžné výdaje celkem",null,null,{"$f":"V15+V35+V82+V91+V109+V116+V128","v":196018803.20500001},{"$f":"SUM(W15,W35,W82,W91,W109,W116,W125,W128)","v":200513347.01399997},{"$f":"SUM(X15,X35,X82,X91,X109,X116,X125,X128)","v":205407766.67464998},{"$f":"SUM(Y15,Y35,Y82,Y91,Y109,Y116,Y125,Y128)","v":199521703.05666006},{"$f":"Y14/W14","v":0.99505447406814929},null,null,null,null,5,null,"Běžné výdaje celkem",null,null,{"$f":"SUM(AJ15,AJ35,AJ82,AJ91,AJ109,AJ116,AJ125,AJ128)","v":220068774.935},{"$f":"SUM(AK15,AK35,AK82,AK91,AK109,AK116,AK125,AK128)","v":218168675.146},{"$f":"SUM(AL15,AL35,AL82,AL91,AL109,AL116,AL125,AL128)","v":163783035.61521},{"$f":"SUM(AM15,AM35,AM82,AM91,AM109,AM116,AM125,AM128)","v":218320357.40586001},{"$f":"AM14/AK14","v":1.0006952522389316}]
[null,null,null,null,5013,null,"Platy státních zaměstnanců ve správních úřadech",null,null,659840.39399999997,668565.48300000001,679002.77,645905.53500000003,0.96610661397247155,null,null,50,null,"Platy a podobné související výdaje",null,null,{"$f":"V16+V20+V26+V30+V33","v":1259287.7549999999},{"$f":"SUM(W16,W20,W26,W30,W33)","v":1262077.1410000001},{"$f":"SUM(X16,X20,X26,X30,X33)","v":1466280.5340700003},{"$f":"SUM(Y16,Y20,Y26,Y30,Y33)","v":1302694.1896000002},{"$f":"Y15/W15","v":1.0321826988862324},null,null,null,null,50,null,"Platy a podobné související výdaje",null,null,{"$f":"SUM(AJ16,AJ20,AJ26,AJ30,AJ33)","v":1317232.1880000001},{"$f":"SUM(AK16,AK20,AK26,AK30,AK33)","v":1326827.2379999999},{"$f":"SUM(AL16,AL20,AL26,AL30,AL33)","v":1044014.51203},{"$f":"SUM(AM16,AM20,AM26,AM30,AM33)","v":1298052.3638500001},{"$f":"AM15/AK15","v":0.97831302122394337}]
[null,null,null,null,5021,null,"Ostatní osobní výdaje",null,null,102553.765,112732.023,163424.899,102161.11481,0.9062297658758417,null,null,501,null,"Platy",null,null,{"$f":"V17+V18+V19","v":861872.21099999989},{"$f":"SUM(W17:W19)","v":862760.65700000001},{"$f":"SUM(X17:X19)","v":932282.99400000006},{"$f":"SUM(Y17:Y19)","v":893660.03399999999},1.035814541088885,null,null,null,null,501,null,"Platy",null,null,913322.71299999999,913785.79299999995,902652.049,902652.049,0.987815805317516]
[null,null,null,null,5022,null,"Platy představitelů státní moci a některých orgánů",null,null,1622.4,1622.4,1639.32,1638.72,1.010059171597633,null,null,5011,null,"Platy zaměstnanců v pracovním poměru vyjma zaměstnanců na služebních místech",null,null,126196.30499999999,119821.31600000001,132770.83600000001,125757.23,1.049539716288878,null,null,null,null,5011,null,"Platy zaměstnanců v pracovním poměru vyjma zaměstnanců na služebních místech",null,null,136983.59700000001,127983.59699999999,133636.71599999999,133636.71599999999,1.04417065258761]
[null,null,null,null,5024,null,"Odstupné",{"$error":"#N/A"},null,1000,697.077,698.70799999999997,350.70800000000003,0.50311228171349798,null,null,5013,null,"Platy zaměstnanců na služebních místech podle zákona o státní službě ",null,null,735675.90599999996,742939.34100000001,799512.15800000005,767902.804,1.0336009437411122,null,null,null,null,5013,null,"Platy zaměstnanců na služebních místech podle zákona o státní službě ",null,null,776339.11600000004,785802.196,817411.55,769015.33299999998,{"$f":"AM18/AK18","v":0.9786372918204469}]
[null,null,null,null,5025,null,"Odbytné",null,null,500,908.73599999999999,908.73599999999999,408.73599999999999,0.44978519614057327,null,null,5019,null,"Ostatní platy",null,null,null,null,null,null,"x",null,null,null,null,5019,null,"Ostatní platy",null,null,null,null,null,null,"x"]
[null,null,null,null,5026,null,"Odchodné",null,null,0,406.5,406.5,406.5,1,null,null,502,null,"Ostatní platby za provedenou práci",null,null,{"$f":"SUM(V21:V25)","v":83501.059000000008},{"$f":"SUM(W21:W25)","v":84284.680000000008},{"$f":"SUM(X21:X25)","v":172635.53222000002},{"$f":"SUM(Y21:Y25)","v":86798.796999999991},1.0298288728153204,null,null,null,null,502,null,"Ostatní platby za provedenou práci",null,null,72954.577999999994,72954.577999999994,{"$f":"SUM(AL21:AL25)","v":132383.53302999999},69430.981,0.95170149568955098]
[{"$f":"IF(COUNTBLANK(C21:IW21)=254,\"odstr\",IF(AND($A$1=\"TISK\",SUM(J14:N14)=0),\"odstr\",\"OK\"))","v":{"$error":"#REF!"}},"OK",null,null,5031,null,"Povinné pojistné na sociální zabezpečení a příspěvek na státní politiku zaměstnanosti",null,null,216146.81899999999,219288.94,233924.40100000001,208999.671,0.9530789423306073,null,null,5021,null,"Ostatní osobní výdaje",null,null,79927.459000000003,79927.459000000003,168278.31122,83180.913,1.0407050848444963,null,null,null,null,5021,null,"Ostatní osobní výdaje",null,null,69376.178,68910.213000000003,128415.28803,66687.426000000007,{"$f":"AM21/AK21","v":0.96774372181958002}]
[{"$f":"IF(COUNTBLANK(C22:IW22)=254,\"odstr\",IF(AND($A$1=\"TISK\",SUM(J15:N15)=0),\"odstr\",\"OK\"))","v":{"$error":"#REF!"}},"OK",null,null,5032,null,"Povinné pojistné na veřejné zdravotní pojištění",null,null,78017.899999999994,78920.142999999996,84188.316000000006,75443.115000000005,0.95594245185288129,null,null,5022,null,"Platy představitelů státní moci a některých orgánů",null,null,2073.6,2073.6,2073.6,1885.2,0.9091435185185186,null,null,null,null,5022,null,"Platy představitelů státní moci a některých orgánů",null,null,2078.4,2078.4,2078.4,2078.4,{"$f":"AM22/AK22","v":1}]
[null,null,null,null,5039,null,"Ostatní povinné pojistné placené zaměstnavatelem",null,null,0,170,170,40.668999999999997,0.23922941176470586,null,null,5024,null,"Odstupné",{"$error":"#N/A"},null,1000,1283.6210000000001,1283.6210000000001,869.28399999999999,0.67721235473710695,null,null,null,null,5024,null,"Odstupné",{"$error":"#N/A"},null,1000,1255.296,1179.1759999999999,454.48599999999999,{"$f":"AM23/AK23","v":0.36205484602834709}]
[{"$f":"IF(COUNTBLANK(C24:IW24)=254,\"odstr\",IF(AND($A$1=\"TISK\",SUM(J16:N16)=0),\"odstr\",\"OK\"))","v":{"$error":"#REF!"}},"OK",null,null,5041,null,"Odměny za užití duševního vlastnictví",null,null,0,0,0,0,"x ",null,null,5025,null,"Odbytné",null,null,500,1000,1000,863.4,0.86339999999999995,null,null,null,null,5025,null,"Odbytné",null,null,500,710.66899999999998,710.66899999999998,210.66900000000001,{"$f":"AM24/AK24","v":0.296437582052967}]
[{"$f":"IF(COUNTBLANK(C25:IW25)=254,\"odstr\",IF(AND($A$1=\"TISK\",SUM(J17:N17)=0),\"odstr\",\"OK\"))","v":{"$error":"#REF!"}},"OK",null,null,50,null,"Výdaje na platby, ostatních platby za provedenou práci a pojistné",null,null,1167102.443,1194966.7080000001,1277768.6560000002,1143597.45181,0.95701197711526531,null,null,5026,null,"Odchodné",null,null,null,null,null,null,"x",null,null,null,null,5026,null,"Odchodné",null,null,null,null,null,null,"x"]
[null,null,null,null,5132,null,"Ochranné pomůcky",null,null,45,46,46,27.976869999999998,0.60819282608695646,null,null,503,null,"Povinné pojistné placené zaměstnavatelem",null,null,{"$f":"SUM(V27:V29)","v":313914.48499999999},{"$f":"SUM(W27:W29)","v":314480.53200000001},{"$f":"SUM(X27:X29)","v":359479.73585},{"$f":"SUM(Y27:Y29)","v":321685.52841999999},1.02291078679554,null,null,null,null,503,null,"Povinné pojistné placené zaměstnavatelem",null,null,330951.397,331107.93699999998,{"$f":"SUM(AL27:AL29)","v":0},318349.36914000002,{"$f":"AM26/AK26","v":0.96146704311712117}]
[{"$f":"IF(COUNTBLANK(C27:IW27)=254,\"odstr\",IF(AND($A$1=\"TISK\",SUM(J18:N18)=0),\"odstr\",\"OK\"))","v":{"$error":"#REF!"}},"OK",null,null,5133,null,"Léky a zdravotnický materiál",null,null,55,28.361000000000001,28.361000000000001,11.77,0.41500652304220581,null,null,5031,null,"Povinné pojistné na sociální zabezpečení a příspěvek na státní politiku zaměstnanosti",null,null,230709.614,231125.16699999999,263958.45863000001,236174.63931999999,1.0218473495792,null,null,null,"z toho",5031,null,"Povinné pojistné na sociální zabezpečení a příspěvek na státní politiku zaměstnanosti",null,null,330951.40000000002,331107.90000000002,null,318349.40000000002,{"$f":"AM27/AK27","v":0.96146724375951165}]
[{"$f":"IF(COUNTBLANK(C28:IW28)=254,\"odstr\",IF(AND($A$1=\"TISK\",SUM(J19:N19)=0),\"odstr\",\"OK\"))","v":{"$error":"#REF!"}},"OK",null,null,5134,null,"Prádlo, oděv a obuv",null,null,3170,6436.8609999999999,6436.8609999999999,6433.0381200000002,0.99940609561088867,null,null,5032,null,"Povinné pojistné na veřejné zdravotní pojištění",null,null,83204.870999999999,83355.365000000005,95521.277220000004,85510.8891,1.0258594524779538,null,null,null,null,5032,null,"Povinné pojistné na veřejné zdravotní pojištění"]
[{"$f":"IF(COUNTBLANK(C29:IW29)=254,\"odstr\",IF(AND($A$1=\"TISK\",SUM(J20:N20)=0),\"odstr\",\"OK\"))","v":{"$error":"#REF!"}},"OK",null,null,5136,null,"Knihy, učební pomůcky a tisk",null,null,628,752.38199999999995,752.38199999999995,568.66554000000008,0.7558202349338502,null,null,5039,null,"Ostatní povinné pojistné placené zaměstnavatelem",null,null,null,null,null,null,"x",null,null,null,null,5039,null,"Ostatní povinné pojistné placené zaměstnavatelem"]
[null,null,null,null,5137,null,"Drobný hmotný dlouhodobý majetek",null,null,7139.1170000000002,22071.644,31950.876250000001,14910.871710000001,0.67556688165140766,null,null,504,null,"Odměny za užití duševního vlastnictví",null,null,0,{"$f":"SUM(W31:W32)","v":551.27200000000005},{"$f":"SUM(X31:X32)","v":1882.2719999999999},{"$f":"SUM(Y31:Y32)","v":549.83018000000004},0.99738455789519509,null,null,null,null,504,null,"Odměny za užití duševního vlastnictví",null,null,{"$f":"SUM(AJ31:AJ32)","v":3.5},{"$f":"SUM(AK31:AK32)","v":8978.93},{"$f":"SUM(AL31:AL32)","v":8978.93},{"$f":"SUM(AM31:AM32)","v":7619.9647099999993},{"$f":"AM30/AK30","v":0.84864952839592234}]
[{"$f":"IF(COUNTBLANK(C31:IW31)=254,\"odstr\",IF(AND($A$1=\"TISK\",SUM(J21:N21)=0),\"odstr\",\"OK\"))","v":{"$error":"#REF!"}},"OK",null,null,5139,null,"Nákup materiálu jinde nezařazený",null,null,5920,15009.152,16431.776999999998,12732.59662,0.84832218502417722,null,null,5041,null,"Odměny za užití duševního vlastnictví",null,null,0,1,1,0.35899999999999999,0.35899999999999999,null,null,null,null,5041,null,"Odměny za užití duševního vlastnictví",null,null,0,1.3,1.3,0.98199999999999998,{"$f":"AM31/AK31","v":0.75538461538461532}]
[null,null,null,null,null,null,null,null,null,null,null,null,null,null,null,null,5042,null,"Odměny za užití počítačových programů",null,null,null,550.27200000000005,1881.2719999999999,549.47118,0.99854468335659452,null,null,null,null,5042,null,"Odměny za užití počítačových programů",null,null,3.5,8977.630000000001,8977.630000000001,7618.9827099999993,{"$f":"AM32/AK32","v":0.84866303356230965}]
[null,null,null,null,5142,null,"Realizované kurzové ztráty",null,null,215,343.27,343.27,324.05953000000005,0.94403685145803617,null,null,505,null,"Mzdové náhrady",null,null,0,0,0,0,"x",null,null,null,null,505,null,"Mzdové náhrady",null,null,{"$f":"AJ34","v":0},{"$f":"AK34","v":0},{"$f":"AL34","v":0},{"$f":"AM34","v":0},0]
[{"$f":"IF(COUNTBLANK(C34:IW34)=254,\"odstr\",IF(AND($A$1=\"TISK\",SUM(J22:N22)=0),\"odstr\",\"OK\"))","v":{"$error":"#REF!"}},"OK",null,null,5151,null,"Studená voda",null,null,1461,1672.2059999999999,1672.2059999999999,1580.74117,0.94530289330381545,null,null,5051,null,"Mzdové náhrady",null,null,0,0,0,0,0,null,null,null,null,5051,null,"Mzdové náhrady",null,null,0,0,0,0,0]
[{"$f":"IF(COUNTBLANK(C35:IW35)=254,\"odstr\",IF(AND($A$1=\"TISK\",SUM(J23:N23)=0),\"odstr\",\"OK\"))","v":{"$error":"#REF!"}},"OK",null,null,5152,null,"Teplo",null,null,2551,3261.1849999999999,3261.1849999999999,2497.0607,0.76569121346995039,null,null,51,null,"Neinvestiční nákupy a související výdaje",null,null,{"$f":"V37+V44+V46+V54+V63+V70+V74","v":300926.98300000001},{"$f":"SUM(W36,W37,W44,W46,W54,W63,W70,W74)","v":388540.86599999992},{"$f":"SUM(X36,X37,X44,X46,X54,X63,X70,X74)","v":415308.99800999998},{"$f":"SUM(Y36,Y37,Y44,Y46,Y54,Y63,Y70,Y74)","v":312888.8003},0.80529186934997998,null,null,null,null,51,null,"Neinvestiční nákupy a související výdaje",null,null,{"$f":"SUM(AJ36,AJ37,AJ44,AJ46,AJ54,AJ63,AJ70,AJ74)","v":335509.09400000004},{"$f":"SUM(AK36,AK37,AK44,AK46,AK54,AK63,AK70,AK74)","v":366166.598},{"$f":"SUM(AL36,AL37,AL44,AL46,AL54,AL63,AL70,AL74)","v":30389.090929999998},{"$f":"SUM(AM36,AM37,AM44,AM46,AM54,AM63,AM70,AM74)","v":273871.97413999995},{"$f":"AM35/AK35","v":0.74794362903631084}]
[{"$f":"IF(COUNTBLANK(C36:IW36)=254,\"odstr\",IF(AND($A$1=\"TISK\",SUM(J24:N24)=0),\"odstr\",\"OK\"))","v":{"$error":"#REF!"}},"OK",null,null,5153,null,"Plyn",null,null,4943,5014.5320000000002,5014.5320000000002,4406.86661,0.87881912210351831,null,null,5123,null,"Podlimitní technické zhodnocení",null,null,0,48,48,47.486400000000003,0.98930000000000007,null,null,null,null,5123,null,"Podlimitní technické zhodnocení",null,null,0,24.949000000000002,24.949000000000002,24.949000000000002,{"$f":"AM36/AK36","v":1}]
[null,null,null,null,5154,null,"Elektrická energie",null,null,5767,8303.4779999999992,8303.4779999999992,6363.30429,0.76634204245498094,null,null,513,null,"Nákupy materiálu",null,null,{"$f":"SUM(V38:V43)","v":26681.530999999999},{"$f":"SUM(W38:W43)","v":45905.096709999998},{"$f":"SUM(X38:X43)","v":46640.751459999999},{"$f":"SUM(Y38:Y43)","v":34945.329760000001},0.76125163139864349,null,null,null,null,513,null,"Nákupy materiálu",null,null,33426.531000000003,43397.5965,{"$f":"SUM(AL38:AL43)","v":0},43914.835319999998,{"$f":"AM37/AK37","v":1.0119186052158442}]
[null,null,null,null,5156,null,"Pohonné hmoty a maziva",null,null,6256,6084.14,6084.14,5801.6685900000002,0.95357249997534577,null,null,5132,null,"Ochranné pomůcky",null,null,30,46,46,25.564,0.55573913043478262,null,null,null,null,5132,null,"Ochranné pomůcky"]
[null,null,null,null,5157,null,"Teplá voda",null,null,290,275,275,255.14293000000001,0.92779247272727272,null,null,5133,null,"Léky a zdravotnický personál",null,null,20,45,45,11.77801,0.26173355555555555,null,null,null,null,5133,null,"Léky a zdravotnický personál"]
[null,null,null,null,5161,null,"Služby pošt",null,null,1391.25,2062.5,2062.5,1927.5610099999999,0.93457503515151508,null,null,5134,null,"Prádlo, oděv a obuv",null,null,3195,5172.0839900000001,5172.19794,5171.3723200000004,0.99986240169313267,null,null,null,null,5134,null,"Prádlo, oděv a obuv"]
[null,null,null,null,5162,null,"Služby telekomunikací a radiokomunikací",null,null,11851.76,9363.6129999999994,9608.6129999999994,6122.7944000000007,0.65389229563417461,null,null,5136,null,"Knihy, učební pomůcky a tisk",null,null,503,728.67688999999996,746.15188999999998,528.61999000000003,0.72545183915466305,null,null,null,null,5136,null,"Knihy, učební pomůcky a tisk"]
[null,null,null,null,5163,null,"Služby peněžních ústavů",null,null,1679,1970.6120000000001,1970.6120000000001,1827.89579,0.92757772204776989,null,null,5137,null,"Drobný hmotný dlouhodobý majetek",null,null,12416.606,24705.81179,24916.394539999998,17752.920249999999,0.71857263387660575,null,null,null,null,5137,null,"Drobný hmotný dlouhodobý majetek"]
[null,null,null,null,5164,null,"Nájemné",null,null,23586,55612.720999999998,58556.009570000002,52840.722310000005,0.95015531266668296,null,null,5139,null,"Nákup materiálu jinde nezařazený",null,null,10516.924999999999,15207.524039999998,15715.007089999999,11455.07519,0.75325050678006367,null,null,null,null,5139,null,"Nákup materiálu jinde nezařazený"]
[{"$f":"IF(COUNTBLANK(C44:IW44)=254,\"odstr\",IF(AND($A$1=\"TISK\",SUM(J25:N25)=0),\"odstr\",\"OK\"))","v":{"$error":"#REF!"}},"OK",null,null,5166,null,"Konzultační, poradenské a právní služby",null,null,2879.9,2687.5030000000002,3687.5030000000002,1137.9749999999999,0.42343208547116035,null,null,514,null,"Úroky a ostatní finanční výdaje",null,null,{"$f":"SUM(V45)","v":205},{"$f":"W45","v":377.92},{"$f":"X45","v":378.10307},{"$f":"Y45","v":284.96113000000003},0.75402500529212535,null,null,null,null,514,null,"Úroky a ostatní finanční výdaje",null,null,{"$f":"AJ45","v":205},{"$f":"AK45","v":184.69483},{"$f":"AL45","v":184.69483},{"$f":"AM45","v":89.261349999999993},{"$f":"AM44/AK44","v":0.48329100495124849}]
[null,null,null,null,5167,null,"Služby školení a vzdělávání",null,null,3300,5604.4489999999996,5604.451,3527.5655200000001,0.62942236069950863,null,null,5142,null,"Kursové rozdíly ve výdajích",null,null,205,377.92,378.10307,284.96113000000003,0.75402500529212535,null,null,null,null,5142,null,"Kursové rozdíly ve výdajích",null,null,205,184.69483,184.69483,89.261349999999993,{"$f":"AM45/AK45","v":0.48329100495124849}]
[{"$f":"IF(COUNTBLANK(C46:IW46)=254,\"odstr\",IF(AND($A$1=\"TISK\",SUM(J26:N26)=0),\"odstr\",\"OK\"))","v":{"$error":"#REF!"}},"OK",null,null,5168,null,"Služby zpracování dat",null,null,22992.108,22237.342000000001,23343.980339999998,19930.090260000001,0.89624426606381291,null,null,515,null,"Nákupy vody, paliv a energie",null,null,{"$f":"SUM(V47:V52)","v":19631},{"$f":"SUM(W47:W52)","v":22922.821489999998},{"$f":"SUM(X47:X52)","v":24881.314660000004},{"$f":"SUM(Y47:Y52)","v":23111.445789999998},1.008228668538133,null,null,null,null,515,null,"Nákupy vody, paliv a energie",null,null,24086,22640.61969,{"$f":"SUM(AL47:AL53)","v":0},20244.688969999999,{"$f":"AM46/AK46","v":0.89417556794798136}]
[null,null,null,null,5169,null,"Nákup ostatních služeb",null,null,218895.046,147032.12700000001,165406.84591,95098.049769999998,0.64678415330276762,null,null,5151,null,"Studená voda",null,null,1400,1877.5550000000001,1877.5550000000001,1662.5059699999999,0.88546325939852621,null,null,null,null,5151,null,"Studená voda"]
[null,null,null,null,5171,null,"Opravy a udržování",null,null,9222.7549999999992,12832.527,13872.429,10784.204540000001,0.84038042857809692,null,null,5152,null,"Teplo",null,null,2445,2882.33284,3143.44436,2673.5809399999998,0.92757536634804461,null,null,null,null,5152,null,"Teplo"]
[null,null,null,null,5172,null,"Programové vybavení",null,null,4720,5483.1970000000001,5816.1210999999994,891.79759999999999,0.16264190398411729,null,null,5153,null,"Plyn",null,null,4596,4610.0839999999998,5361.0839999999998,5121.4304900000006,1.1109191264193887,null,null,null,null,5153,null,"Plyn"]
[null,null,null,null,5173,null,"Cestovné (tuzemské i zahraniční)",null,null,40496.786999999997,42454.559999999998,44398.621490000005,31604.710920000001,0.74443619060002042,null,null,5154,null,"Elektrická energie",null,null,4864,7285.2191800000001,8069.4294800000007,7739.61247,1.0623719449989149,null,null,null,null,5154,null,"Elektrická energie"]
[null,null,null,null,5175,null,"Pohoštění",null,null,2120.4699999999998,6240.4719999999998,6476.6719999999996,3185.5439799999999,0.51046523083510353,null,null,5156,null,"Pohonné hmoty a maziva",null,null,6056,5991.5452300000006,6117.9815799999997,5603.38285,0.93521497959216759,null,null,null,null,5156,null,"Pohonné hmoty a maziva"]
[null,null,null,null,5176,null,"Účastnické poplatky na konference",null,null,165,1510,1510,992.85675000000003,0.65752102649006627,null,null,5157,null,"Teplá voda",null,null,270,276.08524,311.82024000000001,310.93306999999999,1.1262212713725659,null,null,null,null,5157,null,"Teplá voda"]
[null,null,null,null,null,null,null,null,null,null,null,null,null,null,null,null,null,null,null,null,null,null,null,null,null,null,null,null,null,null,5159,null,"Nákup ostatních paliv a energie"]
[{"$f":"IF(COUNTBLANK(C54:IW54)=254,\"odstr\",IF(AND($A$1=\"TISK\",SUM(J27:N27)=0),\"odstr\",\"OK\"))","v":{"$error":"#REF!"}},"OK",null,null,5179,null,"Ostatní nákupy jinde nezařazené",null,null,6018,7236.8239999999996,7236.8239999999996,7222.9697999999999,0.99808559666505636,null,null,516,null,"Nákup služeb",null,null,{"$f":"SUM(V55:V62)","v":160374.68900000001},{"$f":"SUM(W55:W62)","v":239139.26772999999},{"$f":"SUM(X55:X62)","v":257957.4106},{"$f":"SUM(Y55:Y62)","v":185028.60339},0.77372739804031854,null,null,null,null,516,null,"Nákup služeb",null,null,191855.57500000001,240441.48264999999,{"$f":"SUM(AL55:AL62)","v":0},172980.65622,{"$f":"AM54/AK54","v":0.71942933604265069}]
[null,null,null,null,5181,null,"Poskytnuté zálohy vnitřním organizačním jednotkám",null,null,0,220,220,0,0,null,null,5161,null,"Poštovní služby",null,null,1781.25,1771.7969900000001,1944.45399,1752.9589900000001,0.9893678564156495,null,null,null,null,5161,null,"Poštovní služby"]
[null,null,null,null,5182,null,"Poskytované zálohy vlastní pokladně",null,null,0,0,0,0,"x ",null,null,5162,null,"Služby elektronických komunikací",null,null,9575.7360000000008,9991.3503000000001,10958.468369999999,5810.3718799999997,0.58154020282924113,null,null,null,null,5162,null,"Služby elektronických komunikací"]
[null,null,null,null,5189,null,"Ostatní poskytované zálohy a jistiny",null,null,0,0,0,0,"x ",null,null,5163,null,"Služby peněžních ústavů",null,null,1869,2303.9780000000001,2328.2719999999999,2243.2051200000001,0.97362263007719696,null,null,null,null,5163,null,"Služby peněžních ústavů"]
[null,null,null,null,5191,null,"Zaplacené sankce",null,null,0,29.861000000000001,29.861000000000001,29.77534,0.99713137537255947,null,null,5164,null,"Nájemné",null,null,30039.647000000001,64539.076150000001,65206.388850000003,58320.313419999999,0.90364344981408595,null,null,null,null,5164,null,"Nájemné"]
[null,null,null,null,5192,null,"Poskytnuté neinvestiční příspěvky a náhrady (část)",null,null,160,749.39400000000001,749.39400000000001,645.28300000000002,0.86107308038228225,null,null,5166,null,"Konzultační, poradenské a právní služby",null,null,1968.84,6802.9160000000002,7541.5060000000003,4050.2483999999999,0.59536945627433879,null,null,null,null,5166,null,"Konzultační, poradenské a právní služby"]
[null,null,null,null,5194,null,"Věcné dary",null,null,475,572.48699999999997,572.48699999999997,177.66929999999999,0.31034643581426302,null,null,5167,null,"Služby školení a vzdělávání",null,null,3107.52,4806.2620499999994,5931.2634500000004,4037.4853399999997,0.8400468592843372,null,null,null,null,5167,null,"Služby školení a vzdělávání"]
[null,null,null,null,5195,null,"Odvody za neplnění povinnosti zaměstnávat zdravotně postižené",null,null,364,264.60000000000002,264.60000000000002,264.60000000000002,1,null,null,5168,null,"Zpracování dat a služby související s informačními a komunikačními technologiemi",null,null,28703.058000000001,31190.018,33576.234109999998,18516.318190000002,0.59366167053831143,null,null,null,null,5168,null,"Zpracování dat a služby související s informačními a komunikačními technologiemi"]
[null,null,null,null,5196,null,"Náhrady a příspěvky související s výkonem ústavní funkce a funkce soudce",null,null,219.6,238.92,238.92,238.92,1,null,null,5169,null,"Nákup ostatních služeb",null,null,83329.638000000006,117733.87023999999,130470.82382999999,90297.702049999993,0.76696452657105818,null,null,null,null,5169,null,"Nákup ostatních služeb"]
[{"$f":"IF(COUNTBLANK(C63:IW63)=254,\"odstr\",IF(AND($A$1=\"TISK\",SUM(J28:N28)=0),\"odstr\",\"OK\"))","v":{"$error":"#REF!"}},"OK",null,null,51,null,"Neinvestiční nákupy a související výdaje",null,null,388976.79299999995,393701.91999999993,432226.51265999995,294364.74796999997,0.74768430890558024,null,null,517,null,"Ostatní nákupy",null,null,{"$f":"SUM(V64:V69)","v":92469.463000000003},{"$f":"SUM(W64:W69)","v":78096.007840000006},{"$f":"SUM(X64:X69)","v":83258.263930000001},{"$f":"SUM(Y64:Y69)","v":67816.058740000008},0.86836780285797521,null,null,null,null,517,null,"Ostatní nákupy",null,null,84600.987999999998,57385.990330000001,{"$f":"SUM(AL64:AL69)","v":28087.5821},35116.949379999998,{"$f":"AM63/AK63","v":0.61194290066371326}]
[null,null,null,null,5212,null,"Neinvestiční transfery nefinančním podnikatelským subjektům-fyzickým osobám",null,null,5375,1970.94,2115.94,1140.653,0.57873552721036658,null,null,5171,null,"Opravy a udržování",null,null,11019.939,16088.375480000001,19089.46384,16164.49252,1.0047311824674046,null,null,null,null,5171,null,"Opravy a udržování",null,null,12819.022999999999,12159.88733,10187.93325,10275.71803,{"$f":"AM64/AK64","v":0.84505043107171618}]
[null,null,null,null,5213,null,"Neinvestiční transfery nefinančním podnikatelským subjektům-právnickým osobám",null,null,582735.35100000002,655200.44499999995,992878.59223000007,844041.81713999994,1.2882192366948102,null,null,5172,null,"Programové vybavení",null,null,1881.723,1861.72,2008.184,175.11246,9.4059504114474779E-2,null,null,null,null,5172,null,"Programové vybavení"]
[null,null,null,null,5221,null,"Neinvestiční transfery obecně prospěšným společnostem",null,null,36604,58491.296000000002,296257.70199999999,254890.07769999999,4.357743717971303,null,null,5173,null,"Cestovné (tuzemské i zahraniční)",null,null,70594.331000000006,53979.995170000002,55714.665689999994,47256.564859999999,0.87544588900340203,null,null,null,null,5173,null,"Cestovné (tuzemské i zahraniční)",null,null,64284.042000000001,39492.933060000003,17899.648849999998,22803.537629999999,{"$f":"AM66/AK66","v":0.57740805412845675}]
[null,null,null,null,5222,null,"Neinvestiční transfery občanským sdružením",null,null,4795705.2980000004,4326945.1500000004,4613479.665,4431366.1406000005,1.0241327280517989,null,null,5175,null,"Pohoštění",null,null,2735.47,5726.3371900000002,5890.1575000000003,3948.3464900000004,0.68950646093545886,null,null,null,null,5175,null,"Pohoštění"]
[null,null,null,null,5223,null,"Neinvestiční transfery církvím a náboženským společnostem",null,null,1428972.9739999999,1532501.15,1613387.6270000001,1591329.80987,1.0383873512068817,null,null,5176,null,"Účastnické poplatky na konference",null,null,200,401,516.98289999999997,269.70840999999996,0.67258955112219443,null,null,null,null,5176,null,"Účastnické poplatky na konference"]
[null,null,null,null,5229,null,"Ostatní neinvestiční transfery neziskovým a podobným organizacím",null,null,691665,325814.86200000002,380984.96299999999,331556.12573000003,1.017621245681543,null,null,5179,null,"Ostaní nákupy jinde nezařazené",null,null,6038,38.58,38.81,1.8340000000000001,4.7537584240539145E-2,null,null,null,null,5179,null,"Ostaní nákupy jinde nezařazené"]
[{"$f":"IF(COUNTBLANK(C70:IW70)=254,\"odstr\",IF(AND($A$1=\"TISK\",SUM(J29:N29)=0),\"odstr\",\"OK\"))","v":{"$error":"#REF!"}},"OK",null,null,5230,null,"Neinvestiční nedotační transfery podnikatelským subjektům",null,null,0,0,0,0,"x ",null,null,518,null,"Poskytnuté zálohy, jistiny a záruky",null,null,{"$f":"SUM(V71:V72)","v":0},{"$f":"SUM(W71:W72)","v":17.028230000000001},{"$f":"SUM(X71:X72)","v":17.028230000000001},{"$f":"SUM(Y71:Y72)","v":0},0,null,null,null,null,518,null,"Poskytnuté zálohy, jistiny a záruky",null,null,{"$f":"SUM(AJ71:AJ72)","v":0},{"$f":"SUM(AK71:AK72)","v":0},{"$f":"SUM(AL71:AL73)","v":0.6},{"$f":"SUM(AM71:AM73)","v":0.6},0]
[null,null,null,null,5240,null,"Neinvestiční nedotační transfery neziskovým a podobným organizacím",null,null,0,0,0,0,"x ",null,null,5181,null,"Poskytnuté zálohy vnitřním organizačním jednotkám",null,null,0,9,9,0,0,null,null,null,null,5181,null,"Převody vnitřním organizačním jednotkám",null,null,0,0,0,0,0]
[null,null,null,null,52,null,"Neinvestiční transfery podnikatelským subjektům a neziskovým organizacím. Neinvestiční transfery soukromoprávním subjektům",null,null,7541057.6229999997,6900923.8430000003,7899104.4892299995,7454324.6240400011,1.0801922747780135,null,null,5182,null,"Poskytnuté zálohy vlastní pokladně",null,null,0,8.0282299999999989,8.0282299999999989,0,0,null,null,null,null,5182,null,"Převody vlastní pokladně",null,null,0,0,0,0,0]
[null,null,null,null,null,null,null,null,null,null,null,null,null,null,null,null,null,null,null,null,null,null,null,null,null,null,null,null,null,null,5189,null,"Jistoty",null,null,0,0,0.6,0.6,0]
[{"$f":"IF(COUNTBLANK(C74:IW74)=254,\"odstr\",IF(AND($A$1=\"TISK\",SUM(J30:N30)=0),\"odstr\",\"OK\"))","v":{"$error":"#REF!"}},"OK",null,null,5321,null,"Neinvestiční dotace obcím",null,null,10779967.124,12553597.652000001,15369169.676000001,14984063.056289999,1.1936070815446904,null,null,519,null,"Výdaje související s neivestičními nákupy, příspěvky, náhrady a věcné dary",null,null,{"$f":"SUM(V75:V79)","v":1565.3},{"$f":"SUM(W75:W81)","v":2034.7239999999999},{"$f":"SUM(X75:X81)","v":2128.1260600000001},{"$f":"SUM(Y75:Y81)","v":1654.91509},0.81333639845010919,null,null,null,null,519,null,"Výdaje související s neivestičními nákupy, příspěvky, náhrady a věcné dary",null,null,{"$f":"SUM(AJ75:AJ81)","v":1335},{"$f":"SUM(AK75:AK81)","v":2091.2649999999999},{"$f":"SUM(AL75:AL81)","v":2091.2649999999999},{"$f":"SUM(AM75:AM81)","v":1500.0338999999999},{"$f":"AM74/AK74","v":0.71728542293779118}]
[null,null,null,null,5323,null,"Neinvestiční dotace krajům",null,null,89220432.452999994,90693638.825000003,91588230.835679993,91013283.629889995,1.0035244456946619,null,null,5191,null,"Zaplacené sankce",null,null,0,9.3420000000000005,9.3420000000000005,7.3410799999999998,0.78581460072789544,null,null,null,null,5191,null,"Zaplacené sankce",null,null,0,0,0,0,0]
[null,null,null,null,5329,null,"Ostatní neinvestiční dotace veřejným rozpočtům územní úrovně",null,null,0,564.69399999999996,19134.401000000002,19037.26154,33.712526678165524,null,null,5192,null,"Poskytnuté náhrady",null,null,250,433.97699999999998,433.97699999999998,387.62559999999996,0.89319387893828472,null,null,null,null,5192,null,"Poskytnuté náhrady",null,null,340,496.88,496.88,308.36359999999996,{"$f":"AM76/AK76","v":0.62059974239252935}]
[null,null,null,null,5331,null,"Neinvestiční příspěvky zřízeným příspěvkovým organizacím",null,null,3339486.4270000001,3363723.9890000001,3375449.5559999999,3323142.2772199996,0.98793548105828233,null,null,5194,null,"Věcné dary",null,null,495.7,476.4,476.4,108.9586,0.22871242653232579,null,null,null,null,5194,null,"Věcné dary",null,null,475.4,465.4,465.4,108.3373,{"$f":"AM77/AK77","v":0.23278319724967769}]
[null,null,null,null,5332,null,"Neinvestiční dotace vysokým školám",null,null,33122116.440000001,32767330.877,34385203.288559996,29769946.752870001,0.90852522790515355,null,null,5195,null,"Odvody za neplnění povinností zaměstnávat zdravotně postižené",null,null,600,113.97199999999999,113.97199999999999,113.97199999999999,1,null,null,null,null,5195,null,"Odvody za neplnění povinností zaměstnávat zdravotně postižené",null,null,300,825.38499999999999,825.38499999999999,779.73299999999995,{"$f":"AM78/AK78","v":0.94469005373250059}]
[null,null,null,null,5334,null,"Neinvestiční transfery veřejným výzkumným institucím",null,null,1043935.084,1499257.4639999999,1947033.0460000001,1800709.62678,1.2010676418283286,null,null,5196,null,"Náhrady a příspěvky související s výkonem ústavní funkce a funkce soudce",null,null,219.6,324.8,324.8,274.8,0.84605911330049266,null,null,null,null,5196,null,"Náhrady a příspěvky související s výkonem ústavní funkce a funkce soudce",null,null,219.6,303.60000000000002,303.60000000000002,303.60000000000002,{"$f":"AM79/AK79","v":1}]
[null,null,null,null,null,null,null,null,null,null,null,null,null,null,null,null,5197,null,"Náhrady zvýšených nákladů spojených s výkonem funkce v zahraničí",null,null,null,676.23299999999995,769.63506000000007,762.2178100000001,1.1271526382178927,null,null,null,null,5197,null,"Náhrady zvýšených nákladů spojených s výkonem funkce v zahraničí",null,null,0,0,0,0,0]
[null,null,null,null,null,null,null,null,null,null,null,null,null,null,null,null,5199,null,"Ostatní výdaje související s neinvestičními nákupy",null,null,null,0,null,0,"x",null,null,null,null,5199,null,"Ostatní výdaje související s neinvestičními nákupy",null,null,null,null,null,null,"x"]
[null,null,null,null,5336,null,"Neinvestiční dotace zřízeným příspěvkovým organizacím",null,null,713266.62600000005,1097051.05,1324519.8513200001,785985.71882000007,0.71645318494522203,null,null,52,null,"Neinvestiční transfery soukromoprávním subjektům ",null,null,{"$f":"V83+V86","v":7562866.1560000004},{"$f":"SUM(W83,W86)","v":8793182.9059999995},{"$f":"SUM(X83,X86)","v":9476426.1013000011},{"$f":"SUM(Y83,Y86)","v":8960276.7267300002},{"$f":"Y82/W82","v":1.0190026549562599},null,null,null,null,52,null,"Neinvestiční transfery soukromoprávním subjektům ",null,null,{"$f":"SUM(AJ83,AJ86)","v":7814651.9310000008},{"$f":"SUM(AK83,AK86)","v":8856866.2870000005},{"$f":"SUM(AL83,AL86)","v":497041.89500000002},{"$f":"SUM(AM83,AM86)","v":9181231.5797499996},{"$f":"AM82/AK82","v":1.0366230314695051}]
[null,null,null,null,5339,null,"Neinvestiční příspěvky ostatním příspěvkovým organizacím",null,null,447492,366772.50599999999,390768.50599999999,388315.39731000003,1.0587363855184937,null,null,521,null,"Neinvestiční transfery podnikatelským subjektům ",null,null,{"$f":"SUM(V84:V85)","v":464531.9},{"$f":"SUM(W84:W85)","v":842285.36199999996},{"$f":"SUM(X84:X85)","v":979974.69698999997},{"$f":"SUM(Y84:Y85)","v":853703.97589999996},1.0135567046694087,null,null,null,null,521,null,"Neinvestiční transfery podnikatelským subjektům ",null,null,462594.4,652135.07999999996,{"$f":"SUM(AL84:AL85)","v":0},772594.63792000001,{"$f":"AM83/AK83","v":1.1847156541862462}]
[null,null,null,null,5342,null,"Převody fondu kulturních a sociálních potřeb a sociálnímu fondu obcí a krajů",null,null,15345.231,15604.419,15835.388000000001,15063.028360000002,0.96530529973592749,null,null,5212,null,"Neinvestiční transfery nefinančním podnikatelským subjektům - fyzickým osobám",null,null,0,147.934,355.38,350.38,2.3684886503440725,null,null,null,null,5212,null,"Neinvestiční transfery nefinančním podnikatelským subjektům - fyzickým osobám"]
[null,null,null,null,5361,null,"Nákup kolků",null,null,0,24,24,24,1,null,null,5213,null,"Neinvestiční transfery nefinančním podnikatelským subjektům - právnickým osobám",null,null,464531.9,842137.42799999996,979619.31698999996,853353.59589999996,1.0133186906638711,null,null,null,null,5213,null,"Neinvestiční transfery nefinančním podnikatelským subjektům - právnickým osobám"]
[null,null,null,null,5362,null,"Platby daní a poplatků státnímu rozpočtu",null,null,322,490.51299999999998,490.51299999999998,443.46100000000001,0.90407593682532372,null,null,522,null,"Neinvestiční transfery neziskovým a podobným organizacím ",null,null,{"$f":"SUM(V87:V90)","v":7098334.2560000001},{"$f":"SUM(W87:W90)","v":7950897.5439999998},{"$f":"SUM(X87:X90)","v":8496451.4043100011},{"$f":"SUM(Y87:Y90)","v":8106572.7508300003},1.0195795765155442,null,null,null,null,522,null,"Neinvestiční transfery neziskovým a podobným organizacím ",null,null,7352057.5310000004,8204731.2070000004,{"$f":"SUM(AL87:AL90)","v":497041.89500000002},8408636.9418299999,{"$f":"AM86/AK86","v":1.0248522138855729}]
[null,null,null,null,5363,null,"Úhrady sankcí jiným rozpočtům",null,null,0,2534.0819999999999,7894.9949999999999,6054.3220000000001,2.3891578883398408,null,null,5221,null,"Neinvestiční transfery obecně prospěšným společnostem",null,null,25749,401492.826,473577.85913999996,449219.79835,1.118873786178187,null,null,null,null,5221,null,"Neinvestiční transfery obecně prospěšným společnostem"]
[null,null,null,null,5365,null,"Výdaje z finančního vypořádání minulých let mezi krajem a obcemi",null,null,0,0,0,0,"x ",null,null,5222,null,"Neinvestiční tranfery spolkům ",null,null,4991054.6349999998,5730369.7029999997,6019660.5279200003,5668268.0707600005,0.98916271803414579,null,null,null,"z toho",5222,null,"Neinvestiční tranfery spolkům ",null,null,5000337.8159999996,5770040.0460000001,497041.89500000002,5759746.2807900002,{"$f":"AM88/AK88","v":0.99821599761389246}]
[null,null,null,null,53,null,"Neinvestiční transfery veřejnoprávním subjektům a mezi peněžními fondy téhož subjektu",null,null,138682363.38499999,142360590.07100001,148423754.05656001,142106068.53207999,0.99821213484158022,null,null,5223,null,"Neinvestiční transfery církvím a náboženským společnostem",null,null,1718081.121,1818834.6189999999,2003012.6212500001,1988994.8817199999,1.0935545546266072,null,null,null,null,5223,null,"Neinvestiční transfery církvím a náboženským společnostem"]
[null,null,null,null,5422,null,"Náhrady povahy rehabilitací",null,null,0,0,0,0,"x ",null,null,5229,null,"Ostatní neinvestiční transfery neziskovým a podpbným organizacím ",null,null,363449.5,200.39599999999999,200.39599999999999,90,0.44911076069382627,null,null,null,null,5229,null,"Ostatní neinvestiční transfery neziskovým a podobným organizacím ",null,null,346222.5,1090,0,90,{"$f":"AM90/AK90","v":8.2568807339449546E-2}]
[null,null,null,null,5424,null,"Náhrady mezd v době nemoci",null,null,3021,3001,3001,2321.6849999999999,0.77363712095968007,null,null,53,null,"Neinvestiční transfery veřejnoprávním subjektům a mezi peněžními fondy téhož subjektu a platby daní",null,null,{"$f":"V92+V96+V102+V104","v":186098258.23100001},{"$f":"SUM(W92,W96,W102,W104)","v":189074961.28899997},{"$f":"SUM(X92,X96,X102,X104)","v":192999273.20452997},{"$f":"SUM(Y92,Y96,Y102,Y104)","v":187984060.14886004},0.99423032466751371,null,null,null,null,53,null,"Neinvestiční transfery veřejnoprávním subjektům a mezi peněžními fondy téhož subjektu a platby daní",null,null,{"$f":"SUM(AJ92,AJ96,AJ102,AJ104)","v":209837639.35299999},{"$f":"SUM(AK92,AK96,AK102,AK104)","v":206494805.66600001},{"$f":"SUM(AL92,AL96,AL102,AL104)","v":162140312.43625},{"$f":"SUM(AM92,AM96,AM102,AM104)","v":206357715.58037001},0.99933610879369172]
[null,null,null,null,5491,null,"Stipendia studentům a doktorandům",null,null,4231,5678.6,5678.6,5069.5,0.89273764660303589,null,null,532,null,"Neinvestiční transfery veřejným rozpočtům územní úrovně ",null,null,{"$f":"SUM(V93:V95)","v":141365291.727},{"$f":"SUM(W93:W95)","v":143943645.70699999},{"$f":"SUM(X93:X95)","v":145223510.80835},{"$f":"SUM(Y93:Y95)","v":142861968.33124},0.99248541072829455,null,null,null,null,532,null,"Neinvestiční transfery veřejným rozpočtům územní úrovně ",null,null,160497083.454,159654260.45300001,{"$f":"SUM(AL93:AL95)","v":162122320.96919},160125570.81244999,1.0029520687898505]
[null,null,null,null,5492,null,"Dary obyvatelstvu",null,null,1377,0,900,900,"x ",null,null,5321,null,"Neinvestiční transfery obcím",null,null,16849859.412,21855505.717,22476174.416810002,21509056.441330001,0.98414819221499328,null,null,null,"v tom",5321,null,"Neinvestiční transfery obcím",null,null,21674480.513,20335322.254000001,20638889.395209998,20465680.559300002,1.0064104371532328]
[null,null,null,null,5494,null,"Neinvestiční transfery obyvatelstvu nemající charakter daru",null,null,50,250,945,945,3.78,null,null,5323,null,"Neinvestiční transfery krajům",null,null,124515432.315,122059365.756,122718562.15753999,121325317.68225999,0.99398613888255505,null,null,null,null,5323,null,"Neinvestiční transfery krajům",null,null,138822602.94100001,139306324.204,140415558.44698,139639720.28062001,1.0023932587305353]
[null,null,null,null,5499,null,"Ostatní neinvestiční transfery obyvatelstvu",null,null,0,0,0,0,"x ",null,null,5329,null,"Ostatní neinvestiční transfery veřejným rozpočtům územní úrovně",null,null,0,28774.234,28774.234,27594.20765,0.95899017329184155,null,null,null,null,5329,null,"Ostatní neinvestiční transfery veřejným rozpočtům územní úrovně",null,null,0,12613.995000000001,1067873.1269999999,20169.972529999999,1.5990154213633347]
[null,null,null,null,54,null,"Neinvestiční transfery obyvatelstvu",null,null,8679,8929.6,10524.6,9236.1849999999995,1.034333564773338,null,null,533,null,"Neinvestiční transfery příspěvkovým a podobným organizacím ",null,null,{"$f":"SUM(V97:V101)","v":44715567.060000002},{"$f":"SUM(W97:W101)","v":45110603.217000008},{"$f":"SUM(X97:X101)","v":47751391.320479989},{"$f":"SUM(Y97:Y101)","v":45101317.802550003},0.99979416337207161,null,null,null,null,533,null,"Neinvestiční transfery příspěvkovým a podobným organizacím ",null,null,49322092.435000002,46821494.751999997,{"$f":"SUM(AL97:AL101)","v":0},46213726.136859998,0.9870194529593902]
[null,null,null,null,5511,null,"Neinvestiční transfery mezinárodním organizacím",null,null,538196.1,0,0,0,"x ",null,null,5331,null,"Neinvestiční příspěvky zřízeným příspěvkovým organizacím ",null,null,4094417.2689999999,4048993.0809999998,4065540.8560000001,3984099.6409999998,0.98397294371667021,null,null,null,null,5331,null,"Neinvestiční příspěvky zřízeným příspěvkovým organizacím "]
[null,null,null,null,5531,null,"Peněžní dary do zahraničí",null,null,3002.3580000000002,2903.201,2903.201,2903.2003599999998,0.99999977955367192,null,null,5332,null,"Neinvestiční transfery vysokým školám",null,null,37820467.009000003,37485117.162,39298612.453339994,37482971.956629999,0.99994277181099023,null,null,null,null,5332,null,"Neinvestiční transfery vysokým školám"]
[null,null,null,null,5532,null,"Ostatní neinvestiční transfery do zahraničí",null,null,3334,13865.179,30565.179,23344.308519999999,1.6836644171705246,null,null,5334,null,"Neinvestiční transfery veřejným výzkumným institucím ",null,null,1246101.081,2387250.943,2818593.5869999998,2483530.3821900003,1.0403306738540894,null,null,null,null,5334,null,"Neinvestiční transfery veřejným výzkumným institucím "]
[null,null,null,null,5541,null,"Členské příspěvky mezinárodním vládním organizacím",null,null,0,876675.55,876675.55,835256.90615000005,0.95275487738878994,null,null,5336,null,"Neinvestiční transfery zřízeným příspěvkovým organizacím ",null,null,1208390.7009999999,845712.03099999996,1222519.1991400002,821803.38773000007,0.97172956941178967,null,null,null,null,5336,null,"Neinvestiční transfery zřízeným příspěvkovým organizacím "]
[null,null,null,null,5542,null,"Členské příspěvky mezinárodním nevládním organizacím",null,null,0,4922.7619999999997,8222.7620000000006,7589.35761,1.5416868843141311,null,null,5339,null,"Neinvestiční transfery cizím příspěvkovým organizacím ",null,null,346191,343530,346125.22499999998,328912.435,0.95744894186825025,null,null,null,null,5339,null,"Neinvestiční transfery cizím příspěvkovým organizacím "]
[null,null,null,null,55,null,"Neinvestiční transfery do zahraničí",null,null,544532.45799999998,898366.69200000004,918366.69200000004,869093.77263999998,0.96741539994672909,null,null,534,null,"Převod vlastním fondům a ve vztahu k útvarům bez plné právní subjektivity",null,null,{"$f":"V103","v":17237.444},{"$f":"W103","v":17270.892},{"$f":"X103","v":18389.2487},{"$f":"Y103","v":17257.9257},0.99924923970342705,null,null,null,null,534,null,"Převod vlastním fondům a ve vztahu k útvarům bez plné právní subjektivity",null,null,18266.463,18275.726999999999,{"$f":"AL103","v":17991.467059999999},18101.334060000001,{"$f":"AM102/AK102","v":0.99045767426926445}]
[null,null,null,null,5909,null,"Ostatní neinvestiční výdaje jinde nezařazené",null,null,0,3155.4,3155.4,2105.7031900000006,"x ",null,null,5342,null,"Převody fondu kulturních a sociálních potřeb a sociálnímu fondu obcí a krajů",null,null,17237.444,17270.892,18389.2487,17257.9257,0.99924923970342705,null,null,null,null,5342,null,"Převody fondu kulturních a sociálních potřeb a sociálnímu fondu obcí a krajů",null,null,18266.463,18275.726999999999,17991.467059999999,18101.334060000001,{"$f":"AM103/AK103","v":0.99045767426926445}]
[null,null,null,null,59,null,"Ostatní neinvestiční výdaje",null,null,0,3155.4,3155.4,2105.7031900000006,"x ",null,null,536,"Ostatní neinvestiční transfery jiným veřejným rozpočtům, platby daní a další povinné platby",null,null,null,{"$f":"SUM(V105:V108)","v":162},{"$f":"SUM(W105:W108)","v":3441.473},{"$f":"SUM(X105:X108)","v":5981.8269999999993},{"$f":"SUM(Y105:Y108)","v":3516.0893699999997},1.0216815212555785,null,null,null,null,536,"Ostatní neinvestiční transfery jiným veřejným rozpočtům, platby daní a další povinné platby",null,null,null,197.001,774.73400000000004,{"$f":"SUM(AL105:AL108)","v":0},317.29700000000003,{"$f":"AM104/AK104","v":0.40955605407791579}]
[null,null,null,null,5,null,"Běžné výdaje",null,null,148332711.70199999,151760634.234,158964900.40645,151878791.01672998,1.0007785733324479,null,null,5361,null,"Nákup kolků",null,null,0,27,27,27,1,null,null,null,null,5361,null,"Nákup kolků"]
[null,null,null,null,6111,null,"Programové vybavení",null,null,0,4029.9589999999998,7322.6466,5845.8145999999997,1.450589100286132,null,null,5362,null,"Platba daní a poplatků státnímu rozpočtu",null,null,162,323.50099999999998,353.85500000000002,316.49,0.97832773314456534,null,null,null,null,5362,null,"Platba daní a poplatků státnímu rozpočtu"]
[{"$f":"IF(COUNTBLANK(C107:IW107)=254,\"odstr\",IF(AND($A$1=\"TISK\",SUM(J31:N31)=0),\"odstr\",\"OK\"))","v":{"$error":"#REF!"}},"OK",null,null,6112,null,"Ocenitelná práva",null,null,0,0,0,0,"x ",null,null,5363,null,"Úhrady sankcí jiným rozpočtům",null,null,0,3090.9720000000002,5600.9719999999998,3172.5993699999999,1.0264083175130669,null,null,null,null,5363,null,"Úhrady sankcí jiným rozpočtům"]
[{"$f":"IF(COUNTBLANK(C108:IW108)=254,\"odstr\",IF(AND($A$1=\"TISK\",SUM(J33:N33)=0),\"odstr\",\"OK\"))","v":{"$error":"#REF!"}},"OK",null,null,6121,null,"Budovy, haly a stavby",null,null,66869.070000000007,63634.74,68948.126640000002,5307.2606999999998,8.340193894089927E-2,null,null,5365,null,"Platby daní a poplatků krajům, obcím a státním fondům",null,null,null,null,null,null,"x",null,null,null,null,5365,null,"Platby daní a poplatků krajům, obcím a státním fondům"]
[{"$f":"IF(COUNTBLANK(C109:IW109)=254,\"odstr\",IF(AND($A$1=\"TISK\",SUM(J34:N34)=0),\"odstr\",\"OK\"))","v":{"$error":"#REF!"}},"OK",null,null,6122,null,"Stroje, přístroje a zařízení",null,null,0,13213.119000000001,13213.119000000001,12738.096599999999,0.9640491847534256,null,null,54,null,"Neinvestiční transfery obyvatelstvu",null,null,{"$f":"V110+V112","v":8254.8739999999998},{"$f":"SUM(W110,W112)","v":11578.139000000001},{"$f":"SUM(X110,X112)","v":12110.006000000001},{"$f":"SUM(Y110,Y112)","v":10318.45004},0.89120108507938955,null,null,null,null,54,null,"Neinvestiční transfery obyvatelstvu",null,null,{"$f":"SUM(AJ110,AJ112)","v":9866.5920000000006},{"$f":"SUM(AK110,AK112)","v":59403.945},{"$f":"SUM(AL110,AL112)","v":4620.2969999999996},{"$f":"SUM(AM110,AM112)","v":57568.758999999998},{"$f":"AM109/AK109","v":0.96910666454896222}]
[null,null,null,null,6123,null,"Dopravní prostředky",null,null,0,1812.5820000000001,8870.5708300000006,8870.5708300000006,4.8938866379562418,null,null,542,null,"Náhrady placené obyvatelstvu",null,null,{"$f":"V111","v":2161.8739999999998},{"$f":"W111","v":3931.0390000000002},{"$f":"SUM(X111)","v":3962.9059999999999},{"$f":"Y111","v":3773.3700400000002},0.95989127556353426,null,null,null,null,542,null,"Náhrady placené obyvatelstvu",null,null,3347.0920000000001,3631.9450000000002,{"$f":"AL111","v":4620.2969999999996},3719.0590000000002,{"$f":"AM110/AK110","v":1.0239854953750676}]
[null,null,null,null,6125,null,"Výpočetní technika",null,null,0,774.92499999999995,6643.2219999999998,5564.8212800000001,7.1811095009194448,null,null,5424,null,"Náhrady mezd v době nemoci",null,null,2161.8739999999998,3931.0390000000002,3962.9059999999999,3773.3700400000002,0.95989127556353426,null,null,null,null,5424,null,"Náhrady mezd v době nemoci",null,null,3297.0920000000001,3581.9450000000006,4620.2969999999996,3681.7509999999997,{"$f":"AM111/AK111","v":1.027863632747013}]
[null,null,null,null,6127,null,"Umělecká díla a předměty",null,null,0,0,0,0,"x ",null,null,549,null,"Ostatní neinvestiční transfery obyvatelstvu",null,null,{"$f":"SUM(V113:V115)","v":6093},{"$f":"SUM(W113:W115)","v":7647.1},{"$f":"SUM(X113:X115)","v":8147.1},{"$f":"SUM(Y113:Y115)","v":6545.08},0.85589046828209381,null,null,null,null,549,null,"Ostatní neinvestiční transfery obyvatelstvu",null,null,6519.5,55772,{"$f":"SUM(AL113:AL115)","v":0},53849.7,{"$f":"AM112/AK112","v":0.96553288388438641}]
[null,null,null,null,null,null,null,null,null,null,null,null,null,null,null,null,5491,null,"Stipendia žákům, studentům a doktorandům ",null,null,4993,5980.6,5980.6,4490.8,0.75089455907434033,null,null,null,null,5491,null,"Stipendia žákům, studentům a doktorandům "]
[null,null,null,null,61,null,"Investiční nákupy a související výdaje",null,null,66869.070000000007,83465.324999999997,104997.68507000001,38326.564010000002,0.45919145477478224,null,null,5492,null,"Dary obyvatelstvu",null,null,900,1000,1000,1000,1,null,null,null,null,5492,null,"Dary obyvatelstvu"]
[null,null,null,null,null,null,null,null,null,null,null,null,null,null,null,null,5494,null,"Neinvestiční transfery obyvatelstvu nemající charakter daru",null,null,200,666.5,1166.5,1054.28,1.5818154538634659,null,null,null,null,5494,null,"Neinvestiční transfery obyvatelstvu nemající charakter daru"]
[{"$f":"IF(COUNTBLANK(C116:IW116)=254,\"odstr\",IF(AND($A$1=\"TISK\",SUM(J35:N35)=0),\"odstr\",\"OK\"))","v":{"$error":"#REF!"}},"OK",null,null,6313,null,"Investiční dotace nefinančním podnikatelským subjektům – právnickým osobám",null,null,0,7273.7879999999996,287668.70289999997,243036.92173,33.412703495070247,null,null,55,null,"Neinvestiční transfery a související platby do zahraničí",null,null,{"$f":"V117+V119+V122","v":752070.674},{"$f":"SUM(W117,W119,W122)","v":967256.46200000006},{"$f":"SUM(X117,X119,X122)","v":1022617.61974},{"$f":"SUM(Y117,Y119,Y122)","v":948917.89905000001},0.98104064054316953,null,null,null,null,55,null,"Neinvestiční transfery a související platby do zahraničí",null,null,{"$f":"SUM(AJ117,AJ119,AJ122)","v":750875.777},{"$f":"SUM(AK117,AK119,AK122)","v":1015389.531},{"$f":"SUM(AL117,AL119,AL122)","v":20441.503000000001},{"$f":"SUM(AM117,AM119,AM122)","v":1116321.04054},{"$f":"AM116/AK116","v":1.0994017630264499}]
[null,null,null,null,6319,null,"Ostatní investiční dotace podnikatelským subjektům",null,null,20800,10475.25,10475.25,10346,0.98766139232953865,null,null,551,null,"Neinvestiční transfery mezinárodním vládním organizacím a nadnárodním orgánům",null,null,0,0,{"$f":"X118","v":3300},{"$f":"Y118","v":3263.904},0,null,null,null,null,551,null,"Neinvestiční transfery mezinárodním vládním organizacím a nadnárodním orgánům",null,null,0,3300,{"$f":"AL118","v":0},5335.5736399999996,{"$f":"AM117/AK117","v":1.6168404969696968}]
[{"$f":"IF(COUNTBLANK(C118:IW118)=254,\"odstr\",IF(AND($A$1=\"TISK\",SUM(J36:N36)=0),\"odstr\",\"OK\"))","v":{"$error":"#REF!"}},"OK",null,null,6321,null,"Investiční transfery obecně prospěšným organizacím",null,null,0,5015,5015,4515,0.90029910269192426,null,null,5511,null,"Neinvestiční transfery mezinárodním vládním organizacím",null,null,0,0,3300,3263.904,0,null,null,null,null,5511,null,"Neinvestiční transfery mezinárodním vládním organizacím",null,null,null,null,null,null,"x"]
[null,null,null,null,6322,null,"Investiční transfery občanským sdružením",null,null,875194.1,805193.47400000005,829670.06735000003,77875.46385,9.6716461775496199E-2,null,null,553,null,"Ostatní neinvestiční transfery do zahraničí ",null,null,{"$f":"SUM(V120:V121)","v":35003.858},{"$f":"SUM(W120:W121)","v":108170.636},{"$f":"SUM(X120:X121)","v":160170.636},{"$f":"SUM(Y120:Y121)","v":153280.25513000001},1.4170227780670532,null,null,null,null,553,null,"Ostatní neinvestiční transfery do zahraničí ",null,null,33808.961000000003,16435.34,{"$f":"SUM(AL120:AL121)","v":14247.34},13124.52586,{"$f":"AM119/AK119","v":0.79855517804925236}]
[null,null,null," ",6329,null,"Ostatní investiční transfery neziskovým a podobným organizacím",null,null,52940,36439.449999999997,45592,45592,1.2511714638942137,null,null,5531,null,"Peněžní dary do zahraničí",null,null,3002.3580000000002,6015.3760000000002,6015.3760000000002,5722.9084000000003,0.95137999686137664,null,null,null,null,5531,null,"Peněžní dary do zahraničí",null,null,6262.3580000000002,6242.3580000000002,6242.3580000000002,6071.0658300000005,0.9725597009976038]
[null,null,null,null,6341,null,"Investiční transfery obcím",null,null,619690,686309.95600000001,900487.18174999999,413729.95716000005,0.60283251545894823,null,null,5532,null,"Ostatní neinvestiční transfery do zahraničí ",null,null,32001.5,102155.26,154155.26,147557.34672999999,1.4444419869324399,null,null,null,null,5532,null,"Ostatní neinvestiční transfery do zahraničí ",null,null,7546.6030000000001,8004.982,8004.982,5908.5395099999996,0.73810778212867934]
[null,null,null,null,6342,null,"Investiční transfery krajům",null,null,0,1251.481,9180.8382000000001,6362.3538899999994,5.0838597549623206,null,null,554,null,"Členské příspěvky mezinárodním organizacím ",null,null,{"$f":"SUM(V123:V124)","v":717066.81599999999},{"$f":"SUM(W123:W124)","v":859085.826},{"$f":"SUM(X123:X124)","v":859146.98374000005},{"$f":"SUM(Y123:Y124)","v":792373.73991999996},0.922345260437343,null,null,null,null,554,null,"Členské příspěvky mezinárodním organizacím ",null,null,717066.81599999999,995654.19099999999,{"$f":"SUM(AL123:AL124)","v":6194.1630000000005},1097860.9410399999,1.1026528597618286]
[null,null,null,null,6349,null,"Ostatní investiční transfery veřejným rozpočtům územní úrovně",null,null,0,11600,11600,6485.4211699999996,0.55908803189655165,null,null,5541,null,"Členské příspěvky mezinárodním vládním organizacím",null,null,710066.81599999999,848331.527,848331.527,785499.64749,0.92593475839310635,null,null,null,null,5541,null,"Členské příspěvky mezinárodním vládním organizacím",null,null,0,1563.117,1563.117,1563.1162300000001,0.99999950739452015]
[null,null,null,null,6351,null,"Investiční dotace zřízeným příspěvkovým a podobným organizacím",null,null,127041.553,91623.523000000001,156887.01329,54440.493450000002,0.59417594595222012,null,null,5542,null,"Členské příspěvky mezinárodním nevládním organizacím ",null,null,7000,10754.299000000001,10815.45674,6874.0924299999997,0.63919484012858474,null,null,null,null,5542,null,"Členské příspěvky mezinárodním nevládním organizacím ",null,null,0,4631.0460000000003,4631.0460000000003,4594.5944,0.99212886246433307]
[null,null,null,null,null,null,null,null,null,null,null,null,null,null,null,null,58,null,"Výdaje na náhrady za nezpůsobilou újmu",null,null,null,{"$f":"SUM(W126)","v":330.75200000000001},{"$f":"X126","v":330.75200000000001},{"$f":"Y126","v":330.75200000000001},1,null,null,null,null,58,null,"Výdaje na náhrady za nezpůsobilou újmu",null,null,0,600,{"$f":"AL126","v":600},348.88400000000001,0.5814733333333334]
[null,null,null,null,null,null,null,null,null,null,null,null,null,null,null,null,581,null,"Výdaje na náhrady za nezpůsobilou újmu",null,null,null,{"$f":"W127","v":330.75200000000001},{"$f":"X127","v":330.75200000000001},{"$f":"Y127","v":330.75200000000001},1,null,null,null,null,581,null,"Výdaje na náhrady za nezpůsobilou újmu",null,null,0,600,600,348.88400000000001,0.5814733333333334]
[null,null,null,null,null,null,null,null,null,null,null,null,null,null,null,null,5811,null,"Výdaje na náhrady za nezpůsobilou újmu",null,null,null,330.75200000000001,330.75200000000001,330.75200000000001,1,null,null,null,null,5811,null,"Výdaje na náhrady za nezpůsobilou újmu",null,null,0,600,600,348.88400000000001,0.5814733333333334]
[{"$f":"IF(COUNTBLANK(C128:IW128)=254,\"odstr\",IF(AND($A$1=\"TISK\",SUM(J37:N37)=0),\"odstr\",\"OK\"))","v":{"$error":"#REF!"}},"OK",null,null,6352,null,"Investiční dotace vysokým školám",null,null,6362451.9639999997,5670556.591,8493027.9409400001,2951214.9509899998,0.52044537491681298,null,null,59,null,"Ostatní neinvestiční výdaje",null,null,{"$f":"V129","v":37138.531999999999},{"$f":"W129","v":15419.459000000001},{"$f":"X129","v":15419.459000000001},{"$f":"Y129","v":2216.0900799999999},0.14372035231586269,null,null,null,null,59,null,"Ostatní neinvestiční výdaje",null,null,3000,48615.881000000001,{"$f":"AL129","v":45615.881000000001},35247.22421,0.72501461425742753]
[{"$f":"IF(COUNTBLANK(C129:IW129)=254,\"odstr\",IF(AND($A$1=\"TISK\",SUM(J38:N38)=0),\"odstr\",\"OK\"))","v":{"$error":"#REF!"}},"OK",null,null,6354,null,"Investiční transfery veřejným výzkumným institucím",null,null,62463.779000000002,331821.18900000001,1844718.7890699999,1780633.8811400002,5.3662452554830669,null,null,5909,null,"Ostatní neinvestiční výdaje jinde nezařazené",null,null,37138.531999999999,15419.459000000001,15419.459000000001,2216.0900799999999,0.14372035231586269,null,null,null,null,5909,null,"Ostatní neinvestiční výdaje jinde nezařazené",null,null,3000,48615.881000000001,45615.881000000001,35247.22421,0.72501461425742753]
[null,null,null,null,null,null,null,null,null,null,null,null,null,null,null,null,null,null,"Ostatní neinvestiční transfery",null,null,null,null,null,null,"x",null,null,null,null,null,null,"Ostatní neinvestiční transfery",null,null,null,null,null,null,"x"]
[{"$f":"IF(COUNTBLANK(C131:IW131)=254,\"odstr\",IF(AND($A$1=\"TISK\",SUM(J40:N40)=0),\"odstr\",\"OK\"))","v":{"$error":"#REF!"}},"OK",null,null,63,null,"Investiční transfery",null,null,8126281.3959999997,7657649.7020000005,12594412.783500001,5594322.4433800001,0.73055345453042764,null,null,6,null,"Kapitálové výdaje celkem",null,null,{"$f":"V132+V142","v":9740363.1590000018},{"$f":"SUM(W132,W142)","v":10006419.952},{"$f":"SUM(X132,X142)","v":14829868.315929998},{"$f":"SUM(Y132,Y142)","v":11010103.438099999},1.1003039539530211,null,null,null,null,6,null,"Kapitálové výdaje celkem",null,null,{"$f":"SUM(AJ132,AJ142)","v":6898225.2749999994},{"$f":"SUM(AK132,AK142)","v":10991306.276000001},{"$f":"SUM(AL132,AL142)","v":1497856.44838},{"$f":"SUM(AM132,AM142)","v":9102348.7597599998},{"$f":"AM131/AK131","v":0.82814076245290136}]
[null,null,null,null,6,null,"Kapitálové výdaje",null,null,8193150.466,7741115.0270000007,12699410.468570001,5632649.0073899999,0.72762760761777268,null,null,61,null,"Investiční nákupy a související výdaje",null,null,{"$f":"V133+V136","v":298095.60700000002},{"$f":"SUM(W133,W136)","v":180744.08900000001},{"$f":"SUM(X133,X136)","v":273445.49867},{"$f":"SUM(Y133,Y136)","v":37503.704680000003},0.20749616149272798,null,null,null,null,61,null,"Investiční nákupy a související výdaje",null,null,{"$f":"SUM(AJ133,AJ136)","v":166116.40100000001},{"$f":"SUM(AK133,AK136)","v":228462.61199999999},{"$f":"SUM(AL133,AL136)","v":133292.61340999999},{"$f":"SUM(AM133,AM136)","v":76186.339779999995},{"$f":"AM132/AK132","v":0.33347399433566838}]
[null,null,null,null,"Výdaje kapitoly 333-MŠMT podle položek celkem",null,null,null,null,156525862.16799998,159501749.26100001,171664310.87502,157511440.02411997,0.98752170903390413,null,null,611,null,"Pořízení dlouhodobého nehmotného majetku",null,null,{"$f":"V134","v":177836.323},{"$f":"SUM(W134:W135)","v":63190.712},{"$f":"SUM(X134:X135)","v":86898.988760000007},{"$f":"SUM(Y134:Y135)","v":2055.0425},3.2521274645552344E-2,null,null,null,null,611,null,"Pořízení dlouhodobého nehmotného majetku",null,null,55930.084000000003,15921.199000000001,{"$f":"SUM(AL134:AL135)","v":133292.61340999999},24470.401119999999,{"$f":"AM133/AK133","v":1.5369697420401565}]
[null,null,null,null,null,null,null,null,null,null,null,null,null,"Zdroj: Závěrečný účet – kapitola 333-MŠMT",null,null,6111,null,"Programové vybavení",null,null,177836.323,63069.712,86777.988760000007,1934.0425,3.0665155090608309E-2,null,null,null,null,6111,null,"Programové vybavení",null,null,55930.083999999995,15921.199000000001,133292.61340999999,24470.401119999999,{"$f":"AM134/AK134","v":1.5369697420401565}]
[null,null,null,null,null,null,null,null,null,null,null,null,null,null,null,null,6119,null,"Ostatní nákupy dlouhodobého nehmotného majetku",null,null,null,121,121,121,1,null,null,null,null,6119,null,"Ostatní nákupy dlouhodobého nehmotného majetku",null,null,null,null,null,null,"x"]
[null,null,null,null,null,null,null,null,null,null,null,null,null,null,null,null,612,null,"Pořízení dlohodobého hmotného majetku",null,null,{"$f":"SUM(V137:V141)","v":120259.284},{"$f":"SUM(W137:W141)","v":117553.37700000001},{"$f":"SUM(X137:X141)","v":186546.50990999999},{"$f":"SUM(Y137:Y141)","v":35448.662179999999},0.3015537544276588,null,null,null,null,612,null,"Pořízení dlohodobého hmotného majetku",null,null,110186.317,212541.413,{"$f":"SUM(AL137:AL141)","v":0},51715.93866,{"$f":"AM136/AK136","v":0.24332170342727513}]
[null,null,null,null,null,null,null,null,null,null,null,null,null,null,null,null,6121,null,"Budovy, haly a stavby",null,null,84559.284,90020.22,127337.79845999999,14303.789490000001,0.15889529585686415,null,null,null,null,6121,null,"Budovy, haly a stavby"]
[null,null,null,null,null,null,null,null,null,null,null,null,null,null,null,null,6122,null,"Stroje, přístroje a zařízení",null,null,4000,17183.776999999998,19808.775399999999,16070.169689999999,0.93519426433431951,null,null,null,null,6122,null,"Stroje, přístroje a zařízení"]
[null,null,null,null,null,null,null,null,null,null,null,null,null,null,null,null,6123,null,"Dopravní prostředky",null,null,3800,7730.5069999999996,10001.511,4411.7730000000001,0.57069646272877061,null,null,null,null,6123,null,"Dopravní prostředky"]
[null,null,null,null,null,null,null,null,null,null,null,null,null,null,null,null,6125,null,"Výpočetní technika",null,null,18900,2618.873,29398.425050000002,662.93,0.25313560451385003,null,null,null,null,6125,null,"Výpočetní technika"]
[null,null,null,null,null,null,null,null,null,null,null,null,null,null,null,null,6129,null,"Nákup dlouhodobého hmotného majetku jinde nezařazený",null,null,9000,0,0,0,"x",null,null,null,null,6129,null,"Nákup dlouhodobého hmotného majetku jinde nezařazený"]
[{"$f":"IF(COUNTBLANK(C142:IW142)=254,\"odstr\",IF(AND($A$1=\"TISK\",SUM(J41:N41)=0),\"odstr\",\"OK\"))","v":{"$error":"#REF!"}},"OK",null,null,null,null,null,null,null,null,null,null,null,null,null,null,63,null,"Investiční transfery",null,null,{"$f":"V143+V146+V151+V155","v":9442267.5520000011},{"$f":"SUM(W143,W146,W151,W155)","v":9825675.8629999999},{"$f":"SUM(X143,X146,X151,X155)","v":14556422.817259997},{"$f":"SUM(Y143,Y146,Y151,Y155)","v":10972599.733419999},1.1167272243061577,null,null,null,null,63,null,"Investiční transfery",null,null,{"$f":"SUM(AJ143,AJ146,AJ151,AJ155)","v":6732108.8739999998},{"$f":"SUM(AK143,AK146,AK151,AK155)","v":10762843.664000001},{"$f":"SUM(AL143,AL146,AL151,AL155)","v":1364563.83497},{"$f":"SUM(AM143,AM146,AM151,AM155)","v":9026162.4199800007},{"$f":"AM142/AK142","v":0.83864104150941798}]
[null,null,null,null,null,null,null,null,null,null,null,null,null,null,null,null,631,null,"Investiční transfery podnikateslým subjektům ",null,null,{"$f":"SUM(V144:V145)","v":11556},{"$f":"SUM(W144:W145)","v":71415},{"$f":"SUM(X144:X145)","v":89743.202359999996},{"$f":"SUM(Y144:Y145)","v":53297.090259999997},0.74630106084155989,null,null,null,null,631,null,"Investiční transfery podnikateslým subjektům ",null,null,11556,40691.417000000001,{"$f":"SUM(AL144:AL145)","v":406.27},33370.540350000003,{"$f":"AM143/AK143","v":0.82008794016684161}]
[null,null,null,null,null,null,null,null,null,null,null,null,null,null,null,null,6313,null,"Investiční transfery nefinančním podnikatelským subjektům - právnickým osobám",null,null,0,54416,72744.202359999996,48056.823259999997,0.88313774000294032,null,null,null,null,6313,null,"Investiční transfery nefinančním podnikatelským subjektům - právnickým osobám",null,null,11556,40691.417000000001,406.27,33370.540350000003,{"$f":"AM144/AK144","v":0.82008794016684161}]
[null,null,null,null,null,null,null,null,null,null,null,null,null,null,null,null,6319,null,"Ostatní investiční transfery podnikatelským subjektům ",null,null,11556,16999,16999,5240.2669999999998,{"$f":"Y145/W145","v":0.30826913347843987},null,null,null,null,6319,null,"Ostatní investiční transfery podnikatelským subjektům ",null,null,null,null,null,null,"x"]
[null,null,null,null,null,null,null,null,null,null,null,null,null,null,null,null,632,null,"Investiční tranfery neziskovým a podobným organizacím ",null,null,{"$f":"SUM(V147:V150)","v":2087454.1},{"$f":"SUM(W147:W150)","v":1385563.804},{"$f":"SUM(X147:X150)","v":1799142.08987},{"$f":"SUM(Y147:Y150)","v":1272458.6260899999},0.91836884192306734,null,null,null,null,632,null,"Investiční tranfery neziskovým a podobným organizacím ",null,null,2301629.1,1669615.473,{"$f":"SUM(AL147:AL150)","v":0},2130703.78993,{"$f":"AM146/AK146","v":1.2761643769996374}]
[null,null,null,"",null,null,null,null,null,null,null,null,null,null,null,null,6321,null,"Investiční tranfery obecně prospěšným společnostem",null,null,600,867,1516,1468,1.6931949250288352,null,null,null,null,6321,null,"Investiční tranfery obecně prospěšným společnostem"]
[null,null,null,null,null,null,null,null,null,null,null,null,null,null,null,null,6322,null,"Investiční transfery spolkům ",null,null,2025194.1,1384136.804,1796996.13087,1270920.6670899999,0.91820451809184023,null,null,null,null,6322,null,"Investiční transfery spolkům "]
[null,null,null,null,null,null,null,null,null,null,null,null,null,null,null,null,6323,null,"Investiční transfery církvím a náboženským společnostem",null,null,null,null,69.959000000000003,69.959000000000003,0,null,null,null,null,6323,null,"Investiční transfery církvím a náboženským společnostem"]
[null,null,null,null,null,null,null,null,null,null,null,null,null,null,null,null,6329,null,"Ostatní investiční transfery neziskovým a podobným organizacím ",null,null,61660,560,560,0,0,null,null,null,null,6329,null,"Ostatní investiční transfery neziskovým a podobným organizacím "]
[null,null,null,null,null,null,null,null,null,null,null,null,null,null,null,null,634,null,"Investiční transfery veřejným rozpočtům územní úrovně",null,null,{"$f":"SUM(V152:V154)","v":599940.99699999997},{"$f":"SUM(W152:W154)","v":820209.5},{"$f":"SUM(X152:X154)","v":1497038.5338000001},{"$f":"SUM(Y152:Y154)","v":704796.54171000002},0.85928843997783499,null,null,null,null,634,null,"Investiční transfery veřejným rozpočtům územní úrovně",null,null,486817.05800000002,739306.41099999996,{"$f":"SUM(AL152:AL154)","v":1364157.5649699999},586812.23809999996,{"$f":"AM151/AK151","v":0.79373346337720319}]
[null,null,null,null,null,null,null,null,null,null,null,null,null,null,null,null,6341,null,"Investiční transfery obcím ",null,null,599940.99699999997,818258.21400000004,1460316.82412,669311.74459000002,0.8179713116695948,null,null,null,null,6341,null,"Investiční transfery obcím ",null,null,486817.05800000002,638355.51300000004,1283068.1073499999,433389.97096000001,{"$f":"AM152/AK152","v":0.6789163125156561}]
[null,null,null,null,null,null,null,null,null,null,null,null,null,null,null,null,6342,null,"Investiční transfery krajům ",null,null,0,1951.2860000000001,36721.70968,35484.797119999996,18.18533885857839,null,null,null,null,6342,null,"Investiční transfery krajům ",null,null,0,100950.898,81089.457620000001,153422.26714000001,{"$f":"AM153/AK153","v":1.5197711974786001}]
[null,null,null,null,null,null,null,null,null,null,null,null,null,null,null,null,6349,null,"Ostatní investiční transfery veřejným rozpočtům územní úrovně",null,null,null,null,null,null,"x",null,null,null,null,6349,null,"Ostatní investiční transfery veřejným rozpočtům územní úrovně",null,null,null,null,null,null,"x"]
[null,null,null,null,null,null,null,null,null,null,null,null,null,null,null,null,635,null,"Investiční transfery příspěvkovým a podobným organizacím ",null,null,{"$f":"SUM(V156:V159)","v":6743316.4550000001},{"$f":"SUM(W156:W159)","v":7548487.5590000004},{"$f":"SUM(X156:X159)","v":11170498.991229998},{"$f":"SUM(Y156:Y159)","v":8942047.4753600005},1.1846144549444835,null,null,null,null,635,null,"Investiční transfery příspěvkovým a podobným organizacím ",null,null,3932106.716,8313230.3629999999,{"$f":"SUM(AL156:AL159)","v":0},6275275.8515999997,{"$f":"AM155/AK155","v":0.754854079291439}]
[null,null,null,null,null,null,null,null,null,null,null,null,null,null,null,null,6351,null,"Investiční transfery zřízeným příspěvkovým organizacím ",null,null,141842.67600000001,67444.379000000001,118958.00207999999,54220.001229999994,0.80392172088944569,null,null,null,null,6351,null,"Investiční transfery zřízeným příspěvkovým organizacím "]
[null,null,null,null,null,null,null,null,null,null,null,null,null,null,null,null,6352,null,"Investiční transfery vysokým školám ",null,null,6565326.699,6362518.4900000002,9453517.3091499992,7516778.2710600002,1.1814155483986657,null,null,null,null,6352,null,"Investiční transfery vysokým školám "]
[null,null,null,null,null,null,null,null,null,null,null,null,null,null,null,null,6354,null,"Investiční transfery veřejným výzkumným institucím ",null,null,30447.08,1118324.69,1597823.68,1371049.20307,1.2259849177344015,null,null,null,null,6354,null,"Investiční transfery veřejným výzkumným institucím "]
[null,null,null,null,null,null,null,null,null,null,null,null,null,null,null,null,6359,null,"Investiční transfery ostatním příspěvkovým organizacím ",null,null,5700,200,200,0,0,null,null,null,null,6359,null,"Investiční transfery ostatním příspěvkovým organizacím "]
[{"$f":"IF(COUNTBLANK(C160:IW160)=254,\"odstr\",IF(AND($A$1=\"TISK\",SUM(J42:N42)=0),\"odstr\",\"OK\"))","v":{"$error":"#REF!"}},"OK",null,null,null,null,null,null,null,null,null,null,null,null,null,null,"Výdaje kapitoly 333-MŠMT podle položek celkem",null,null,null,null,{"$f":"V14+V131","v":205759166.36400002},{"$f":"SUM(W14,W131)","v":210519766.96599996},{"$f":"SUM(X14,X131)","v":220237634.99057999},{"$f":"SUM(Y14,Y131)","v":210531806.49476007},1.0000571895406005,null,null,null,"Výdaje kapitoly 333-MŠMT podle položek celkem",null,null,null,null,null,{"$f":"SUM(AJ14,AJ131)","v":226967000.21000001},{"$f":"SUM(AK14,AK131)","v":229159981.42199999},{"$f":"SUM(AL14,AL131)","v":165280892.06358999},{"$f":"SUM(AM14,AM131)","v":227422706.16562},{"$f":"AM160/AK160","v":0.99241894136314845}]
[{"$error":"#REF!"},"OK",null,null,null,null,null,null,null,null,null,null,null,null,null,"",null,null,null,null,null,null,null,null,null,"Zdroj: Závěrečný účet – kapitola 333-MŠMT",null,null,null,"",null,null,null,null,null,null,null,null,null,"Zdroj: Závěrečný účet – kapitola 333-MŠMT_přílohová tabulka k Závěrečnému účtu_bilance příjmů a výdajů státního rozpočtu v druhovém členění rozpočtové skladby"]
[{"$error":"#REF!"},"OK"]
[{"$error":"#REF!"},"OK"]
[{"$error":"#REF!"},"OK"]
[{"$error":"#REF!"},"OK"]
[{"$error":"#REF!"},"OK"]
[{"$error":"#REF!"},"OK"]
[{"$error":"#REF!"},"OK"]
[{"$error":"#REF!"},"OK"]
[{"$error":"#REF!"},"OK"]
[{"$f":"IF(COUNTBLANK(C171:IW171)=254,\"odstr\",IF(AND($A$1=\"TISK\",SUM(J54:N54)=0),\"odstr\",\"OK\"))","v":{"$error":"#REF!"}},"OK"]
[{"$error":"#REF!"},"OK"]
[{"$error":"#REF!"},"OK"]
[{"$error":"#REF!"},"OK"]
[{"$error":"#REF!"},"OK"]
[{"$error":"#REF!"},"OK"]
[{"$error":"#REF!"},"OK"]
[{"$error":"#REF!"},"OK"]
[{"$error":"#REF!"},"OK"]
[{"$error":"#REF!"},"OK"]
[{"$error":"#REF!"},"OK"]
[{"$error":"#REF!"},"OK"]
[{"$error":"#REF!"},"OK"]
[{"$error":"#REF!"},"OK"]
[{"$error":"#REF!"},"OK"]
[{"$error":"#REF!"},"OK"]
[{"$error":"#REF!"},"OK"]
[{"$error":"#REF!"},"OK"]
[{"$error":"#REF!"},"OK"]
[{"$f":"IF(COUNTBLANK(C190:IW190)=254,\"odstr\",IF(AND($A$1=\"TISK\",SUM(J74:N74)=0),\"odstr\",\"OK\"))","v":{"$error":"#REF!"}},"OK"]
[{"$error":"#REF!"},"OK"]
[{"$error":"#REF!"},"OK"]
[{"$error":"#REF!"},"OK"]
[{"$error":"#REF!"},"OK"]
[{"$error":"#REF!"},"OK"]
[{"$f":"IF(COUNTBLANK(C196:IW196)=254,\"odstr\",IF(AND($A$1=\"TISK\",SUM(J82:N82)=0),\"odstr\",\"OK\"))","v":{"$error":"#REF!"}},"OK"]
[{"$error":"#REF!"},"OK"]
[{"$error":"#REF!"},"OK"]
[{"$error":"#REF!"},"OK"]
[{"$error":"#REF!"},"OK"]
[{"$error":"#REF!"},"OK"]
[{"$error":"#REF!"},"OK"]
[{"$error":"#REF!"},"OK"]
[{"$error":"#REF!"},"OK"]
[{"$error":"#REF!"},"OK"]
[{"$error":"#REF!"},"OK"]
[]
[{"$f":"IF(COUNTBLANK(C208:IW208)=254,\"odstr\",IF(AND($A$1=\"TISK\",SUM(J94:N94)=0),\"odstr\",\"OK\"))","v":{"$error":"#REF!"}},"OK"]
[{"$error":"#REF!"},"OK"]
[{"$error":"#REF!"},"OK"]
[{"$error":"#REF!"},"OK"]
[{"$error":"#REF!"},"OK"]
[{"$error":"#REF!"},"OK"]
[{"$f":"IF(COUNTBLANK(C213:IW213)=254,\"odstr\",IF(AND($A$1=\"TISK\",SUM(J99:N99)=0),\"odstr\",\"OK\"))","v":{"$error":"#REF!"}},"OK"]
[{"$f":"IF(COUNTBLANK(C215:IW215)=254,\"odstr\",IF(AND($A$1=\"TISK\",SUM(J101:N101)=0),\"odstr\",\"OK\"))","v":{"$error":"#REF!"}},"OK"]
[{"$error":"#REF!"},"OK"]
[{"$error":"#REF!"},"OK"]
[{"$error":"#REF!"},"OK"]
[{"$error":"#REF!"},"OK"]
[{"$error":"#REF!"},"OK"]
[{"$error":"#REF!"},"OK"]
[]
[]
[]
[{"$f":"IF(COUNTBLANK(C225:IW225)=254,\"odstr\",IF(AND($A$1=\"TISK\",SUM(J111:N111)=0),\"odstr\",\"OK\"))","v":{"$error":"#REF!"}},"OK"]
[{"$f":"IF(COUNTBLANK(C226:IW226)=254,\"odstr\",IF(AND($A$1=\"TISK\",SUM(J112:N112)=0),\"odstr\",\"OK\"))","v":{"$error":"#REF!"}},"OK"]
[{"$f":"IF(COUNTBLANK(C227:IW227)=254,\"odstr\",IF(AND($A$1=\"TISK\",SUM(J114:N114)=0),\"odstr\",\"OK\"))","v":{"$error":"#REF!"}},"OK"]
[{"$f":"IF(COUNTBLANK(C228:IW228)=254,\"odstr\",IF(AND($A$1=\"TISK\",SUM(J116:N116)=0),\"odstr\",\"OK\"))","v":{"$error":"#REF!"}},"OK"]
[{"$error":"#REF!"},"OK"]
[{"$error":"#REF!"},"OK"]
[{"$error":"#REF!"},"OK"]
[{"$error":"#REF!"},"OK"]
[{"$error":"#REF!"},"OK"]
[{"$error":"#REF!"},"OK"]
[{"$error":"#REF!"},"OK"]
[{"$error":"#REF!"},"OK"]
[{"$f":"IF(COUNTBLANK(C237:IW237)=254,\"odstr\",IF(AND($A$1=\"TISK\",SUM(J128:N128)=0),\"odstr\",\"OK\"))","v":{"$error":"#REF!"}},"OK"]
["konst","stop"]
[{"$f":"IF(COUNTBLANK(D143:E143)=2,\"odstr\",\"OK\")","v":"odstr"}]
[{"$f":"IF(COUNTBLANK(D144:E144)=2,\"odstr\",\"OK\")","v":"odstr"}]

{"sheet":"B7","index":7,"n_rows":277,"n_cols":79,"rows_kept":277,"cut":false,"hidden":false,"merged":[[14,63,14,66],[15,63,15,66],[16,64,16,66],[19,63,19,66],[17,64,17,66],[117,64,117,66],[116,64,116,66],[115,64,115,66],[110,64,110,66],[113,63,113,66],[114,63,114,66],[32,64,32,66],[31,64,31,66],[24,64,24,66],[101,64,101,66],[108,64,108,66],[107,64,107,66],[106,64,106,66],[105,64,105,66],[104,64,104,66],[102,64,102,66],[100,64,100,66],[94,63,94,66],[95,63,95,66],[99,64,99,66],[98,64,98,66],[97,64,97,66],[92,64,92,66],[91,64,91,66],[256,64,256,66],[257,64,257,66],[248,64,248,66],[249,64,249,66],[245,64,245,66],[246,64,246,66],[236,64,236,66],[235,64,235,66],[250,64,250,66],[252,64,252,66],[231,64,231,66],[229,64,229,66],[228,64,228,66],[227,64,227,66],[217,63,217,66],[222,63,222,66],[223,64,223,66],[221,64,221,66],[216,64,216,66],[263,61,263,66],[265,62,265,78],[266,62,266,78],[36,63,36,66],[103,63,103,66],[109,63,109,66],[111,63,111,66],[112,64,112,66],[124,63,124,66],[133,64,133,66],[253,63,253,66],[254,64,254,66],[255,63,255,66],[258,64,258,66],[259,63,259,66],[260,63,260,66],[241,63,241,66],[243,63,243,66],[244,63,244,66],[247,63,247,66],[230,63,230,66],[239,63,239,66],[234,64,234,66],[233,64,233,66],[205,63,205,66],[206,64,206,65],[207,63,207,66],[209,63,209,66],[212,63,212,66],[213,63,213,66],[215,64,215,66],[214,64,214,66],[211,64,211,66],[210,64,210,66],[197,63,197,66],[198,64,198,66],[199,64,199,66],[200,64,200,66],[201,64,201,66],[202,64,202,66],[203,64,203,66],[204,64,204,66],[196,64,196,66],[191,63,191,66],[192,63,192,66],[195,64,195,66],[194,64,194,66],[193,64,193,66],[189,64,189,66],[188,64,188,66],[187,64,187,66],[190,64,190,66],[176,63,176,66],[179,63,179,66],[181,63,181,66],[182,63,182,66],[184,63,184,66],[185,63,185,66],[183,64,183,66],[180,64,180,66],[178,64,178,66],[177,64,177,66],[170,63,170,66],[174,63,174,66],[175,64,175,66],[173,64,173,66],[172,64,172,66],[171,64,171,66],[169,64,169,66],[168,64,168,66],[167,64,167,66],[156,63,156,66],[157,63,157,66],[159,63,159,66],[160,63,160,66],[162,63,162,66],[165,63,165,66],[166,63,166,66],[164,64,164,66],[163,64,163,66],[161,64,161,66],[158,63,158,66],[150,63,150,66],[155,64,155,66],[154,64,154,66],[153,64,153,66],[152,64,152,66],[151,64,151,66],[149,64,149,66],[148,64,148,66],[147,64,147,66],[142,64,142,66],[143,64,143,66],[145,63,145,66],[146,63,146,66],[144,64,144,66],[141,64,141,66],[140,64,140,66],[139,64,139,66],[138,64,138,66],[132,63,132,66],[136,63,136,66],[118,63,118,66],[123,64,123,66],[119,64,119,66],[120,64,120,66],[121,64,121,66],[137,64,137,66],[135,64,135,66],[134,64,134,66],[131,64,131,66],[130,64,130,66],[129,64,129,66],[128,64,128,66],[127,64,127,66],[126,64,126,66],[125,64,125,66],[122,64,122,66],[83,63,83,66],[87,63,87,66],[90,64,90,66],[89,64,89,66],[88,64,88,66],[86,64,86,66],[85,64,85,66],[84,64,84,66],[82,64,82,66],[74,63,74,66],[81,64,81,66],[79,64,79,66],[78,64,78,66],[77,64,77,66],[76,64,76,66],[75,64,75,66],[73,64,73,66],[72,64,72,66],[64,63,64,66],[71,64,71,66],[70,64,70,66],[69,64,69,66],[68,64,68,66],[67,64,67,66],[66,64,66,66],[65,64,65,66],[63,64,63,66],[55,63,55,66],[62,64,62,66],[61,64,61,66],[60,64,60,66],[59,64,59,66],[58,64,58,66],[57,64,57,66],[56,64,56,66],[54,64,54,66],[49,63,49,66],[53,64,53,66],[52,64,52,66],[50,64,50,66],[48,64,48,66],[47,64,47,66],[46,64,46,66],[45,64,45,66],[44,64,44,66],[43,64,43,66],[42,64,42,66],[41,64,41,66],[40,64,40,66],[38,64,38,66],[37,64,37,66],[34,64,34,66],[8,61,12,62],[8,64,12,65],[35,63,35,66],[39,63,39,66],[25,63,25,66],[30,63,30,66],[33,63,33,66],[26,64,26,66],[27,64,27,66],[28,64,28,66],[29,64,29,66],[23,64,23,66],[22,64,22,66],[21,64,21,66],[20,64,20,66],[18,64,18,66],[13,64,13,66],[8,67,9,70],[8,71,9,74],[8,75,9,78],[10,67,12,67],[10,68,12,68],[10,69,12,69],[10,70,12,70],[10,71,12,71],[10,72,12,72],[10,73,12,73],[10,74,12,74],[10,75,12,75],[10,76,12,76],[10,77,12,77],[10,78,12,78],[260,44,260,47],[263,42,263,47],[185,44,185,47],[192,44,192,47],[197,44,197,47],[205,44,205,47],[209,44,209,47],[213,44,213,47],[217,44,217,47],[222,44,222,47],[230,44,230,47],[189,45,189,46],[190,45,190,46],[191,44,191,47],[193,45,193,46],[194,45,194,46],[195,45,195,46],[196,45,196,46],[198,45,198,46],[199,45,199,46],[200,45,200,46],[201,45,201,46],[202,45,202,46],[203,45,203,46],[83,44,83,47],[87,44,87,47],[95,44,95,47],[136,44,136,47],[146,44,146,47],[150,44,150,47],[157,44,157,47],[162,44,162,47],[166,44,166,47],[84,45,84,46],[85,45,85,46],[86,45,86,46],[88,45,88,46],[89,45,89,46],[90,45,90,46],[91,45,91,46],[92,45,92,46],[93,45,93,46],[94,44,94,47],[96,45,96,46],[97,45,97,46],[98,45,98,46],[99,45,99,47],[100,45,100,46],[259,24,259,27],[258,25,258,27],[35,24,35,27],[94,24,94,27],[113,24,113,27],[145,24,145,27],[156,24,156,27],[165,24,165,27],[184,24,184,27],[191,24,191,27],[207,24,207,27],[212,24,212,27],[243,24,243,27],[221,25,221,26],[223,25,223,26],[224,25,224,26],[225,25,225,26],[231,25,231,26],[232,25,232,26],[233,25,233,26],[204,25,204,26],[206,25,206,26],[208,25,208,26],[214,25,214,26],[14,24,14,27],[266,23,266,39],[13,25,13,26],[190,25,190,26],[36,24,36,26],[95,25,95,27],[114,24,114,27],[157,25,157,27],[250,25,250,26],[256,25,256,26],[257,25,257,26],[261,25,261,26],[262,25,262,26],[265,23,265,39],[234,25,234,26],[235,25,235,26],[236,25,236,26],[242,25,242,26],[245,25,245,26],[246,25,246,26],[248,25,248,26],[249,25,249,26],[219,25,219,26],[220,25,220,26],[215,25,215,26],[216,25,216,26],[218,25,218,26],[194,25,194,26],[195,25,195,26],[196,25,196,26],[198,25,198,26],[199,25,199,26],[200,25,200,26],[201,25,201,26],[202,25,202,26],[203,25,203,26],[180,25,180,26],[186,25,186,26],[187,25,187,26],[189,25,189,26],[193,25,193,26],[167,25,167,26],[168,25,168,26],[169,25,169,26],[171,25,171,26],[172,25,172,26],[173,25,173,26],[175,25,175,26],[177,25,177,26],[152,25,152,26],[153,25,153,26],[154,25,154,26],[155,25,155,26],[158,25,158,26],[163,25,163,26],[164,25,164,26],[178,25,178,26],[139,25,139,26],[140,25,140,26],[141,25,141,26],[144,25,144,26],[147,25,147,26],[148,25,148,26],[149,25,149,26],[151,25,151,26],[128,25,128,26],[129,25,129,26],[130,25,130,26],[131,25,131,26],[133,25,133,26],[134,25,134,26],[135,25,135,26],[137,25,137,26],[138,25,138,26],[115,25,115,26],[116,25,116,26],[117,25,117,26],[120,25,120,26],[122,25,122,26],[125,25,125,26],[126,25,126,26],[127,25,127,26],[98,25,98,26],[100,25,100,26],[102,25,102,26],[104,25,104,26],[105,25,105,26],[106,25,106,26],[107,25,107,26],[108,25,108,26],[110,25,110,26],[99,25,99,27],[88,25,88,26],[89,25,89,26],[90,25,90,26],[91,25,91,26],[92,25,92,26],[93,25,93,26],[96,25,96,26],[97,25,97,26],[76,25,76,26],[77,25,77,26],[78,25,78,26],[79,25,79,26],[81,25,81,26],[82,25,82,26],[84,25,84,26],[85,25,85,26],[86,25,86,26],[66,25,66,26],[67,25,67,26],[68,25,68,26],[69,25,69,26],[70,25,70,26],[71,25,71,26],[72,25,72,26],[73,25,73,26],[75,25,75,26],[56,25,56,26],[57,25,57,26],[58,25,58,26],[59,25,59,26],[60,25,60,26],[61,25,61,26],[62,25,62,26],[63,25,63,26],[65,25,65,26],[44,25,44,26],[45,25,45,26],[46,25,46,26],[47,25,47,26],[48,25,48,26],[50,25,50,26],[52,25,52,26],[53,25,53,26],[54,25,54,26],[31,25,31,26],[32,25,32,26],[34,25,34,26],[37,25,37,26],[40,25,40,26],[41,25,41,26],[42,25,42,26],[43,25,43,26],[16,25,16,26],[18,25,18,26],[20,25,20,26],[23,25,23,26],[24,25,24,26],[26,25,26,26],[27,25,27,26],[28,25,28,26],[29,25,29,26],[8,22,12,23],[8,25,12,26],[8,28,9,31],[8,32,9,35],[8,36,9,39],[10,28,12,28],[10,29,12,29],[10,30,12,30],[10,31,12,31],[10,32,12,32],[10,33,12,33],[10,34,12,34],[10,35,12,35],[10,36,12,36],[10,37,12,37],[10,38,12,38],[10,39,12,39],[13,6,13,7],[14,6,14,7],[15,6,15,7],[16,6,16,7],[27,6,27,7],[18,6,18,7],[19,6,19,7],[23,6,23,7],[24,6,24,7],[20,6,20,7],[207,4,207,20],[208,4,208,20],[8,3,12,4],[8,6,12,7],[8,9,9,12],[8,13,9,16],[8,17,9,20],[10,9,12,9],[10,10,12,10],[10,11,12,11],[122,6,122,7],[124,6,124,7],[10,13,12,13],[10,14,12,14],[10,15,12,15],[10,20,12,20],[10,16,12,16],[10,17,12,17],[10,18,12,18],[10,19,12,19],[25,6,25,7],[26,6,26,7],[10,12,12,12],[200,6,200,7],[138,6,138,7],[139,6,139,7],[149,6,149,7],[146,6,146,7],[204,6,204,7],[191,6,191,7],[196,6,196,7],[197,6,197,7],[198,6,198,7],[193,6,193,7],[194,6,194,7],[195,6,195,7],[199,6,199,7],[201,6,201,7],[203,6,203,7],[192,6,192,7],[202,6,202,7],[140,6,140,7],[152,6,152,7],[153,6,153,7],[154,6,154,7],[184,6,184,7],[175,6,175,7],[176,6,176,7],[137,6,137,7],[133,6,133,7],[128,6,128,7],[126,6,126,7],[127,6,127,7],[129,6,129,7],[131,6,131,7],[132,6,132,7],[120,6,120,7],[136,6,136,7],[135,6,135,7],[177,6,177,7],[186,6,186,7],[189,6,189,7],[187,6,187,7],[185,6,185,7],[179,6,179,7],[180,6,180,7],[144,6,144,7],[141,6,141,7],[148,6,148,7],[145,6,145,7],[150,6,150,7],[151,6,151,7],[159,6,159,7],[53,6,53,7],[147,6,147,7],[178,6,178,7],[173,6,173,7],[174,6,174,7],[170,6,170,7],[162,6,162,7],[163,6,163,7],[157,6,157,7],[158,6,158,7],[164,6,164,7],[165,6,165,7],[169,6,169,7],[172,6,172,7],[155,6,155,7],[166,6,166,7],[168,6,168,7],[167,6,167,7],[156,6,156,7],[114,6,114,7],[115,6,115,7],[117,6,117,7],[118,6,118,7],[125,6,125,7],[57,6,57,7],[33,6,33,7],[34,6,34,7],[35,6,35,7],[36,6,36,7],[58,6,58,7],[59,6,59,7],[69,6,69,7],[66,6,66,7],[37,6,37,7],[39,6,39,7],[43,6,43,7],[44,6,44,7],[40,6,40,7],[42,6,42,7],[56,6,56,7],[45,6,45,7],[46,6,46,7],[47,6,47,7],[48,6,48,7],[49,6,49,7],[50,6,50,7],[51,6,51,7],[52,6,52,7],[105,6,105,7],[28,6,28,7],[60,6,60,7],[32,6,32,7],[91,6,91,7],[90,6,90,7],[29,6,29,7],[30,6,30,7],[31,6,31,7],[80,6,80,7],[79,6,79,7],[54,6,54,7],[55,6,55,7],[74,6,74,7],[70,6,70,7],[61,6,61,7],[62,6,62,7],[63,6,63,7],[64,6,64,7],[65,6,65,7],[68,6,68,7],[71,6,71,7],[72,6,72,7],[73,6,73,7],[103,6,103,7],[78,6,78,7],[75,6,75,7],[77,6,77,7],[96,6,96,7],[94,6,94,7],[93,6,93,7],[92,6,92,7],[89,6,89,7],[76,6,76,7],[116,6,116,7],[134,6,134,7],[98,6,98,7],[97,6,97,7],[106,6,106,7],[104,6,104,7],[100,6,100,7],[82,6,82,7],[81,6,81,7],[87,6,87,7],[85,6,85,7],[84,6,84,7],[83,6,83,7],[88,6,88,7],[86,6,86,7],[95,6,95,7],[113,6,113,7],[112,6,112,7],[111,6,111,7],[102,6,102,7],[110,6,110,7],[109,6,109,7],[108,6,108,7],[107,6,107,7],[8,42,12,43],[8,45,12,46],[8,48,9,51],[8,52,9,55],[8,56,9,59],[10,48,12,48],[10,49,12,49],[10,50,12,50],[10,51,12,51],[10,52,12,52],[10,53,12,53],[10,54,12,54],[10,55,12,55],[10,56,12,56],[10,57,12,57],[10,58,12,58],[10,59,12,59],[13,45,13,46],[14,44,14,47],[18,45,18,46],[20,45,20,46],[23,45,23,46],[24,45,24,46],[26,45,26,46],[27,45,27,46],[15,44,15,47],[19,44,19,47],[25,44,25,47],[16,45,16,47],[28,45,28,46],[29,45,29,46],[31,45,31,46],[32,45,32,46],[34,45,34,46],[35,44,35,47],[36,44,36,46],[37,45,37,46],[40,45,40,46],[30,44,30,47],[33,44,33,47],[39,44,39,47],[41,45,41,46],[42,45,42,46],[43,45,43,46],[44,45,44,46],[45,45,45,46],[46,45,46,46],[47,45,47,46],[48,45,48,46],[50,45,50,46],[49,44,49,47],[52,45,52,46],[53,45,53,46],[54,45,54,46],[56,45,56,46],[57,45,57,46],[58,45,58,46],[59,45,59,46],[60,45,60,46],[61,45,61,46],[55,44,55,47],[62,45,62,46],[63,45,63,46],[65,45,65,46],[66,45,66,46],[67,45,67,46],[68,45,68,46],[69,45,69,46],[70,45,70,46],[71,45,71,46],[64,44,64,47],[72,45,72,46],[73,45,73,46],[75,45,75,46],[76,45,76,46],[77,45,77,46],[78,45,78,46],[79,45,79,46],[81,45,81,46],[82,45,82,46],[74,44,74,47],[102,45,102,46],[104,45,104,46],[105,45,105,46],[106,45,106,46],[107,45,107,46],[108,45,108,46],[110,45,110,46],[113,44,113,47],[114,44,114,47],[115,45,115,46],[116,45,116,46],[117,45,117,46],[120,45,120,46],[122,45,122,46],[125,45,125,46],[126,45,126,46],[127,45,127,46],[128,45,128,46],[129,45,129,46],[130,45,130,46],[118,44,118,47],[131,45,131,46],[133,45,133,46],[134,45,134,46],[135,45,135,46],[137,45,137,46],[138,45,138,46],[139,45,139,46],[140,45,140,46],[141,45,141,46],[132,44,132,47],[144,45,144,46],[145,44,145,47],[147,45,147,46],[148,45,148,46],[149,45,149,46],[142,45,142,47],[143,45,143,47],[151,45,151,46],[152,45,152,46],[153,45,153,46],[154,45,154,46],[155,45,155,46],[156,44,156,47],[163,45,163,46],[164,45,164,46],[160,44,160,47],[165,44,165,47],[167,45,167,46],[168,45,168,46],[169,45,169,46],[171,45,171,46],[172,45,172,46],[173,45,173,46],[175,45,175,46],[177,45,177,46],[178,45,178,46],[180,45,180,46],[184,44,184,47],[170,44,170,47],[174,44,174,47],[176,44,176,47],[179,44,179,47],[186,45,186,46],[187,45,187,46],[181,44,181,47],[182,44,182,47],[204,45,204,46],[206,45,206,46],[207,44,207,47],[208,45,208,46],[212,44,212,47],[214,45,214,46],[215,45,215,46],[216,45,216,46],[218,45,218,46],[256,45,256,46],[257,45,257,46],[223,45,223,46],[224,45,224,46],[225,45,225,46],[231,45,231,46],[232,45,232,46],[233,45,233,46],[234,45,234,46],[235,45,235,46],[236,45,236,46],[239,44,239,47],[241,44,241,47],[244,44,244,47],[247,44,247,47],[255,44,255,47],[253,44,253,47],[254,45,254,47],[101,45,101,47],[123,45,123,47],[258,45,258,47],[259,44,259,47],[261,45,261,46],[262,45,262,46],[265,43,265,59],[266,43,266,59],[103,44,103,46],[109,44,109,46],[111,44,111,46],[112,45,112,46],[124,44,124,46],[159,44,159,47],[242,45,242,46],[243,44,243,47],[245,45,245,46],[219,45,219,46],[220,45,220,46],[221,45,221,46],[246,45,246,46],[248,45,248,46],[249,45,249,46],[250,45,250,46]]}
[{"$f":"IF(#REF!=\"\",\"ŠABLONA\",IF(#REF!=\"T\",\"TISK\",\"ELEKTRO\"))","v":{"$error":"#REF!"}},0,{"$f":"CONCATENATE(D1,F1,IF(G1<>\"\",\".\",\"\"),G1,IF(H1<>\"\",\".\",\"\"),H1,IF(I1<>\"\",\".\",\"\"),I1,\"\")","v":{"$error":"#REF!"}},{"$f":"IF(#REF!=\"\",\" ?\",#REF!)","v":{"$error":"#REF!"}},{"$f":"CONCATENATE(C1,U1)","v":{"$error":"#REF!"}},7]
["konst"]
["konst","172x11",null,"Tab. B7:",null,null,null,"Výdaje kapitoly 700-Obce a DSO; KÚ (část: 31–32– vzdělávání) – podle položek",null,null,null,null,null,null,null,null,null,null,null,null,null,null,"Tab. B7:",null,null,null,"Výdaje kapitoly 700-Obce a DSO; KÚ (část: 31–32– vzdělávání) – podle položek",null,null,null,null,null,null,null,null,null,null,null,null,null,null,null,"Tab. B7:",null,null,null,"Výdaje kapitoly 700-Obce a DSO; KÚ (část: 31–32– vzdělávání) – podle položek",null,null,null,null,null,null,null,null,null,null,null,null,null,null,"Tab. B7:",null,null,null,"Výdaje kapitoly 700-Obce a DSO; KÚ (část: 31–32– vzdělávání) – podle položek"]
["konst",{"$f":"COUNTA(Datova_oblast)","v":1922},null,{"$f":"IF(D1=\" ?\",\"\",CONCATENATE(\"Tab. \",E1,\":\"))","v":{"$error":"#REF!"}},null,null,null,{"$f":"IF(H3=\"Zadejte název tabulky\",\"\",H3)","v":"Výdaje kapitoly 700-Obce a DSO; KÚ (část: 31–32– vzdělávání) – podle položek"},null,null,null,null,null,null,null,null,null,null,null,null,null,null,{"$f":"IF(W1=\" ?\",\"\",CONCATENATE(\"Tab. \",X1,\":\"))","v":"Tab. :"},null,null,null,{"$f":"IF(AA3=\"Zadejte název tabulky\",\"\",AA3)","v":"Výdaje kapitoly 700-Obce a DSO; KÚ (část: 31–32– vzdělávání) – podle položek"},null,null,null,null,null,null,null,null,null,null,null,null,null,null,null,{"$f":"IF(AQ1=\" ?\",\"\",CONCATENATE(\"Tab. \",AR1,\":\"))","v":"Tab. :"},null,null,null,{"$f":"IF(AU3=\"Zadejte název tabulky\",\"\",AU3)","v":"Výdaje kapitoly 700-Obce a DSO; KÚ (část: 31–32– vzdělávání) – podle položek"},null,null,null,null,null,null,null,null,null,null,null,null,null,null,{"$f":"IF(BJ1=\" ?\",\"\",CONCATENATE(\"Tab. \",BK1,\":\"))","v":"Tab. :"},null,null,null,{"$f":"IF(BN3=\"Zadejte název tabulky\",\"\",BN3)","v":"Výdaje kapitoly 700-Obce a DSO; KÚ (část: 31–32– vzdělávání) – podle položek"}]
[{"$f":"IF(D5=\"\",\"odstr\",\"OK\")","v":"odstr"},0]
[{"$f":"IF(COUNTBLANK(C6:IV6)=254,\"odstr\",\"OK\")","v":"odstr"},"Řádky pro"]
[{"$f":"IF(COUNTBLANK(C7:IV7)=254,\"odstr\",\"OK\")","v":"odstr"},"ročenku PaM"]
["konst",null,null,"(podle stavu k: 31. 12. 2017)",null,null,null,null,null,null,null,null,null,null,null,null,null,null,null,null,"v tis. Kč",null,"(podle stavu k: 31. 12. 2018)",null,null,null,null,null,null,null,null,null,null,null,null,null,null,null,null,"v tis. Kč",null,null,"(podle stavu k: 31. 12. 2019)",null,null,null,null,null,null,null,null,null,null,null,null,null,null,null,null,"v tis. Kč",null,"(podle stavu k: 31. 12. 2020)",null,null,null,null,null,null,null,null,null,null,null,null,null,null,null,null,"v tis. Kč"]
["konst",null,null,"Položka",null,null,"Popis položky",null,null,"Celkem1)",null,null,null,"Obce a DSO1)",null,null,null,"Krajské úřady1)",null,null,null,null,"Položka",null,null,"Popis položky",null,null,"Celkem1)",null,null,null,"Obce a DSO1)",null,null,null,"Krajské úřady1)",null,null,null,null,null,"Položka",null,null,"Popis položky",null,null,"Celkem1)",null,null,null,"Obce a DSO1)",null,null,null,"Krajské úřady1)",null,null,null,null,"Položka",null,null,"Popis položky",null,null,"Celkem1)",null,null,null,"Obce a DSO1)",null,null,null,"Krajské úřady1)"]
["konst"]
["konst",null,null,null,null,null,null,null,null,"schválený\nrozpočet","rozpočet po\nzměnách","skutečnost","% plnění\nrozpočtu","schválený\nrozpočet","rozpočet po\nzměnách","skutečnost","% plnění\nrozpočtu","schválený\nrozpočet","rozpočet po\nzměnách","skutečnost","% plnění\nrozpočtu",null,null,null,null,null,null,null,"schválený\nrozpočet","rozpočet po\nzměnách","skutečnost","% plnění\nrozpočtu","schválený\nrozpočet","rozpočet po\nzměnách","skutečnost","% plnění\nrozpočtu","schválený\nrozpočet","rozpočet po\nzměnách","skutečnost","% plnění\nrozpočtu",null,null,null,null,null,null,null,null,"schválený\nrozpočet","rozpočet po\nzměnách","skutečnost","% plnění\nrozpočtu","schválený\nrozpočet","rozpočet po\nzměnách","skutečnost","% plnění\nrozpočtu","schválený\nrozpočet","rozpočet po\nzměnách","skutečnost","% plnění\nrozpočtu",null,null,null,null,null,null,null,"schválený\nrozpočet","rozpočet po\nzměnách","skutečnost","% plnění\nrozpočtu","schválený\nrozpočet","rozpočet po\nzměnách","skutečnost","% plnění\nrozpočtu","schválený\nrozpočet","rozpočet po\nzměnách","skutečnost","% plnění\nrozpočtu"]
["konst"]
["konst"]
[null,null,null,null,5011,null,"Platy zaměstnanců v pracovním poměru",null,null,46169.080600000001,98350.138800000001,73940.028290000002,0.75180400548656878,42774.280599999998,74219.256580000001,56249.054329999999,0.75787682229570508,3394.8,24130.88222,17690.973959999999,0.73312586745533415,null,null,5,null,"BĚŽNÉ VÝDAJE",null,null,{"$f":"AC15+AC36+AC95+AC114+AC146+AC157+AC166+AC185","v":77088125.494309992},{"$f":"AD15+AD36+AD95+AD114+AD146+AD157+AD166+AD185","v":149104534.84321001},{"$f":"AE15+AE36+AE95+AE114+AE146+AE157+AE166+AE185","v":147162294.66073999},{"$f":"AE14/AD14","v":0.98697396974201779},{"$f":"AG15+AG36+AG95+AG114+AG146+AG157+AG166+AG185","v":29086731.808309998},{"$f":"AH15+AH36+AH95+AH114+AH146+AH157+AH166+AH185","v":38487490.545540005},{"$f":"AI15+AI36+AI95+AI114+AI146+AI157+AI166+AI185","v":37034681.592599995},{"$f":"AI14/AH14","v":0.96225243754926071},{"$f":"AK15+AK36+AK95+AK114+AK146+AK157+AK166+AK185","v":48001393.685999997},{"$f":"AL15+AL36+AL95+AL114+AL146+AL157+AL166+AL185","v":110625133.50847},{"$f":"AM15+AM36+AM95+AM114+AM146+AM157+AM166+AM185","v":110127613.06814},{"$f":"AM14/AL14","v":0.99550264551507273},null,null,null,5,null,"BĚŽNÉ VÝDAJE",null,null,{"$f":"BA14+BE14","v":85185084.339340001},171192190.73509997,169582044.15199,{"$f":"AY14/AX14","v":0.99059450915257297},{"$f":"BA15+BA36+BA95+BA114+BA146+BA157+BA166+BA182+BA185","v":31133914.181340005},{"$f":"BB15+BB36+BB95+BB114+BB146+BB157+BB166+BB182+BB185","v":42711880.906920001},{"$f":"BC15+BC36+BC95+BC114+BC146+BC157+BC166+BC182+BC185","v":41610571.830990002},{"$f":"BC14/BB14","v":0.97421539270700741},{"$f":"BE15+BE36+BE95+BE114+BE146+BE157+BE166+BE185","v":54051170.157999992},{"$f":"BF15+BF36+BF95+BF114+BF146+BF157+BF166+BF185","v":128480309.82817996},{"$f":"BG15+BG36+BG95+BG114+BG146+BG157+BG166+BG185","v":127971472.32100001},{"$f":"BG14/BF14","v":0.99603956818083306},null,null,5,null,"BĚŽNÉ VÝDAJE",null,null,{"$f":"SUM(BT14,BX14)","v":96802008.171279997},{"$f":"SUM(BU14,BY14)","v":188895665.34407005},186573866.53017002,{"$f":"BR14/BQ14","v":0.98770856488596015},{"$f":"SUM(BT15,BT36,BT95,BT114,BT146,BT157,BT166,BT182,BT185)","v":34391176.875279993},{"$f":"SUM(BU15,BU36,BU95,BU114,BU146,BU157,BU166,BU182,BU185)","v":42512080.368620001},{"$f":"SUM(BV15,BV36,BV95,BV114,BV146,BV157,BV166,BV182,BV185)","v":40777875.114520006},{"$f":"BV14/BU14","v":0.95920676572252417},{"$f":"SUM(BX15,BX36,BX95,BX114,BX146,BX157,BX166,BX182,BX185)","v":62410831.296000004},{"$f":"SUM(BY15,BY36,BY95,BY114,BY146,BY157,BY166,BY182,BY185)","v":146383584.97545004},{"$f":"SUM(BZ15,BZ36,BZ95,BZ114,BZ146,BZ157,BZ166,BZ182,BZ185)","v":145795991.41565001},{"$f":"BZ14/BY14","v":0.99598593271302538}]
[null,null,null,null,5019,null,"Ostatní platy",null,null,526.79999999999995,7207.49,5763.62021,0.79967092704949994,526.79999999999995,7207.49,5763.62021,0.79967092704949994,0,0,0,"x ",null,null,50,"Platy a podobné a související výdaje",null,null,null,{"$f":"AC16+AC20+AC26+AC31+AC34","v":150588.80669},{"$f":"AD16+AD20+AD26+AD31+AD34","v":346307.73413},{"$f":"AE16+AE20+AE26+AE31","v":277715.39591999998},0.80193241025263606,{"$f":"AG16+AG20+AG26+AG31+AG34","v":133162.17269000001},{"$f":"AH16+AH20+AH26+AH31+AH34","v":269183.89286000002},{"$f":"AI16+AI20+AI26+AI31+AI34","v":215975.3285},0.8023337734116458,{"$f":"AK16+AK20+AK26+AK31","v":17426.633999999998},{"$f":"AL16+AL20+AL26+AL31+AL34","v":77123.841270000004},{"$f":"AM16+AM20+AM26+AM31+AM34","v":61740.067419999992},{"$f":"AM15/AL15","v":0.80053153996643489},null,null,null,50,"Platy a podobné a související výdaje",null,null,null,158263.94699999999,409541.06839999999,308213.09175000002,0.75258164694967145,{"$f":"BA16+BA20+BA26+BA31+BA34","v":140838.04699999999},{"$f":"BB16+BB20+BB26+BB31+BB34","v":319425.73545999994},{"$f":"BC16+BC20+BC26+BC31+BC34","v":236273.12892000002},0.73968094204979085,{"$f":"BE16+BE20+BE26+BE31+BE34","v":17425.900000000001},{"$f":"BF16+BF20+BF26+BF31+BF34","v":90115.332940000022},{"$f":"BG16+BG20+BG26+BG31+BG34","v":71939.962830000004},{"$f":"BG15/BF15","v":0.79830990446319028},null,null,50,"Platy a podobné a související výdaje",null,null,null,173929.11267999999,{"$f":"SUM(BU15,BY15)","v":385304.84369000001},292734.97857000004,{"$f":"BR15/BQ15","v":0.75974902305023251},{"$f":"SUM(BT16,BT20,BT26,BT31,BT34)","v":151533.91267999998},{"$f":"SUM(BU16,BU20,BU26,BU31,BU34)","v":290633.28872999997},{"$f":"SUM(BV16,BV20,BV26,BV31,BV34)","v":221629.8536},{"$f":"BV15/BU15","v":0.76257559678889864},{"$f":"SUM(BX16,BX20,BX26,BX31,BX34)","v":22395.200000000001},{"$f":"SUM(BY16,BY20,BY26,BY31,BY34)","v":94671.554960000009},{"$f":"SUM(BZ16,BZ20,BZ26,BZ31,BZ34)","v":71105.124970000004},{"$f":"BZ15/BY15","v":0.75107169202029966}]
[null,null,null,null,5021,null,"Ostatní osobní výdaje",null,null,43487.579560000006,123416.53460999997,103360.99490000001,0.8374971410972113,38422.539560000005,110963.48260999998,93363.2019,0.8413867310576475,5065.04,12453.052,9997.7929999999997,0.80283877398086834,null,null,501,null,"Platy",null,null,{"$f":"AC17+AC19","v":63640.493690000003},{"$f":"AD17+AD19","v":134815.65896},{"$f":"AE17+AE19","v":101916.47393000001},0.75596911157211177,{"$f":"AG17+AG19","v":58243.384690000006},{"$f":"AH17+AH19","v":100504.74533999999},{"$f":"AI17+AI19","v":76063.266090000005},0.75681268414425307,{"$f":"AK17","v":5397.1090000000004},{"$f":"AL17","v":34310.913619999999},{"$f":"AM17","v":25853.207839999999},{"$f":"AM16/AL16","v":0.75349808886843628},null,null,null,501,"Platy",null,null,null,{"$f":"BA16+BE16","v":66114.896999999997},{"$f":"BB16+BF16","v":143282.44534999999},{"$f":"BC16+BG16","v":105968.90019},0.73958048336728788,{"$f":"SUM(BA17:BA19)","v":60884.896999999997},{"$f":"SUM(BB17:BB19)","v":101159.44372},{"$f":"SUM(BC17:BC19)","v":73232.916450000004},0.72393553935213362,{"$f":"SUM(BE17:BE19)","v":5230},{"$f":"SUM(BF17:BF19)","v":42123.001630000006},{"$f":"SUM(BG17:BG19)","v":32735.98374},{"$f":"BG16/BF16","v":0.77715220837171839},null,null,501,"Platy",null,null,null,66965.875140000004,{"$f":"SUM(BU16,BY16)","v":136667.62845999998},106436.39208000001,{"$f":"BR16/BQ16","v":0.77879738808193277},{"$f":"SUM(BT17:BT19)","v":62029.075140000001},{"$f":"SUM(BU17:BU19)","v":95112.192429999996},{"$f":"SUM(BV17:BV19)","v":74599.93452000001},{"$f":"BV16/BU16","v":0.78433618881095135},{"$f":"SUM(BX17:BX19)","v":4936.8},{"$f":"SUM(BY17:BY19)","v":41555.436029999997},{"$f":"SUM(BZ17:BZ19)","v":31836.457559999999},{"$f":"BZ16/BY16","v":0.76612016625253065}]
[{"$f":"IF(COUNTBLANK(C17:IV17)=254,\"odstr\",IF(AND($A$1=\"TISK\",SUM(J14:U14)=0),\"odstr\",\"OK\"))","v":{"$error":"#REF!"}},"OK",null,null,5024,null,"Odstupné",null,null,0,0,3.0089999999999999,"x ",0,0,3.0089999999999999,"x ",0,0,0,"x ",null,null,5011,null,"Platy zaměstnanců v pracovním poměru vyjma zaměstnanců na služebních místech",null,null,63061.69369,128436.54896,96240.885070000004,0.74932630819886836,57664.584690000003,94125.635339999993,70387.677230000001,0.74780560020387754,5397.1090000000004,34310.913619999999,25853.207839999999,{"$f":"AM17/AL17","v":0.75349808886843628},null,null,null,5011,null,"Platy zaměstnanců v pracovním poměru vyjma zaměstnanců na služebních místech",null,null,65824.896999999997,138345.72210000001,102860.78272,0.74350533690987175,60594.896999999997,96222.72047,70124.798980000007,0.72877589240332574,5230,42123.001630000006,32735.98374,{"$f":"BG17/BF17","v":0.77715220837171839},null,null,5011,null,"Platy zaměstnanců v pracovním poměru vyjma zaměstnanců na služebních místech",null,null,66265.875140000004,{"$f":"SUM(BU17,BY17)","v":135766.70445999998},106126.92137000001,{"$f":"BR17/BQ17","v":0.78168592065418707},61329.075140000001,94211.268429999996,74290.463810000016,{"$f":"BV17/BU17","v":0.7885517841764188},4936.8,41555.436029999997,31836.457559999999,{"$f":"BZ17/BY17","v":0.76612016625253065}]
[null,null,null,null,null,null,null,null,null,null,null,null,null,null,null,null,null,null,null,null,null,null,null,null,null,null,null,null,null,null,null,null,null,null,null,null,null,null,null,null,null,null,null,null,null,null,null,null,null,null,null,null,null,null,null,null,null,null,null,null,null,null,5013,null,"Platy zaměstnanců na služebních místech podle zákona o státní službě",null,null,30,0,0,0,30,0,0,0,0,0,0,0]
[{"$f":"IF(COUNTBLANK(C19:IV19)=254,\"odstr\",IF(AND($A$1=\"TISK\",SUM(J15:U15)=0),\"odstr\",\"OK\"))","v":{"$error":"#REF!"}},"OK",null,null,5029,null,"Ostatní platby za provedenou práci jinde nezařazené",null,null,24,175,135.53373999999999,0.77447851428571424,24,175,135.53373999999999,0.77447851428571424,0,0,0,"x ",null,null,5019,null,"Ostatní platy",null,null,578.79999999999995,6379.11,5675.5888599999998,0.8897148442337568,578.79999999999995,6379.11,5675.5888599999998,0.8897148442337568,0,0,0,"x",null,null,null,5019,null,"Ostatní platy",null,null,290,4936.72325,3108.1174699999997,0.62959119087747117,290,4936.72325,3108.1174699999997,0.62959119087747117,null,null,null,"x",null,null,5019,null,"Ostatní platy",null,null,670,900.92399999999998,309.47070999999994,{"$f":"BR19/BQ19","v":0.3435036806656277},670,900.92399999999998,309.47070999999994,{"$f":"BV19/BU19","v":0.3435036806656277},0,0,0,0]
[null,null,null,null,5031,null,"Povinné pojistné na sociální zabezpečení a příspěvek na státní politiku zaměstnanosti",null,null,11652.643400000001,37230.806219999999,29352.159560000004,0.78838366772278845,10724.6834,29362.351409999996,23563.453330000004,0.80250566451483007,927.96,7868.4548100000002,5788.7062300000007,0.73568526092863218,null,null,502,null,"Ostatní platby za provedenou práci",null,null,{"$f":"AC21+AC24+AC25","v":55482.879000000001},{"$f":"AD21+AD24+AD25","v":139700.62880000001},{"$f":"AE21+AE25","v":115149.63948999999},0.82425999423991125,{"$f":"AG21+AG24+AG25","v":53126.923000000003},{"$f":"AH21+AH25","v":122141.05914},{"$f":"AI21+AI25","v":100506.41348999999},0.82287163872386238,{"$f":"AK21","v":2355.9560000000001},{"$f":"AL21","v":17559.569660000001},{"$f":"AM21","v":14643.226000000001},{"$f":"AM20/AL20","v":0.83391713370725051},null,null,null,502,"Ostatní platby za provedenou práci",null,null,null,60339.154000000002,185949.38724999997,138953.49014000001,0.74726511442161281,{"$f":"SUM(BA21:BA25)","v":57875.654000000002},{"$f":"SUM(BB21:BB25)","v":166497.36979999999},{"$f":"SUM(BC21:BC25)","v":122833.74114},0.73775184129064852,{"$f":"SUM(BE21:BE25)","v":2463.5},{"$f":"SUM(BF21:BF25)","v":19452.017449999999},{"$f":"SUM(BG21:BG25)","v":16119.749},{"$f":"BG20/BF20","v":0.82869291277548185},null,null,502,"Ostatní platby za provedenou práci",null,null,null,68758.961130000011,168909.11765999999,126517.88647,{"$f":"BR20/BQ20","v":0.74902934917148745},{"$f":"SUM(BT21:BT25)","v":63881.361130000005},{"$f":"SUM(BU21:BU25)","v":146163.82673999999},{"$f":"SUM(BV21:BV25)","v":110403.19947000001},{"$f":"BV20/BU20","v":0.75533873142489683},{"$f":"SUM(BX21:BX25)","v":4877.6000000000004},{"$f":"SUM(BY21:BY25)","v":22745.290919999999},{"$f":"SUM(BZ21:BZ25)","v":16114.686999999998},{"$f":"BZ20/BY20","v":0.70848454111573078}]
[{"$f":"IF(COUNTBLANK(C21:IV21)=254,\"odstr\",IF(AND($A$1=\"TISK\",SUM(J16:U16)=0),\"odstr\",\"OK\"))","v":{"$error":"#REF!"}},"OK",null,null,5032,null,"Povinné pojistné na veřejné zdravotní pojištění",null,null,4258.2636000000002,14106.904450000002,10474.902030000001,0.74253724955229283,3922.4736000000003,11214.599480000001,8390.1901200000011,0.74814888707911309,335.79,2892.3049700000001,2084.71191,0.72077873240317392,null,null,5021,null,"Ostatní osobní výdaje",null,null,55458.879000000001,139572.62880000001,115043.18343999999,0.82425318222565414,53102.923000000003,122013.05914,100399.95744,0.82286238987581872,2355.9560000000001,17559.569660000001,14643.226000000001,{"$f":"AM21/AL21","v":0.83391713370725051},null,null,null,5021,null,"Ostatní osobní výdaje",null,null,60339.154000000002,185412.05024999997,138599.0888,0.74751931502359303,57875.654000000002,165960.03279999999,122479.3398,0.73800503490862179,2463.5,19452.017449999999,16119.749,{"$f":"BG21/BF21","v":0.82869291277548185},null,null,5021,null,"Ostatní osobní výdaje",null,null,68758.961130000011,168906.11765999999,126516.87046999999,{"$f":"BR21/BQ21","v":0.74903663776508356},63881.361130000005,146160.82673999999,110402.18347,{"$f":"BV21/BU21","v":0.75534728375880289},4877.6000000000004,22745.290919999999,16114.686999999998,{"$f":"BZ21/BY21","v":0.70848454111573078}]
[null,null,null,null,null,null,null,null,null,null,null,null,null,null,null,null,null,null,null,null,null,null,null,null,null,null,null,null,null,null,null,null,null,null,null,null,null,null,null,null,null,null,null,5022,null,"Platy představitelů státní moci a některých orgánů",null,null,0,153.94800000000001,0,0,null,153.94800000000001,0,0,null,null,null,null,null,null,5022,null,"Platy představitelů státní moci a některých orgánů",null,null,0,0,0,0,0,0,0,0,0,0,0,0]
[null,null,null,null,null,null,null,null,null,null,null,null,null,null,null,null,null,null,null,null,null,null,null,null,null,null,null,null,null,null,null,null,null,null,null,null,null,null,null,null,null,null,null,null,null,null,null,null,null,null,null,null,null,null,null,null,null,null,null,null,null,null,5023,null,"Odměny členů zastupitelstva obcí a krajů",null,null,0,3,1.016,{"$f":"BR23/BQ23","v":0.33866666666666667},0,3,1.016,{"$f":"BV23/BU23","v":0.33866666666666667},0,0,0,0]
[{"$f":"IF(COUNTBLANK(C24:IV24)=254,\"odstr\",IF(AND($A$1=\"TISK\",SUM(J17:U17)=0),\"odstr\",\"OK\"))","v":{"$error":"#REF!"}},"OK",null,null,5038,null,"Povinné pojistné na úrazové pojištění",null,null,60.839599999999997,274.13200999999998,166.73193999999998,0.60821769774350687,54.419599999999996,202.78903,129.24626999999998,0.63734349930072642,6.42,71.342979999999997,37.485669999999999,0.52542899105139707,null,null,5024,null,"Odstupné",null,null,0,0,0,"x",0,0,0,"x",0,0,0,"x",null,null,null,5024,null,"Odstupné",null,null,0,303.38900000000001,302.048,0.99557993203445083,0,303.38900000000001,302.048,0.99557993203445083,null,null,null,"x",null,null,5024,null,"Odstupné",null,null,0,0,0,0,0,0,0,0,0,0,0,0]
[{"$f":"IF(COUNTBLANK(C25:IV25)=254,\"odstr\",IF(AND($A$1=\"TISK\",SUM(J19:U19)=0),\"odstr\",\"OK\"))","v":{"$error":"#REF!"}},"OK",null,null,5039,null,"Ostatní povinné pojistné placené zaměstnavatelem",null,null,75,2371.34,1824.1207899999999,0.76923629256032444,75,2371.34,1824.1207899999999,0.76923629256032444,0,0,0,"x ",null,null,5029,null,"Ostatní platby za provedenou práci jinde nezařazené",null,null,24,128,106.45605,{"$f":"AE25/AD25","v":0.83168789062500004},24,128,106.45605,{"$f":"AI25/AH25","v":0.83168789062500004},0,0,0,"x",null,null,null,5029,null,"Ostatní platby za provedenou práci jinde nezařazené",null,null,0,80,52.353339999999996,0.65441674999999999,0,80,52.353339999999996,0.65441674999999999,null,null,null,"x",null,null,5029,null,"Ostatní platby za provedenou práci jinde nezařazené",null,null,0,0,0,0,0,0,0,0,0,0,0,0]
[null,null,null,null,5041,null,"Odměny za užití duševního vlastnictví",null,null,116.8,185.40899999999999,147.98599999999999,0.79815974413324053,116.8,185.40899999999999,147.98599999999999,0.79815974413324053,0,0,0,"x ",null,null,503,null,"Povinné pojistné placené zaměstnavatelem",null,null,{"$f":"AC27+AC28+AC29+AC30","v":22002.384999999998},{"$f":"AD27+AD28+AD29+AD30","v":60497.712370000001},{"$f":"SUM(AE27:AE30)","v":49494.022810000002},0.81811395623189576,{"$f":"SUM(AG27:AG30)","v":20168.815999999995},{"$f":"SUM(AH27:AH30)","v":44773.464380000005},{"$f":"SUM(AI27:AI30)","v":37779.047229999996},0.84378208729534077,{"$f":"AK27+AK28+AK29","v":1833.569},{"$f":"SUM(AL27:AL30)","v":15724.24799},{"$f":"AM27+AM28+AM29+AM30","v":11714.97558},{"$f":"AM26/AL26","v":0.74502612700144777},null,null,null,503,"Povinné pojistné placené zaměstnavatelem",null,null,null,22426.665000000001,69687.992799999993,53487.768539999997,0.76753205811948721,{"$f":"SUM(BA27:BA30)","v":20878.264999999999},{"$f":"SUM(BB27:BB30)","v":50537.468939999992},{"$f":"SUM(BC27:BC30)","v":39404.810669999999},0.77971476404532425,{"$f":"SUM(BE27:BE30)","v":1548.4},{"$f":"SUM(BF27:BF30)","v":19150.523860000001},{"$f":"SUM(BG27:BG30)","v":14082.957869999998},{"$f":"BG26/BF26","v":0.73538238290260527},null,null,503,"Povinné pojistné placené zaměstnavatelem",null,null,null,26365.24541,68276.318369999994,48891.971340000004,{"$f":"BR26/BQ26","v":0.71608974395846603},{"$f":"SUM(BT27:BT30)","v":23586.44541},{"$f":"SUM(BU27:BU30)","v":47690.840359999987},{"$f":"SUM(BV27:BV30)","v":35198.186170000001},{"$f":"BV26/BU26","v":0.73804919150726433},{"$f":"SUM(BX27:BX30)","v":2778.8},{"$f":"SUM(BY27:BY30)","v":20585.478009999999},{"$f":"SUM(BZ27:BZ30)","v":13693.785170000001},{"$f":"BZ26/BY26","v":0.6652157974348637}]
[{"$f":"IF(COUNTBLANK(C27:IV27)=254,\"odstr\",IF(AND($A$1=\"TISK\",SUM(J20:U20)=0),\"odstr\",\"OK\"))","v":{"$error":"#REF!"}},"OK",null,null,5042,null,"Odměny za užití počítačových programů",null,null,8563.6749999999993,8112.5909999999994,8101.1538999999993,0.99859020379555674,723.67499999999995,750.02099999999996,738.64589999999998,0.98483362465850954,7840,7362.57,7362.5079999999998,0.99999157902743196,null,null,5031,null,"Povinné pojistné na sociální zabezpečení a příspěvek na státní politiku zaměstnanosti",null,null,16073.563,42242.631650000003,35108.674050000001,0.83111947998154601,14725.677,30835.039690000001,26536.733120000001,0.86060317699561872,1347.886,11407.59196,8571.9409300000007,{"$f":"AM27/AL27","v":0.75142422345197568},null,null,null,5031,null,"Povinné pojistné na sociální zabezpečení a příspěvek na státní politiku zaměstnanosti",null,null,16084.57,49039.830479999997,38461.413739999996,0.78428928818760468,14947.57,35287.034059999998,28179.062839999999,0.7985670541787665,1137,13752.796420000001,10282.350899999999,{"$f":"BG27/BF27","v":0.74765528304097439},null,null,5031,null,"Povinné pojistné na sociální zabezpečení a příspěvek na státní politiku zaměstnanosti",null,null,18928.756649999999,48780.219569999994,35536.192430000003,0.72849595067946116,17025.656650000001,34362.887819999996,25552.14919,0.74359725887554939,1903.1,14417.331749999999,9984.0432400000009,{"$f":"BZ27/BY27","v":0.69250284401619611}]
[{"$f":"IF(COUNTBLANK(C28:IV28)=254,\"odstr\",IF(AND($A$1=\"TISK\",SUM(J21:U21)=0),\"odstr\",\"OK\"))","v":{"$error":"#REF!"}},"OK",null,null,5051,null,"Mzdové náhrady",null,null,0,5.0999999999999996,5.0609999999999999,0.99235294117647066,0,5.0999999999999996,5.0609999999999999,0.99235294117647066,0,0,0,"x ",null,null,5032,null,"Povinné pojistné na veřejné zdravotní pojištění",null,null,5792.5630000000001,15884.89417,12479.82151,0.78564083439531029,5307.08,11686.452509999999,9394.2173999999995,0.80385535233737071,485.483,4198.4416600000004,3085.6041100000002,{"$f":"AM28/AL28","v":0.73494033259950076},null,null,null,5032,null,"Povinné pojistné na veřejné zdravotní pojištění",null,null,6216.4250000000002,18749.206320000001,13976.804639999998,0.74546113587169682,5805.4250000000002,13523.01893,10261.537189999999,0.75881999745156015,411,5226.1873900000001,3715.2674499999994,{"$f":"BG28/BF28","v":0.71089441934457676},null,null,5032,null,"Povinné pojistné na veřejné zdravotní pojištění",null,null,7189.0312200000008,18819.280750000002,13105.771830000002,0.69640131331799171,6429.3312200000009,13033.6885,9482.6200500000014,0.72754692963545975,759.7,5785.5922500000006,3623.1517800000001,{"$f":"BZ28/BY28","v":0.62623697340579088}]
[{"$f":"IF(COUNTBLANK(C29:IV29)=254,\"odstr\",IF(AND($A$1=\"TISK\",SUM(J24:U24)=0),\"odstr\",\"OK\"))","v":{"$error":"#REF!"}},"OK",null,null,50,null,"Výdaje na platby, ostatních platby za provedenou práci a pojistné",null,null,114934.68176000001,291435.44609000004,233275.30136000001,0.80043558355616351,97364.671759999997,236656.83911000003,190313.12259000001,0.80417334781329064,17570.010000000002,54778.606979999997,42962.178770000006,0.78428753739002088,null,null,5038,null,"Povinné pojistné na úrazové pojištění",null,null,69.959000000000003,341.64654999999999,179.66166000000001,0.5258699670756225,69.759,223.43217999999999,122.23112,0.54706139464780768,0.2,118.21437,57.430540000000001,{"$f":"AM29/AL29","v":0.48581691041452912},null,null,null,5038,null,"Povinné pojistné na úrazové pojištění",null,null,110.67,325.10599999999999,199.51405999999997,0.61368925827268639,110.27,153.56594999999999,114.17453999999999,0.74348864445536267,0.4,171.54005000000001,85.339519999999993,{"$f":"BG29/BF29","v":0.49749035283597032},null,null,5038,null,"Povinné pojistné na úrazové pojištění",null,null,207.45753999999999,564.61805000000004,231.57603,0.41014634583502951,91.457540000000009,182.06404000000001,144.98588000000001,0.79634550568030904,116,382.55401000000001,86.590149999999994,{"$f":"BZ29/BY29","v":0.22634751626312843}]
[{"$f":"IF(COUNTBLANK(C30:IV30)=254,\"odstr\",IF(AND($A$1=\"TISK\",SUM(J25:U25)=0),\"odstr\",\"OK\"))","v":{"$error":"#REF!"}},"OK",null,null,5122,null,"Podlimitní věcná břemena",null,null,0,700.8,0.72599999999999998,1.0359589041095891E-3,0,700.8,0.72599999999999998,1.0359589041095891E-3,0,0,0,"x ",null,null,5039,null,"Ostatní povinné pojistné placené zaměstnavatelem",null,null,66.3,2028.54,1725.8655900000001,0.85079199325623367,66.3,2028.54,1725.8655900000001,0.85079199325623367,0,0,0,"x",null,null,null,5039,null,"Ostatní povinné pojistné placené zaměstnavatelem",null,null,15,1573.85,850.03610000000003,0.5400998189153986,15,1573.85,850.03610000000003,0.5400998189153986,null,null,null,"x",null,null,5039,null,"Ostatní povinné pojistné placené zaměstnavatelem",null,null,40,112.2,18.431049999999999,0.16426960784313724,40,112.2,18.431049999999999,0.16426960784313724,0,0,0,0]
[null,null,null,null,5131,null,"Potraviny",null,null,9447.1,10367.2585,9646.8488200000011,0.93051107194828808,9447.1,10367.2585,9646.8488200000011,0.93051107194828808,0,0,0,"x ",null,null,504,null,"Odměny za užití duševního vlastnictví",null,null,{"$f":"AC32+AC33","v":9463.0489999999991},{"$f":"AD32+AD33","v":11293.734},{"$f":"AE32+AE33","v":11155.259690000001},0.9877388373057131,{"$f":"AG32+AG33","v":1623.049},{"$f":"SUM(AH32:AH33)","v":1764.6239999999998},{"$f":"AI32+AI33","v":1626.60169},0.92178372843166601,{"$f":"AK33","v":7840},{"$f":"AL32+AL33","v":9529.11},{"$f":"AM32+AM33","v":9528.6579999999994},{"$f":"AM31/AL31","v":0.99995256639917041},null,null,null,504,"Odměny za užití duševního vlastnictví",null,null,null,9383.2309999999998,10621.243,9802.9328799999985,0.92295533394726004,{"$f":"SUM(BA32:BA33)","v":1199.231},{"$f":"SUM(BB32:BB33)","v":1231.453},{"$f":"SUM(BC32:BC33)","v":801.66066000000001},0.65098762193928639,{"$f":"SUM(BE32:BE33)","v":8184},{"$f":"SUM(BF32:BF33)","v":9389.7900000000009},{"$f":"SUM(BG32:BG33)","v":9001.2722199999989},{"$f":"BG31/BF31","v":0.9586233792236033},null,null,504,"Odměny za užití duševního vlastnictví",null,null,null,11839.030999999999,11451.779200000001,10888.72868,0.95083292210174641,{"$f":"SUM(BT32:BT33)","v":2037.0309999999999},{"$f":"SUM(BU32:BU33)","v":1666.4292},{"$f":"SUM(BV32:BV33)","v":1428.5334399999999},0.85724220386920724,{"$f":"SUM(BX32:BX33)","v":9802},{"$f":"SUM(BY32:BY33)","v":9785.35},{"$f":"SUM(BZ32:BZ33)","v":9460.1952400000009},{"$f":"BZ31/BY31","v":0.96677126929542634}]
[{"$f":"IF(COUNTBLANK(C32:IV32)=254,\"odstr\",IF(AND($A$1=\"TISK\",SUM(J26:U26)=0),\"odstr\",\"OK\"))","v":{"$error":"#REF!"}},"OK",null,null,5132,null,"Ochranné pomůcky",null,null,41.34,51.674999999999997,43.607610000000001,0.84388214804063866,41.34,51.674999999999997,43.607610000000001,0.84388214804063866,0,0,0,"x ",null,null,5041,null,"Odměny za užití duševního vlastnictví",null,null,538.99900000000002,2860.6529999999998,2751.1761999999999,0.96173013644087557,538.99900000000002,343.54300000000001,234.0752,0.681356336761337,0,2517.11,2517.1010000000001,{"$f":"AM32/AL32","v":0.99999642447092096},null,null,null,5041,null,"Odměny za užití duševního vlastnictví",null,null,92,2406.9970000000003,2004.87994,0.83293827952423694,92,239.697,218.72994,0.91252681510406886,0,2167.3000000000002,1786.15,{"$f":"BG32/BF32","v":0.82413602177824941},null,null,5041,null,"Odměny za užití duševního vlastnictví",null,null,2419,2828.3489999999997,2370.8851599999998,0.83825764076498344,483,198.999,59.205159999999999,0.29751486188372805,1936,2629.35,2311.6799999999998,{"$f":"BZ32/BY32","v":0.87918306805864566}]
[{"$f":"IF(COUNTBLANK(C33:IV33)=254,\"odstr\",IF(AND($A$1=\"TISK\",SUM(J27:U27)=0),\"odstr\",\"OK\"))","v":{"$error":"#REF!"}},"OK",null,null,5133,null,"Léky a zdravotnický materiál",null,null,7.5,50.954999999999998,20.744,0.40710430772250028,7.5,50.954999999999998,20.744,0.40710430772250028,0,0,0,"x ",null,null,5042,null,"Odměny za užití počítačových programů",null,null,8924.0499999999993,8433.0810000000001,8404.0834900000009,0.99656145719458888,1084.05,1421.0809999999999,1392.52649,0.97990648668161773,7840,7012,7011.5569999999998,{"$f":"AM33/AL33","v":0.99993682258984595},null,null,null,5042,null,"Odměny za užití počítačových programů",null,null,9291.2309999999998,8214.2459999999992,7798.0529399999996,0.94933277381758474,1107.231,991.75599999999997,582.93072000000006,0.58777634821468194,8184,7222.49,7215.1222199999993,{"$f":"BG33/BF33","v":0.99897988366892854},null,null,5042,null,"Odměny za užití počítačových programů",null,null,9420.030999999999,{"$f":"SUM(BU33,BY33)","v":8623.4302000000007},8517.8435200000004,0.98775583757841512,1554.0309999999999,1467.4302,1369.3282799999999,0.9331471302689559,7866,7156,7148.5152400000006,{"$f":"BZ33/BY33","v":0.99895405813303528}]
[null,null,null,null,5134,null,"Prádlo, oděv a obuv",null,null,49.5,234.99799999999999,191.06700000000001,0.81305798347219982,49.5,234.99799999999999,191.06700000000001,0.81305798347219982,0,0,0,"x ",null,null,505,null,"Mzdové náhrady",null,null,{"$f":"AC35","v":0},{"$f":"AD35","v":0},0,"x",0,null,0,"x",0,0,0,"x",null,null,null,505,"Mzdové náhrady",null,null,null,0,0,0,"x",0,0,0,"x",0,0,0,"x",null,null,505,"Mzdové náhrady",null,null,null,{"$f":"SUM(BT34,BX34)","v":0},0,0,0,{"$f":"BT35","v":0},{"$f":"BU35","v":0},{"$f":"BV35","v":0},0,{"$f":"BX35","v":0},{"$f":"BY35","v":0},{"$f":"BZ35","v":0},0]
[{"$f":"IF(COUNTBLANK(C35:IV35)=254,\"odstr\",IF(AND($A$1=\"TISK\",SUM(J28:U28)=0),\"odstr\",\"OK\"))","v":{"$error":"#REF!"}},"OK",null,null,5135,null,"Učebnice a bezplatně poskytované školní potřeby",null,null,114,81.67,9.7029999999999994,0.11880739561650544,114,81.67,9.7029999999999994,0.11880739561650544,0,0,0,"x ",null,null,5051,null,"Mzdové náhrady",null,null,0,0,0,"x",0,0,0,"x",0,0,0,"x",null,null,null,5051,null,"Mzdové náhrady",null,null,null,null,null,null,null,null,null,null,null,null,null,null,null,null,5051,null,"Mzdové náhrady",null,null,0,0,0,0,0,0,0,0,0,0,0,0]
[{"$f":"IF(COUNTBLANK(C36:IV36)=254,\"odstr\",IF(AND($A$1=\"TISK\",SUM(J29:U29)=0),\"odstr\",\"OK\"))","v":{"$error":"#REF!"}},"OK",null,null,5136,null,"Knihy, učební pomůcky a tisk",null,null,1236.56,2238.0027700000001,1817.7349100000001,0.81221298488383908,1230.56,2220.8367699999999,1812.2689100000002,0.81602976611378797,6,17.166,5.4660000000000002,0.31842013282069209,null,null,51,"Neinvestiční nákupy a související výdaje","Neinvestiční nákupy a související výdaje",null,null,{"$f":"AC37+AC40+AC50+AC56+AC65+AC75+AC84+AC88","v":3009383.0209599999},{"$f":"AD37+AD40+AD50+AD56+AD65+AD75+AD84+AD88","v":4632584.8287600009},{"$f":"AE37+AE40+AE50+AE56+AE65+AE75+AE84+AE88","v":3422039.68199},{"$f":"AE36/AD36","v":0.73868904909097455},{"$f":"AG37+AG40+AG50+AG56+AG65+AG75+AG84+AG88","v":2664387.6579600004},{"$f":"AH37+AH40+AH50+AH56+AH65+AH75+AH84+AH88","v":3961622.6829599994},{"$f":"AI37+AI40+AI50+AI56+AI65+AI75+AI84+AI88","v":3008595.9809599994},{"$f":"AI36/AH36","v":0.75943526724561039},{"$f":"AK37+AK40+AK50+AK56+AK65+AK75+AK84+AK88","v":344995.36300000001},{"$f":"AL37+AL40+AL50+AL56+AL65+AL75+AL84+AL88","v":679051.35659999994},{"$f":"AM37+AM40+AM50+AM56+AM65+AM75+AM84+AM88","v":413443.70103},{"$f":"AM36/AL36","v":0.60885483404393226},null,null,null,51,"Neinvestiční nákupy a související výdaje","Neinvestiční nákupy a související výdaje",null,null,{"$f":"BA36+BE36","v":2926265.1506399997},{"$f":"BB36+BF36","v":4238794.0580599997},{"$f":"BC36+BG36","v":3288006.0923000001},{"$f":"AY36/AX36","v":0.77569375800362572},{"$f":"BA37+BA40+BA50+BA56+BA65+BA75+BA84+BA88","v":2601407.5736399996},{"$f":"BB37+BB40+BB50+BB56+BB65+BB75+BB84+BB88","v":3667067.81219},{"$f":"BC37+BC40+BC50+BC56+BC65+BC75+BC84+BC88","v":2905548.1620800002},{"$f":"BC36/BB36","v":0.79233554187938116},{"$f":"BE37+BE40+BE50+BE56+BE65+BE75+BE84+BE88","v":324857.57699999999},{"$f":"BF37+BF40+BF50+BF56+BF65+BF75+BF84+BF88","v":571726.24586999998},{"$f":"BG37+BG40+BG50+BG56+BG65+BG75+BG84+BG88","v":382457.93022000004},{"$f":"BG36/BF36","v":0.66895290006847774},null,null,51,"Neinvestiční nákupy a související výdaje","Neinvestiční nákupy a související výdaje",null,null,{"$f":"SUM(BT36,BX36)","v":3050319.4265899998},{"$f":"SUM(BU36,BY36)","v":4282787.9813000001},3190256.2166300002,{"$f":"BR36/BQ36","v":0.74490173937156423},{"$f":"SUM(BT37,BT40,BT50,BT56,BT65,BT75,BT84,BT88)","v":2696968.92759},{"$f":"SUM(BU37,BU40,BU50,BU56,BU65,BU75,BU84,BU88)","v":3876473.9076500004},{"$f":"SUM(BV37,BV40,BV50,BV56,BV65,BV75,BV84,BV88)","v":2936343.2308800002},{"$f":"BV36/BU36","v":0.75747787830721469},{"$f":"SUM(BX37,BX40,BX50,BX56,BX65,BX75,BX84,BX88)","v":353350.49900000001},{"$f":"SUM(BY37,BY40,BY50,BY56,BY65,BY75,BY84,BY88)","v":406314.07365000003},{"$f":"SUM(BZ37,BZ40,BZ50,BZ56,BZ65,BZ75,BZ84,BZ88)","v":253912.98575000002},{"$f":"BZ36/BY36","v":0.6249180183916575}]
[null,null,null,null,5137,null,"Drobný hmotný dlouhodobý majetek",null,null,51554.656999999999,239163.34194000001,198307.55158999996,0.82917202101879928,51473.656999999999,226480.41275000002,187477.94597999996,0.82778878625122931,81,12682.929189999999,10829.605609999999,0.85387259108398439,null,null,512,"Výdaje na některé úpravy hmotných věcí a pořízení některých práv k hmotným věcem",null,null,null,{"$f":"AC38","v":110},{"$f":"AD38+AD39","v":259.39999999999998},{"$f":"AE38+AE39","v":4086.3594600000001},{"$f":"AE37/AD37","v":15.753120508866617},{"$f":"AG38","v":110},{"$f":"AH38+AH39","v":4136.6054000000004},{"$f":"AI38+AI39","v":3936.71207},{"$f":"AI37/AH37","v":0.95167696440177729},0,{"$f":"SUM(AL38:AL39)","v":4212.0054},{"$f":"AM39","v":149.64739},{"$f":"AM37/AL37","v":3.5528774488275822E-2},null,null,null,512,"Výdaje na některé úpravy hmotných věcí a pořízení některých práv k hmotným věcem",null,null,null,551.10099999999989,3900.9759199999999,4005.7675199999999,1.0268629189590075,{"$f":"SUM(BA38:BA39)","v":551.10099999999989},{"$f":"SUM(BB38:BB39)","v":3879.2359200000001},{"$f":"SUM(BC38:BC39)","v":3984.5400799999998},1.0271455931455697,0,{"$f":"SUM(BF38:BF39)","v":21.740000000000002},{"$f":"SUM(BG38:BG39)","v":21.227440000000001},{"$f":"BG37/BF37","v":0.97642318307267706},null,null,512,"Výdaje na některé úpravy hmotných věcí a pořízení některých práv k hmotným věcem",null,null,null,285,2068.7089999999998,1784.3527399999998,{"$f":"BR37/BQ37","v":0.86254409875917781},{"$f":"SUM(BT38:BT39)","v":185},{"$f":"SUM(BU38:BU39)","v":1957.7089999999998},{"$f":"SUM(BV38:BV39)","v":1780.8633999999997},{"$f":"BV37/BU37","v":0.90966706492129312},{"$f":"SUM(BX38:BX39)","v":100},{"$f":"SUM(BY38:BY39)","v":111},{"$f":"SUM(BZ38:BZ39)","v":3.4893400000000003},3.14354954954955E-2]
[{"$f":"IF(COUNTBLANK(C38:IV38)=254,\"odstr\",IF(AND($A$1=\"TISK\",SUM(J30:U30)=0),\"odstr\",\"OK\"))","v":{"$error":"#REF!"}},"OK",null,null,5138,null,"Nákup zboží (za účelem dalšího prodeje)",null,null,420,5,0.83871000000000007,0.167742,420,5,0.83871000000000007,0.167742,0,0,0,"x ",null,null,5122,null,"Podlimitní věcná břemena",null,null,110,92,0,"x",110,92,0,"x",0,0,null,"x",null,null,null,5122,null,"Podlimitní věcná břemena",null,null,0,19.5,16.309999999999999,0.83641025641025635,0,15,12.1,0.80666666666666664,0,4.5,4.21,{"$f":"BG38/BF38","v":0.93555555555555558},null,null,5122,null,"Podlimitní věcná břemena",null,null,0,11,2.6,0.23636363636363636,0,0,0,0,0,11,2.6,0.23636363636363636]
[null,null,null,null,null,null,null,null,null,null,null,null,null,null,null,null,null,null,null,null,null,null,null,5123,null,"Podlimitní technické zhodnocení",null,null,null,167.4,4086.3594600000001,{"$f":"AE39/AD39","v":24.41074946236559},null,4044.6053999999999,3936.71207,{"$f":"AI39/AH39","v":0.97332413935856388},null,4212.0054,149.64739,{"$f":"AM39/AL39","v":3.5528774488275822E-2},null,null,null,5123,null,"Podlimitní technické zhodnocení",null,null,551.10099999999989,3881.4759199999999,3989.4575199999999,1.0278197268836851,551.10099999999989,3864.2359200000001,3972.4400799999999,1.0280014373449538,0,17.240000000000002,17.017440000000001,{"$f":"BG39/BF39","v":0.98709048723897908},null,null,5123,null,"Podlimitní technické zhodnocení",null,null,285,2057.7089999999998,1781.7527399999997,0.86589150360911082,185,1957.7089999999998,1780.8633999999997,{"$f":"BV39/BU39","v":0.90966706492129312},100,100,0.88934000000000002,8.893400000000001E-3]
[null,null,null,null,5139,null,"Nákup materiálu jinde nezařazený",null,null,38598.438999999998,64483.157090000008,49673.814870000002,0.77033782326553257,34695.438999999998,57757.048080000008,43818.064160000002,0.75866176711986832,3903,6726.109010000001,5855.7507100000003,0.87060003061116009,null,null,513,null,"Nákupy materiálu",null,null,{"$f":"SUM(AC41:AC49)","v":344565.989},{"$f":"SUM(AD41:AD49)","v":996828.86114000005},{"$f":"SUM(AE41:AE49)","v":747571.70173000009},0.74994989699140246,{"$f":"SUM(AG41:AG49)","v":278055.78899999999},{"$f":"SUM(AH41:AH49)","v":713434.84184000001},{"$f":"SUM(AI41:AI49)","v":584076.65660999995},0.81868255144874069,{"$f":"AK46+AK47+AK49","v":66510.2},{"$f":"SUM(AL41:AL49)","v":283394.01929999999},{"$f":"SUM(AM41:AM49)","v":163495.04512},{"$f":"AM40/AL40","v":0.57691776814430462},null,null,null,513,"Nákupy materiálu",null,null,null,280605.71590000001,939514.94876000006,814718.26275000011,0.86716902570341181,{"$f":"SUM(BA41:BA49)","v":275557.71590000001},{"$f":"SUM(BB41:BB49)","v":789030.4932100001},{"$f":"SUM(BC41:BC49)","v":707292.37633000012},0.89640689734630397,{"$f":"SUM(BE41:BE49)","v":5048},{"$f":"SUM(BF41:BF49)","v":150484.45555000001},{"$f":"SUM(BG41:BG49)","v":107425.88642000001},{"$f":"BG40/BF40","v":0.7138669972747228},null,null,513,"Nákupy materiálu",null,null,null,264658.98687000002,722378.96744000004,608849.88883000007,0.84283999987938529,{"$f":"SUM(BT41:BT49)","v":251206.64687},{"$f":"SUM(BU41:BU49)","v":671813.54645999998},{"$f":"SUM(BV41:BV49)","v":574566.78883000009},0.85524739990370235,{"$f":"SUM(BX41:BX49)","v":13452.34},{"$f":"SUM(BY41:BY49)","v":50565.420980000003},{"$f":"SUM(BZ41:BZ49)","v":34283.100000000006},0.67799494863416454]
[{"$f":"IF(COUNTBLANK(C41:IV41)=254,\"odstr\",IF(AND($A$1=\"TISK\",SUM(J31:U31)=0),\"odstr\",\"OK\"))","v":{"$error":"#REF!"}},"OK",null,null,5141,null,"Úroky vlastní",null,null,16843.965199999999,17338.01629,14494.258480000004,0.8359813624330148,16843.965199999999,17338.01629,14494.258480000004,0.8359813624330148,0,0,0,"x ",null,null,5131,null,"Potraviny",null,null,13716.2,10788.71,9911.5167399999991,0.91869340634793228,13716.2,10788.71,9911.5167399999991,0.91869340634793228,0,0,0,"x",null,null,null,5131,null,"Potraviny",null,null,10137,10236.162,9803.4292499999992,0.95772509755121094,10137,10236.162,9803.4292499999992,0.95772509755121094,null,null,null,"x",null,null,5131,null,"Potraviny",null,null,10819.338,1680.9454500000004,1443.9112,0.8589875418027394,10819.338,1676.9454500000004,1443.9112,0.86103647557527863,0,4,0,0]
[{"$error":"#REF!"},"OK",null,null,5142,null,"Realizované kurzové ztráty",null,null,2,12.815,6.6924399999999995,0.52223488099882953,2,12.815,6.6924399999999995,0.52223488099882953,0,0,0,"x ",null,null,5132,null,"Ochranné pomůcky",null,null,109.8,78.725999999999999,64.305499999999995,0.81682671544343666,109.8,78.725999999999999,64.305499999999995,0.81682671544343666,0,0,0,"x",null,null,null,5132,null,"Ochranné pomůcky",null,null,49.3,78.707499999999996,68.201949999999997,0.86652415589365694,49.3,78.707499999999996,68.201949999999997,0.86652415589365694,null,null,null,"x",null,null,5132,null,"Ochranné pomůcky",null,null,66,296.12400000000002,232.68672000000001,0.78577460793451392,66,296.12400000000002,232.68672000000001,0.78577460793451392,0,0,0,0]
[{"$error":"#REF!"},"OK",null,null,5143,null,"Úroky vzniklé převzetím cizích závazků",null,null,0,40.299999999999997,40.238999999999997,0.99848635235732008,0,40.299999999999997,40.238999999999997,0.99848635235732008,0,0,0,"x ",null,null,5133,null,"Léky a zdravotnický materiál",null,null,151.999,95.801000000000002,79.321929999999995,0.82798645108088631,151.999,94.063999999999993,77.58493,0.82481002296308903,0,1.7370000000000001,1.7370000000000001,{"$f":"AM43/AL43","v":1},null,null,null,5133,null,"Léky a zdravotnický materiál",null,null,11,47.430999999999997,25.029900000000001,0.52771183403259481,11,47.430999999999997,25.029900000000001,0.52771183403259481,null,null,null,"x",null,null,5133,null,"Léky a zdravotnický materiál",null,null,19.5,158.32650000000001,126.99691,0.80212036519470831,19.5,140.256,108.92641,0.77662567020305728,0,18.070499999999999,18.070499999999999,{"$f":"BZ43/BY43","v":1}]
[{"$error":"#REF!"},"OK",null,null,5144,null,"Poplatky dluhové služby",null,null,3.6,0,0,"x ",3.6,0,0,"x ",0,0,0,"x ",null,null,5134,null,"Prádlo, oděv a obuv",null,null,94.04,105.342,89.176900000000003,0.84654648668147559,94.04,105.342,89.176900000000003,0.84654648668147559,0,0,0,"x",null,null,null,5134,null,"Prádlo, oděv a obuv",null,null,46.19,169.17000000000002,158.28283999999996,0.93564367204587073,46.19,169.17000000000002,158.28283999999996,0.93564367204587073,null,null,null,"x",null,null,5134,null,"Prádlo, oděv a obuv",null,null,162,232.78100000000001,187.32909000000001,0.80474390091974857,162,232.78100000000001,187.32909000000001,0.80474390091974857,0,0,0,0]
[{"$error":"#REF!"},"OK",null,null,5149,null,"Ostatní úroky a ostatní finanční výdaje",null,null,0,312.89999999999998,312.803,0.99968999680409087,0,312.89999999999998,312.803,0.99968999680409087,0,0,0,"x ",null,null,5135,null,"Učebnice a bezplatně poskytované školní potřeby",null,null,5,9,8.2840000000000007,0.92044444444444451,5,9,8.2840000000000007,0.92044444444444451,0,0,0,"x",null,null,null,5135,null,"Učebnice a bezplatně poskytované školní potřeby",null,null,5,11,10.763999999999999,0.9785454545454545,5,11,10.763999999999999,0.9785454545454545,null,null,null,"x",null,null,5135,null,"Učebnice a bezplatně poskytované školní potřeby",null,null,0,9,8.1609999999999996,0.90677777777777768,0,9,8.1609999999999996,0.90677777777777768,0,0,0,0]
[{"$error":"#REF!"},"OK",null,null,5151,null,"Studená voda",null,null,8776.7199999999993,9562.0551699999996,7732.8768999999993,0.80870448481212853,8776.7199999999993,9562.0551699999996,7732.8768999999993,0.80870448481212853,0,0,0,"x ",null,null,5136,null,"Knihy, učební pomůcky a tisk",null,null,1155.269,4735.2511000000004,4434.2555199999997,0.93643513857163763,1149.269,4625.9480999999996,4387.9325200000003,0.94854771933130866,6,109.303,46.323,{"$f":"AM46/AL46","v":0.42380355525465907},null,null,null,5136,null,"Knihy, učební pomůcky a tisk",null,null,2123.9499999999998,9706.6119800000015,8189.9800100000002,0.84375269423307053,2113.9499999999998,8292.7409800000005,7936.8710099999998,0.95708656874026699,10,1413.8710000000001,253.10900000000001,{"$f":"BG46/BF46","v":0.17901845359300814},null,null,5136,null,"Knihy, učební pomůcky a tisk",null,null,2154.85,4510.2244699999992,3079.0101399999999,0.68267337035666442,2044.85,3655.2664699999996,2755.47514,0.75383700822227617,110,854.95799999999997,323.53499999999997,{"$f":"BZ46/BY46","v":0.3784220979276175}]
[{"$error":"#REF!"},"OK",null,null,5152,null,"Teplo",null,null,52953.62,52772.050759999998,48187.882230000003,0.91313264381465553,52953.62,52726.460760000002,48164.282230000004,0.91347459199345671,0,45.59,23.6,0.51765738100460623,null,null,5137,null,"Drobný hmotný dlouhodobý majetek",null,null,250772.39300000001,825458.41592000006,645698.76604000002,0.78223052014116046,189007.39300000001,580739.60013000004,492373.39395,0.84783850427933782,61765,244718.81578999999,153325.37208999999,{"$f":"AM47/AL47","v":0.62653691582739901},null,null,null,5137,null,"Drobný hmotný dlouhodobý majetek",null,null,215261.05590000001,814418.08733999997,724938.79099000001,0.89013100551063218,214783.05590000001,684569.24049999996,629350.00236000004,0.91933724907115522,478,129848.84684,95588.78863000001,{"$f":"BG47/BF47","v":0.73615431292805167},null,null,5137,null,"Drobný hmotný dlouhodobý majetek",null,null,197948.93484999999,607426.46181999997,529959.2096200001,0.87246645138262691,190309.59484999999,568859.14929999993,503760.66064000013,0.88556308052686561,7639.34,38567.312519999999,26198.548980000007,{"$f":"BZ47/BY47","v":0.67929412935926314}]
[{"$error":"#REF!"},"OK",null,null,5153,null,"Plyn",null,null,36809.315999999999,38752.739170000001,30882.571179999999,0.79691324642949102,36809.315999999999,38752.739170000001,30882.571179999999,0.79691324642949102,0,0,0,"x ",null,null,5138,null,"Nákup zboží (za účelem dalšího prodeje)",null,null,505,138.453,125.31229999999999,0.90508909160509332,505,138.453,125.31229999999999,0.90508909160509332,0,0,0,"x",null,null,null,5138,null,"Nákup zboží (za účelem dalšího prodeje)",null,null,250,13.135999999999999,13.177,1.0031211936662607,250,13.135999999999999,13.177,1.0031211936662607,null,null,null,"x",null,null,5138,null,"Nákup zboží (za účelem dalšího prodeje)",null,null,250,77.333100000000002,77.171629999999993,0.99791201956212783,250,77.333100000000002,77.171629999999993,0.99791201956212783,0,0,0,0]
[{"$f":"IF(COUNTBLANK(C49:IV49)=254,\"odstr\",IF(AND($A$1=\"TISK\",SUM(J40:U40)=0),\"odstr\",\"OK\"))","v":{"$error":"#REF!"}},"OK",null,null,5154,null,"Elektrická energie",null,null,40931.839999999997,43760.854260000007,37093.955069999996,0.84765153005493432,40931.839999999997,43742.979260000007,37079.892069999994,0.84767642024572942,0,17.875,14.063000000000001,0.78674125874125878,null,null,5139,null,"Nákup materiálu jinde nezařazený",null,null,78056.288,155419.16211999999,87160.762799999997,0.56081091682055706,73317.088000000003,116854.99861,77039.149770000004,0.65927132503005559,4739.2,38564.163509999998,10121.61303,{"$f":"AM49/AL49","v":0.26246162521781097},null,null,null,5139,null,"Nákup materiálu jinde nezařazený",null,null,52722.22,104834.64294000001,71510.606809999997,0.68212763266554599,48162.22,85612.905230000004,59926.618020000002,0.69997178414873884,4560,19221.737710000001,11583.988789999999,{"$f":"BG49/BF49","v":0.60265044528068312},null,null,5139,null,"Nákup materiálu jinde nezařazený",null,null,53238.364020000008,107987.77110000003,73735.412519999983,0.68281261636300195,47535.364020000008,96866.691140000024,65992.46699999999,0.68127099442905548,5703,11121.079960000001,7742.9455200000011,{"$f":"BZ49/BY49","v":0.6962404323905248}]
[null,null,null,null,5155,null,"Pevná paliva",null,null,2670,3278.0126199999995,3018.5150599999997,0.92083692466077205,2670,3278.0126199999995,3018.5150599999997,0.92083692466077205,0,0,0,"x ",null,null,514,null,"Úroky a ostatní finanční výdaje",null,null,{"$f":"SUM(AC51:AC55)","v":17019.978649999997},{"$f":"SUM(AD51:AD55)","v":18445.95047},{"$f":"SUM(AE51:AE55)","v":15971.07806},0.86583112569747678,{"$f":"SUM(AG51:AG55)","v":17019.978649999997},{"$f":"SUM(AH51:AH55)","v":18445.95047},{"$f":"SUM(AI51:AI55)","v":15971.07806},0.86583112569747678,0,{"$f":"SUM(AL51:AL55)","v":0},0,"x",null,null,null,514,"Úroky a ostatní finanční výdaje",null,null,null,22743.335999999999,26164.930439999996,23774.594399999998,0.90864351634790741,{"$f":"SUM(BA51:BA55)","v":22743.335999999999},{"$f":"SUM(BB51:BB55)","v":26164.930439999996},{"$f":"SUM(BC51:BC55)","v":23774.594399999998},0.90864351634790741,{"$f":"SUM(BE51:BE55)","v":0},0,0,"x",null,null,514,"Úroky a ostatní finanční výdaje",null,null,null,25839.004900000004,27098.523369999999,22347.895080000002,0.82469051080254496,{"$f":"SUM(BT51:BT55)","v":25839.004900000004},{"$f":"SUM(BU51:BU55)","v":27098.523369999999},{"$f":"SUM(BV51:BV55)","v":22347.895080000002},0.82469051080254496,{"$f":"SUM(BX51:BX55)","v":0},{"$f":"SUM(BY51:BY55)","v":0},{"$f":"SUM(BZ51:BZ55)","v":0},0]
[{"$f":"IF(COUNTBLANK(C51:IV51)=254,\"odstr\",IF(AND($A$1=\"TISK\",SUM(J41:U41)=0),\"odstr\",\"OK\"))","v":{"$error":"#REF!"}},"OK",null,null,5156,null,"Pohonné hmoty a maziva",null,null,1878.5,1509.8193500000002,1347.1448899999998,0.89225567946257911,1868.5,1499.4193500000001,1346.7468899999999,0.89817894506963636,10,10.4,0.39800000000000002,3.8269230769230771E-2,null,null,5141,null,"Úroky vlastní",null,null,15907.978649999999,18430.829470000001,15944.47572,0.86509810890242045,15907.978649999999,18430.829470000001,15944.47572,0.86509810890242045,0,0,0,"x",null,null,null,5141,null,"Úroky vlastní",null,null,21641.335999999999,26157.280439999999,23769.215059999999,0.9087036060389464,21641.335999999999,26157.280439999999,23769.215059999999,0.9087036060389464,null,null,null,"x",null,null,5141,null,"Úroky vlastní",null,null,24727.004900000004,26441.988939999999,21751.173640000001,0.82259975561429921,24727.004900000004,26441.988939999999,21751.173640000001,0.82259975561429921,0,0,0,0]
[{"$f":"IF(COUNTBLANK(C52:IV52)=254,\"odstr\",IF(AND($A$1=\"TISK\",SUM(J42:U42)=0),\"odstr\",\"OK\"))","v":{"$error":"#REF!"}},null,null,null,5157,null,"Teplá voda",null,null,324,234.67099999999999,106.70622,0.45470560912937691,324,225.6,106.70622,0.47298856382978727,0,9.0709999999999997,0,0,null,null,5142,null,"Realizované kurzové ztráty",null,null,2,4,1.5949599999999999,0.39873999999999998,2,4,1.5949599999999999,0.39873999999999998,0,0,0,"x",null,null,null,5142,null,"Realizované kurzové ztráty",null,null,2,6.35,5.0063399999999998,0.78839999999999999,2,6.35,5.0063399999999998,0.78839999999999999,null,null,null,"x",null,null,5142,null,"Realizované kurzové ztráty",null,null,7,{"$f":"SUM(BU52,BY52)","v":71.834429999999998},66.180440000000004,0.92129136404367662,7,71.834429999999998,66.180440000000004,0.92129136404367662,0,0,0,0]
[{"$f":"IF(COUNTBLANK(C53:IV53)=254,\"odstr\",IF(AND($A$1=\"TISK\",SUM(J43:U43)=0),\"odstr\",\"OK\"))","v":{"$error":"#REF!"}},"OK",null,null,5159,null,"Nákup ostatních paliv a energie",null,null,1963,2114.7397800000003,2095.4197199999999,0.99086409581797319,1963,2114.7397800000003,2095.4197199999999,0.99086409581797319,0,0,0,"x ",null,null,5143,null,"Úroky vzniklé převzetím cizích závazků",null,null,0,0,0,"x",0,0,0,"x",0,0,0,"x",null,null,null,5143,null,"Úroky vzniklé převzetím cizích závazků",null,null,null,null,null,null,null,null,null,null,null,null,null,"x",null,null,5143,null,"Úroky vzniklé převzetím cizích závazků",null,null,0,0,0,0,0,0,0,0,0,0,0,0]
[{"$f":"IF(COUNTBLANK(C54:IV54)=254,\"odstr\",IF(AND($A$1=\"TISK\",SUM(J44:U44)=0),\"odstr\",\"OK\"))","v":{"$error":"#REF!"}},"OK",null,null,5161,null,"Služby pošt",null,null,26.4,40.563780000000001,17.589380000000002,0.4336228033975138,26.4,40.563780000000001,17.589380000000002,0.4336228033975138,0,0,0,"x ",null,null,5144,null,"Poplatky dluhové služby",null,null,10,11.121,25.007300000000001,{"$f":"AE54/AD54","v":2.2486556964301769},10,11.121,25.007300000000001,{"$f":"AI54/AH54","v":2.2486556964301769},0,0,0,"x",null,null,null,5144,null,"Poplatky dluhové služby",null,null,{"$f":"BA54+BE54","v":0},{"$f":"BB54+BF54","v":0.3},{"$f":"BC54+BG54","v":0.26},{"$f":"AY54/AX54","v":0.8666666666666667},0,0.3,0.26,{"$f":"BC54/BB54","v":0.8666666666666667},null,null,null,"x",null,null,5144,null,"Poplatky dluhové služby",null,null,5,5,3.7189999999999999,{"$f":"BR54/BQ54","v":0.74380000000000002},5,5,3.7189999999999999,{"$f":"BV54/BU54","v":0.74380000000000002},0,0,0,0]
[{"$f":"IF(COUNTBLANK(C55:IV55)=254,\"odstr\",IF(AND($A$1=\"TISK\",SUM(J45:U45)=0),\"odstr\",\"OK\"))","v":{"$error":"#REF!"}},"OK",null,null,5162,null,"Služby telekomunikací a radiokomunikací",null,null,4325.6705000000002,4683.2985499999986,4249.3283500000007,0.90733663562832267,4281.6705000000002,4579.1827599999988,4189.6877400000003,0.91494224178988681,44,104.11578999999999,59.640610000000002,0.57282963515908591,null,null,5149,null,"Ostatní úroky a ostatní finanční výdaje",null,null,1100,0,8.0000000000000007E-5,"x",1100,0,8.0000000000000007E-5,"x",0,0,0,"x",null,null,null,5149,null,"Ostatní úroky a ostatní finanční výdaje",null,null,1100,1,0.113,0.113,1100,1,0.113,0.113,null,null,null,"x",null,null,5149,null,"Ostatní úroky a ostatní finanční výdaje",null,null,1100,579.70000000000005,526.822,0.90878385371743997,1100,579.70000000000005,526.822,0.90878385371743997,0,0,0,0]
[null,null,null,null,5163,null,"Služby peněžních ústavů",null,null,21175.001,21158.488109999998,18575.350610000005,0.87791483556997907,21174.001,21145.488109999998,18574.361610000004,0.87840779618683418,1,13,0.98899999999999999,7.607692307692307E-2,null,null,515,null,"Nákup vody, paliv a energie",null,null,{"$f":"SUM(AC57:AC64)","v":149542.40099999998},{"$f":"SUM(AD57:AD64)","v":159386.07955999995},{"$f":"SUM(AE57:AE64)","v":132533.01952},{"$f":"AE56/AD56","v":0.83152192390872326},{"$f":"SUM(AG57:AG64)","v":149522.40099999998},{"$f":"SUM(AH57:AH64)","v":159362.14955999996},{"$f":"SUM(AI57:AI64)","v":132519.28438},{"$f":"AI56/AH56","v":0.83156059795808912},{"$f":"AK62","v":20},{"$f":"SUM(AL57:AL64)","v":23.93},{"$f":"SUM(AM57:AM64)","v":13.735140000000001},{"$f":"AM56/AL56","v":0.57397158378604263},null,null,null,515,"Nákup vody, paliv a energie",null,null,null,146583.29416000002,158070.34226999999,140530.51098999998,0.88903781045757324,{"$f":"SUM(BA57:BA64)","v":146573.29416000002},{"$f":"SUM(BB57:BB64)","v":158022.55327},{"$f":"SUM(BC57:BC64)","v":140492.29222999999},0.88906481589341546,{"$f":"SUM(BE57:BE64)","v":10},{"$f":"SUM(BF57:BF64)","v":47.789000000000001},{"$f":"SUM(BG57:BG64)","v":38.218759999999996},{"$f":"BG56/BF56","v":0.79973968904978121},null,null,515,"Nákup vody, paliv a energie",null,null,null,150170.01900000003,{"$f":"SUM(BU56,BY56)","v":160390.25113000002},{"$f":"SUM(BV56,BZ56)","v":128350.46408000001},0.80023856297830087,{"$f":"SUM(BT57:BT64)","v":150145.01900000003},{"$f":"SUM(BU57:BU64)","v":160321.46113000001},{"$f":"SUM(BV57:BV63)","v":128335.29826000001},0.80048732936594591,{"$f":"SUM(BX57:BX64)","v":25},{"$f":"SUM(BY57:BY64)","v":68.789999999999992},{"$f":"SUM(BZ57:BZ64)","v":15.165820000000002},{"$f":"BZ56/BY56","v":0.22046547463294089}]
[{"$f":"IF(COUNTBLANK(C57:IV57)=254,\"odstr\",IF(AND($A$1=\"TISK\",SUM(J46:U46)=0),\"odstr\",\"OK\"))","v":{"$error":"#REF!"}},"OK",null,null,5164,null,"Nájemné",null,null,22234.289000000001,37131.167479999996,33769.24598,0.90945823338814136,20998.289000000001,35425.071479999999,32577.568310000002,0.91961898590359603,1236,1706.096,1191.67767,0.69848218974782195,null,null,5151,null,"Studená voda",null,null,9866.5540000000001,11598.693600000001,9190.6268099999998,0.79238465356132859,9866.5540000000001,11598.693600000001,9190.6268099999998,0.79238465356132859,0,0,0,"x",null,null,null,5151,null,"Studená voda",null,null,8690.9179999999997,10780.960349999999,9037.6120900000005,0.83829378799264398,8690.9179999999997,10778.960349999999,9035.9110900000014,0.83829152317087818,0,2,1.7010000000000001,{"$f":"BG57/BF57","v":0.85050000000000003},null,null,5151,null,"Studená voda",null,null,9579.5559999999987,{"$f":"SUM(BU57,BY57)","v":11017.357479999999},8326.3330799999985,0.75574683812474419,9578.0559999999987,11014.857479999999,8326.3330799999985,0.75591836708903104,1.5,2.5,0,0]
[{"$error":"#REF!"},"OK",null,null,5165,null,"Nájemné za půdu",null,null,1.68,3.28,3.28,1,1.68,3.28,3.28,1,0,0,0,"x ",null,null,5152,null,"Teplo",null,null,52542.9,53921.348189999997,45843.750240000001,0.85019666196888544,52542.9,53907.418189999997,45831.371639999998,0.85018673085890561,0,13.93,12.3786,{"$f":"AM58/AL58","v":0.88862885857860741},null,null,null,5152,null,"Teplo",null,null,53762.7,54053.669370000003,49553.866520000003,0.91675305483521141,53762.7,54026.880370000006,49528.163610000003,0.91673187996066408,0,26.789000000000001,25.702909999999999,{"$f":"BG58/BF58","v":0.95945761319944745},null,null,5152,null,"Teplo",null,null,55406.7,59225.639400000007,47161.353509999986,0.79629960921958376,55396.7,59184.089400000004,47147.427579999989,0.79662335026142994,10,41.55,13.925930000000001,{"$f":"BZ58/BY58","v":0.33516077015643808}]
[{"$error":"#REF!"},"OK",null,null,5166,null,"Konzultační, poradenské a právní služby",null,null,14592.45,31045.535100000005,21375.902369999996,0.68853386811168193,13779.45,28600.689100000003,19787.938369999996,0.69186928681379201,813,2444.846,1587.9639999999999,0.64951493877323963,null,null,5153,null,"Plyn",null,null,36300.379999999997,36121.13003,28489.330890000001,0.78871648994199539,36300.379999999997,36121.13003,28489.330890000001,0.78871648994199539,0,0,0,"x",null,null,null,5153,null,"Plyn",null,null,34186.536160000003,34976.55704,29163.228569999999,0.83379357598428727,34186.536160000003,34976.55704,29163.228569999999,0.83379357598428727,null,null,null,"x",null,null,5153,null,"Plyn",null,null,32287.5,32353.453670000003,25583.144440000011,0.7907392113665499,32287.5,32353.453670000003,25583.144440000011,0.7907392113665499,0,0,0,0]
[{"$error":"#REF!"},"OK",null,null,5167,null,"Služby školení a vzdělávání",null,null,4207.7,12270.259639999998,6665.255799999999,0.54320413712125815,3618.7,10741.392099999999,6311.3283999999994,0.58757080471906431,589,1528.86754,353.92740000000003,0.23149644474759407,null,null,5154,null,"Elektrická energie",null,null,43403.267,50427.898029999997,42463.089590000003,0.84205551388912425,43403.267,50427.898029999997,42463.089590000003,0.84205551388912425,0,0,0,"x",null,null,null,5154,null,"Elektrická energie",null,null,43770.44,51140.987359999999,46392.254419999997,0.90714428513919876,43770.44,51131.987359999999,46383.356419999996,0.90712993597204072,0,9,8.8979999999999997,{"$f":"BG60/BF60","v":0.98866666666666658},null,null,5154,null,"Elektrická energie",null,null,46139.999999999993,51446.048559999996,43659.107279999989,0.84863869047360696,46136.499999999993,51431.308559999998,43657.867389999992,0.84885779911799297,3.5,14.74,1.2398900000000002,{"$f":"BZ60/BY60","v":8.4117367706919952E-2}]
[{"$error":"#REF!"},"OK",null,null,5168,null,"Služby zpracování dat",null,null,1615.693,9513.6517100000001,7323.9343099999996,0.76983418494306011,678.69299999999998,3021.3747100000001,922.50274999999999,0.30532550197985869,937,6492.277,6401.43156,0.98600715280632667,null,null,5155,null,"Pevná paliva",null,null,2774.5,3154.0171099999998,2767.5833899999998,0.87747887645416101,2774.5,3154.0171099999998,2767.5833899999998,0.87747887645416101,0,0,0,"x",null,null,null,5155,null,"Pevná paliva",null,null,2686.5,3451.3977500000001,3130.1572099999998,0.90692450906303101,2686.5,3451.3977500000001,3130.1572099999998,0.90692450906303101,null,null,null,"x",null,null,5155,null,"Pevná paliva",null,null,3176.4259999999999,3157.9270199999996,2603.1104399999995,0.82430987908010611,3176.4259999999999,3157.9270199999996,2603.1104399999995,0.82430987908010611,0,0,0,0]
[{"$error":"#REF!"},"OK",null,null,5169,null,"Nákup ostatních služeb",null,null,357760.88189999992,407396.54836000002,277064.5166899999,0.68008557707555506,281160.33589999995,345163.10687000002,245465.23377999989,0.71115721493505479,76600.546000000002,62233.441489999997,31599.282910000005,0.50775406523320021,null,null,5156,null,"Pohonné hmoty a maziva",null,null,2090.3000000000002,1887.8233499999999,1638.01854,0.86767574942856818,2070.3000000000002,1877.8233499999999,1636.662,0.87157399549856496,20,10,1.3565400000000001,{"$f":"AM62/AL62","v":0.135654},null,null,null,5156,null,"Pohonné hmoty a maziva",null,null,1672.2,1493.7304999999999,1393.3707300000001,0.93281266600635138,1662.2,1483.7304999999999,1391.45388,0.93780769486102777,10,10,1.9168499999999999,{"$f":"BG62/BF62","v":0.19168499999999999},null,null,5156,null,"Pohonné hmoty a maziva",null,null,1806.7840000000001,1343.7720000000002,996.41533000000004,0.74150624510705676,1796.7840000000001,1333.7720000000002,996.41533000000004,0.74706571288046231,10,10,0,0]
[{"$error":"#REF!"},"OK",null,null,5171,null,"Opravy a udržování",null,null,1485366.7723599998,2054490.1498099996,1584318.3121500001,0.77114913999296553,1263408.7723599998,1737233.8511899996,1391455.5072000001,0.8009603924347074,221958,317256.29861999996,192862.80495000002,0.60790851368093812,null,null,5157,null,"Teplá voda",null,null,50,54,46.599159999999998,0.86294740740740739,50,54,46.599159999999998,0.86294740740740739,0,0,0,"x",null,null,null,5157,null,"Teplá voda",null,null,97,105,21,0.2,97,105,21,0.2,null,null,null,"x",null,null,5157,null,"Teplá voda",null,null,66,32,21,0.65625,66,32,21,0.65625,0,0,0,0]
[{"$error":"#REF!"},"OK",null,null,5172,null,"Programové vybavení",null,null,439.5,2981.7409699999998,2449.2169699999995,0.82140500957063334,439.5,2060.84357,1634.7083799999998,0.79322293249069842,0,920.89740000000006,814.50858999999991,0.88447267849816913,null,null,5159,null,"Nákup ostatních paliv a energie",null,null,2514.5,2221.1692499999999,2094.0209,0.94275611820215865,2514.5,2221.1692499999999,2094.0209,0.94275611820215865,0,0,0,"x",null,null,null,5159,null,"Nákup ostatních paliv a energie",null,null,1717,2068.0398999999998,1839.0214500000002,0.88925820531799238,1717,2068.0398999999998,1839.0214500000002,0.88925820531799238,null,null,null,"x",null,null,5159,null,"Nákup ostatních paliv a energie",null,null,1707.0529999999999,1814.0529999999999,1695.10095,0.93442746711369518,1707.0529999999999,1814.0529999999999,1695.10095,0.93442746711369518,0,0,0,0]
[null,null,null,null,5173,null,"Cestovné (tuzemské i zahraniční)",null,null,1816.2080000000001,3607.1796299999996,2714.4844199999998,0.75252266269866908,1644.2080000000001,2391.1956299999997,1865.7224099999999,0.7802466626287704,172,1215.9839999999999,848.76201000000003,0.69800425827971424,null,null,516,null,"Nákup služeb",null,null,{"$f":"SUM(AC66:AC74)","v":623565.83043999993},{"$f":"SUM(AD66:AD74)","v":1000892.32522},{"$f":"SUM(AE66:AE74)","v":593146.24629000004},0.59261743880354378,{"$f":"SUM(AG66:AG74)","v":533625.9834400001},{"$f":"SUM(AH66:AH74)","v":905921.67151999997},{"$f":"SUM(AI66:AI74)","v":539955.36338999995},0.59602875211499939,{"$f":"SUM(AK66:AK74)","v":89939.846999999994},{"$f":"SUM(AL66:AL74)","v":94970.653699999995},{"$f":"SUM(AM66:AM74)","v":53190.882899999997},{"$f":"AM65/AL65","v":0.56007704304134953},null,null,null,516,"Nákup služeb",null,null,null,713030.36839999992,846340.08853999991,515007.36625000002,0.60851113308176896,{"$f":"SUM(BA66:BA74)","v":610482.30939999991},{"$f":"SUM(BB66:BB74)","v":728486.59291999997},{"$f":"SUM(BC66:BC74)","v":442137.73592000001},0.60692638713881475,{"$f":"SUM(BE66:BE74)","v":102548.05899999999},{"$f":"SUM(BF66:BF74)","v":117853.49561999999},{"$f":"SUM(BG66:BG74)","v":72869.630330000015},{"$f":"BG65/BF65","v":0.61830690677989431},null,null,516,"Nákup služeb",null,null,null,740534.67452,890228.56906999997,503322.48009000008,0.56538567462040534,{"$f":"SUM(BT66:BT74)","v":616303.16151999997},{"$f":"SUM(BU66:BU74)","v":788030.68696999992},{"$f":"SUM(BV66:BV74)","v":448373.3948200001},0.5689796123854115,{"$f":"SUM(BX66:BX74)","v":124231.51300000001},{"$f":"SUM(BY66:BY74)","v":102197.8821},{"$f":"SUM(BZ66:BZ74)","v":54949.085269999996},{"$f":"BZ65/BY65","v":0.53767342474115709}]
[{"$f":"IF(COUNTBLANK(C66:IV66)=254,\"odstr\",IF(AND($A$1=\"TISK\",SUM(J54:U54)=0),\"odstr\",\"OK\"))","v":{"$error":"#REF!"}},"OK",null,null,5175,null,"Pohoštění",null,null,4841.4430000000002,10504.10599,7265.5816200000008,0.69168967134536696,3647.5970000000002,7751.9063299999989,5623.1122900000009,0.72538444746661457,1193.846,2752.1996600000002,1642.4693300000001,0.59678422095292316,null,null,5161,null,"Služby pošt",null,null,20.309000000000001,40.633000000000003,6.4240000000000004,0.15809809760539462,20.309000000000001,37.633000000000003,6.218,0.16522732707995641,0,3,0.20599999999999999,{"$f":"AM66/AL66","v":6.8666666666666668E-2},null,null,null,5161,null,"Služby pošt",null,null,20.2,19.793800000000001,9.4730000000000008,0.47858420313431482,20.2,19.793800000000001,9.4730000000000008,0.47858420313431482,null,null,null,"x",null,null,5161,null,"Služby pošt",null,null,22.3,17.728000000000002,9.3546600000000009,0.52767712093862817,22.3,17.728000000000002,9.3546600000000009,0.52767712093862817,0,0,0,0]
[{"$error":"#REF!"},"OK",null,null,5176,null,"Účastnické poplatky na konference",null,null,28.390999999999998,520.81799999999998,253.417,0.48657496476696277,28.390999999999998,9.2309999999999999,7.8250000000000002,0.84768714115480448,0,511.58699999999999,245.59200000000001,0.4800591101806731,null,null,5162,null,"Služby telekomunikací a radiokomunikací",null,null,4573.54,4971.7580799999996,4502.4645200000004,0.90560812645172006,4540.54,4836.73416,4415.1162199999999,0.912830036538539,33,135.02392,87.348299999999995,{"$f":"AM67/AL67","v":0.64690982160790467},null,null,null,5162,null,"Služby telekomunikací a radiokomunikací",null,null,4517.41,5011.8835499999996,4584.8637400000007,0.91479853716872594,4490.41,4841.6055999999999,4487.1777700000002,0.92679539407340417,27,170.27795,97.685970000000012,{"$f":"BG67/BF67","v":0.57368537734921055},null,null,5162,null,"Služby telekomunikací a radiokomunikací",null,null,4805.22631,5415.4994700000007,4734.0627400000003,0.87416918166552782,4670.22631,5036.3540300000004,4627.1471799999999,0.91874938744129542,135,379.14544000000001,106.91556000000001,{"$f":"BZ67/BY67","v":0.28199088982845216}]
[{"$error":"#REF!"},"OK",null,null,5177,null,"Nákup uměleckých předmětů",null,null,0,0,0,"x ",0,0,0,"x ",0,0,0,"x ",null,null,5163,null,"Služby peněžních ústavů",null,null,21045.656999999999,22199.93131,19214.754509999999,0.86553216051369841,21044.656999999999,22190.234469999999,19211.902340000001,0.8657818539940827,1,9.6968399999999999,2.8521700000000001,{"$f":"AM68/AL68","v":0.29413396529178581},null,null,null,5163,null,"Služby peněžních ústavů",null,null,21409.768,33244.012170000002,32116.172169999998,0.96607389041272862,21328.768,33176.212169999999,32086.424169999998,0.96715152427842699,81,67.8,29.748000000000001,{"$f":"BG68/BF68","v":0.43876106194690268},null,null,5163,null,"Služby peněžních ústavů",null,null,{"$f":"SUM(BT68,BX68)","v":31525.141},30792.678910000002,28381.680209999999,0.92170221022189058,31514.141,30765.122910000002,28380.330139999998,0.92248388615327648,11,27.556000000000001,1.3500699999999999,{"$f":"BZ68/BY68","v":4.8993685585716353E-2}]
[{"$error":"#REF!"},"OK",null,null,5178,null,"Nájemné za nájem s právem koupě",null,null,699.41600000000005,4464.2020000000002,2985.2240000000002,0.66870271551332128,0,0,0,"x ",699.41600000000005,4464.2020000000002,2985.2240000000002,0.66870271551332128,null,null,5164,null,"Nájemné",null,null,33502.730000000003,49280.59403,44788.725579999998,0.90885117076174982,32007.73,46543.876900000003,42657.232129999997,0.91649503589160608,1495,2736.71713,2131.4934499999999,{"$f":"AM69/AL69","v":0.77885047988134604},null,null,null,5164,null,"Nájemné",null,null,42416.358999999997,45865.670090000007,42837.058409999998,0.93396778736564601,40868.358999999997,42279.707090000004,39776.253449999997,0.94078829272229936,1548,3585.9630000000002,3060.8049599999999,{"$f":"BG69/BF69","v":0.85355174049481264},null,null,5164,null,"Nájemné",null,null,36610.845849999998,37745.909940000005,29787.525140000005,0.78915901583375636,35043.845849999998,33970.153910000008,28218.478610000006,0.83068444978970657,1567,3775.7560299999996,1569.0465300000001,{"$f":"BZ69/BY69","v":0.41555823986858609}]
[{"$error":"#REF!"},"OK",null,null,5179,null,"Ostatní nákupy jinde nezařazené",null,null,789.01,2239.38,1800.69175,0.80410280970625791,779.01,1026.8800000000001,709.19174999999996,0.69062767801495784,10,1212.5,1091.5,0.90020618556701026,null,null,5165,null,"Nájemné za půdu",null,null,242.91300000000001,249.864,26.103339999999999,0.10447019178433067,242.91300000000001,249.864,26.103339999999999,0.10447019178433067,0,0,0,"x",null,null,null,5165,null,"Nájemné za půdu",null,null,234.5,240.398,114.05800000000001,0.47445486235326423,234.5,240.398,114.05800000000001,0.47445486235326423,null,null,null,"x",null,null,5165,null,"Nájemné za půdu",null,null,505.59800000000001,507.59800000000001,253.55,0.49950945433197136,505.59800000000001,507.59800000000001,253.55,0.49950945433197136,0,0,0,0]
[{"$error":"#REF!"},"OK",null,null,5182,null,"Poskytované zálohy vlastní pokladně",null,null,0,0,0,"x ",0,0,0,"x ",0,0,0,"x ",null,null,5166,null,"Konzultační, poradenské a právní služby",null,null,12244.550999999999,31048.90667,19933.410179999999,0.64200038963884065,11932.550999999999,23115.913250000001,15913.25369,0.68841120477902806,312,7932.9934199999998,4020.1564899999998,{"$f":"AM71/AL71","v":0.50676412763241641},null,null,null,5166,null,"Konzultační, poradenské a právní služby",null,null,18179.5,28727.683980000002,21645.929750000003,0.75348676785325741,17717.5,21686.729500000001,15748.855240000001,0.72619779944228102,462,7040.9544799999994,5897.0745100000004,{"$f":"BG71/BF71","v":0.83753907609412648},null,null,5166,null,"Konzultační, poradenské a právní služby",null,null,16008.3,27956.683250000002,16383.976919999997,0.58604866584093074,15456.3,22344.027050000004,13950.683839999998,0.62435852806578107,552,5612.6561999999994,2433.2930799999999,{"$f":"BZ71/BY71","v":0.43353681274830269}]
[{"$error":"#REF!"},"OK",null,null,5183,null,"Výdaje na realizaci záruk",null,null,0,0,0,"x ",0,0,0,"x ",0,0,0,"x ",null,null,5167,null,"Služby školení a vzdělávání",null,null,3556.076,13857.92229,10221.66185,0.73760421195145842,3236.3,10601.702139999999,8150.1704,0.76876055301059421,319.77600000000001,3256.2201500000001,2071.49145,0.63616443439796289,null,null,null,5167,null,"Služby školení a vzdělávání",null,null,4859.3,24155.955419999998,15171.513719999999,0.62806514816792125,4679.3,12948.73452,9303.7750500000002,0.71850844077696019,180,11207.2209,5867.7386699999997,0.52356768215392269,null,null,5167,null,"Služby školení a vzdělávání",null,null,10192.200000000001,20800.486969999998,10843.515380000001,0.52131064987273235,9742.2000000000007,15221.812979999999,7308.8569799999996,0.4801567979847825,450,5578.6739900000002,3534.6584000000003,0.63360189291147306]
[{"$error":"#REF!"},"OK",null,null,5189,null,"Ostatní poskytované zálohy a jistiny",null,null,20,115,115,1,0,115,115,1,20,0,0,"x ",null,null,5168,null,"Služby zpracování dat",null,null,3658.873,15686.6155,11578.177009999999,0.73809273963526423,1878.873,5644.3389999999999,4346.85167,0.77012590313941098,1780,10042.2765,7231.3253400000003,0.72008825289763734,null,null,null,5168,null,"Služby zpracování dat",null,null,2888.2730000000001,15278.971520000001,14120.465210000002,0.92417642061289751,836.27300000000002,3564.3091399999998,3123.71893,0.87638832865097671,2052,11714.662380000002,10996.746280000001,0.93871644980348123,null,null,5168,null,"Služby zpracování dat",null,null,3313.6820000000002,{"$f":"SUM(BU73,BY73)","v":20717.859360000002},18776.796569999999,0.90630968401360923,1793.6820000000002,5758.9309700000003,4479.7114899999997,0.77787205877899235,1520,14958.928390000001,14297.085079999999,0.95575596775752714]
[{"$error":"#REF!"},"OK",null,null,5191,null,"Zaplacené sankce",null,null,4.6020000000000003,837.44219999999996,766.50443999999993,0.91529235092284578,4.6020000000000003,814.702,743.76423999999997,0.91292796629933393,0,22.740200000000002,22.740200000000002,1,null,null,5169,null,"Nákup ostatních služeb",null,null,544721.18143999996,863556.10034,482874.52529999998,0.55916983865886916,458722.11044000002,792701.37459999998,445228.51559999998,0.56165982533417946,85999.070999999996,70854.725739999994,37646.009700000002,0.53131261615691361,null,null,null,5169,null,"Nákup ostatních služeb",null,null,618505.05839999998,693795.72000999993,384407.83224999998,0.55406486543972822,520306.99939999997,609729.10309999995,337488.00030999997,0.55350482467399875,98198.058999999994,84066.616909999982,46919.831940000004,0.55812680068036313,null,null,5169,null,"Nákup ostatních služeb",null,null,637551.38136,746274.1251699999,394152.01847000013,0.52815983453829785,517554.86835999996,674408.9591199999,361145.2819200001,0.53549893879114419,119996.51300000001,71865.16605,33006.736550000001,0.45928700042292608]
[null,null,null,null,5192,null,"Poskytnuté neinvestiční příspěvky a náhrady (část)",null,null,5456.3620000000001,6288.9359599999998,5952.9200899999996,0.94657031457512242,5456.3620000000001,6284.9359599999998,5948.9200899999996,0.94653630965557201,0,4,4,1,null,null,517,null,"Ostatní nákupy",null,null,{"$f":"SUM(AC76:AC83)","v":1831489.0908700002},{"$f":"SUM(AD76:AD83)","v":2420493.1495300005},{"$f":"SUM(AE76:AE83)","v":1903938.5333900002},0.78659116790299433,{"$f":"SUM(AG76:AG83)","v":1666424.7748700001},{"$f":"SUM(AH76:AH83)","v":2132120.7017599996},{"$f":"SUM(AI76:AI83)","v":1708729.5288000002},0.80142251205079373,{"$f":"SUM(AK76:AK83)","v":165064.31599999999},{"$f":"SUM(AL76:AL83)","v":288372.44776999991},{"$f":"SUM(AM76:AM83)","v":195209.00459000003},0.67693361865726787,null,null,null,517,"Ostatní nákupy",null,null,null,1718614.625,2225303.4476199998,1773267.1056000001,0.79686530279568824,{"$f":"SUM(BA76:BA83)","v":1522184.1070000001},{"$f":"SUM(BB76:BB83)","v":1940626.4058699999},{"$f":"SUM(BC76:BC83)","v":1573342.7974700001},0.8107396625702703,{"$f":"SUM(BE76:BE83)","v":196430.51800000001},{"$f":"SUM(BF76:BF83)","v":284677.04174999992},{"$f":"SUM(BG76:BG83)","v":199924.30813000002},0.70228462014710424,null,null,517,"Ostatní nákupy",null,null,null,1834480.8772999998,2455698.7370300009,1912514.0184599999,0.77880645114190772,{"$f":"SUM(BT76:BT83)","v":1639460.2312999999},{"$f":"SUM(BU76:BU83)","v":2211557.921060001},{"$f":"SUM(BV76:BV83)","v":1749513.4770199999},0.7910773940668292,{"$f":"SUM(BX76:BX83)","v":195020.64600000001},{"$f":"SUM(BY76:BY83)","v":244140.81597},{"$f":"SUM(BZ76:BZ83)","v":163000.54144},0.66764969549388864]
[{"$f":"IF(COUNTBLANK(C76:IV76)=254,\"odstr\",IF(AND($A$1=\"TISK\",SUM(J63:U63)=0),\"odstr\",\"OK\"))","v":{"$error":"#REF!"}},"OK",null,null,5193,null,"Výdaje na dopravní územní obslužnost",null,null,0,3,0,0,0,3,0,0,0,0,0,"x ",null,null,5171,null,"Opravy a udržování",null,null,1814876.9528000001,2371078.33421,1868968.7226400001,0.7882357557211227,1654490.9528000001,2097632.4950799998,1681228.46022,0.80148856587763773,160386,273445.83912999998,187740.26242000001,0.68657202105293569,null,null,null,5171,null,"Opravy a udržování",null,null,1703079.49,2167372.3725300003,1729275.2255300002,0.79786715353919369,1511753.49,1899225.4450000001,1538455.4290100001,0.81004360649243512,191326,268146.92752999999,190819.79652000003,0.71162402746028597,null,null,5171,null,"Opravy a udržování",null,null,1817610.2652399999,2417917.5555800009,1890789.1314699999,0.78199073707310285,1627385.2652399999,2183501.727200001,1729548.2865199998,0.79209842839825673,190225,234415.82837999999,161240.84495,0.68784111578259288]
[{"$error":"#REF!"},"OK",null,null,5194,null,"Věcné dary",null,null,9145.7999999999993,12830.41102,11042.352259999998,0.86063901170330537,7360.8,10123.36102,8867.4227499999979,0.87593663136988442,1785,2707.05,2174.9295099999999,0.80343159897305172,null,null,5172,null,"Programové vybavení",null,null,1356.799,21310.872940000001,16638.95966,0.78077325630190719,1356.799,16116.2438,14142.169089999999,0.87751024776629394,0,5194.62914,2496.7905700000001,0.4806484741661462,null,null,null,5172,null,"Programové vybavení",null,null,2057.5309999999999,31817.88336,27936.179919999999,0.87800246182057784,2057.5309999999999,25652.945670000001,24628.3642,0.96005989007343495,0,6164.9376899999997,3307.8157200000001,0.53655298501484128,null,null,5172,null,"Programové vybavení",null,null,2217.4923100000001,15978.801649999999,15501.565130000003,0.97013314699979414,2217.4923100000001,15889.881649999999,15433.653070000002,0.97128810710808555,0,88.92,67.912060000000011,0.76374336482231231]
[{"$error":"#REF!"},"OK",null,null,5197,null,"Náhrady zvýšených nákladů spojených s výkonem funkce v zahraničí",null,null,0,0,0,"x ",0,0,0,"x ",0,0,0,"x ",null,null,5173,null,"Cestovné (tuzemské i zahraniční)",null,null,1456.55,5093.7787500000004,3153.24026,0.61903753868383071,1117.55,2578.9962500000001,1948.54441,0.75554371589334413,339,2514.7824999999998,1204.6958500000001,0.47904574252445298,null,null,null,5173,null,"Cestovné (tuzemské i zahraniční)",null,null,2264.0720000000001,7688.9370200000012,4670.48956,0.60742981088951609,1531.1,3643.4627300000002,2440.55339,0.66984447786570334,732.97199999999998,4045.4742900000006,2229.9361699999999,0.5512174865409909,null,null,5173,null,"Cestovné (tuzemské i zahraniční)",null,null,4283.3705499999996,6696.0765899999997,1581.21118,0.23613994833353602,2718.3705499999996,2934.6279599999998,1215.3340900000001,0.41413566099874555,1565,3761.4486299999999,365.87708999999995,9.7270261005797637E-2]
[{"$error":"#REF!"},"OK",null,null,5199,null,"Ostatní výdaje související s neinvestičními nákupy",null,null,20322,4132.0462100000004,10.667,2.5815296968811001E-3,42,12.6,10.667,0.84658730158730156,20280,4119.4462100000001,0,0,null,null,5175,null,"Pohoštění",null,null,9532.9190699999999,18123.54463,12405.283729999999,0.68448440872131966,8013.0730700000004,13894.715630000001,9866.4019800000005,0.71008304471503603,1519.846,4228.8289999999997,2538.88175,0.60037465454384653,null,null,null,5175,null,"Pohoštění",null,null,6242.7389999999996,15279.32956,10295.66885,0.67382988301745883,4690.6629999999996,10781.81732,6940.5301799999997,0.64372544757603067,1552.076,4497.51224,3355.1386699999998,0.7459987857642828,null,null,5175,null,"Pohoštění",null,null,7510.7499299999999,12539.963809999999,4328.7266499999996,0.34519450897841147,5889.0739300000005,8300.9148499999992,3020.1183099999998,0.36382957355597983,1621.6759999999999,4239.0489600000001,1308.60834,0.30870328518215556]
[{"$error":"#REF!"},null,null,null,51,null,"Neinvestiční nákupy a související výdaje",null,null,2219494.9269600003,3113323.0362200001,2393750.4758900004,0.76887314552374264,1889156.1189600001,2684104.34711,2133134.1488300003,0.79472847288026105,330338.80800000002,429218.68910999992,260616.32706000001,0.60718774292050781,null,null,5176,null,"Účastnické poplatky na konference",null,null,47,103.098,34.884,0.33835767910143749,2,12.7,19.010000000000002,1.4968503937007875,45,90.397999999999996,15.874000000000001,0.17560123011571055,null,null,null,5176,null,"Účastnické poplatky na konference",null,null,100.6,243.38,99.657550000000001,0.40947304626509984,55.6,147.91,75.468000000000004,0.5102291934284362,45,95.47,24.189550000000001,0.25337331098774485,null,null,5176,null,"Účastnické poplatky na konference",null,null,74.925269999999998,81.201999999999998,24.138999999999999,0.29727100317726163,32.925269999999998,26.101999999999997,21.24,0.81373074860163974,42,55.1,2.899,0]
[{"$error":"#REF!"},"OK",null,null,5211,null,"Neinvestiční transfery finančním institucím",null,null,0,0,0,"x ",0,0,0,"x ",0,0,0,"x ",null,null,5177,null,"Nákup uměleckých předmětů",null,null,0,0,0,"x",0,0,0,"x",0,0,0,"x",null,null,null,5177,null,"Nákup uměleckých předmětů",null,null,null,null,null,null,null,null,null,null,null,null,null,"x",null,null,5177,null,"Nákup uměleckých předmětů",null,null,0,0,0,0,0,0,0,0,0,0,0,0]
[{"$error":"#REF!"},"OK",null,null,5212,null,"Neinvestiční transfery nefinančním podnikatelským subjektům-fyzickým osobám",null,null,37899.311000000002,156800.57973,156571.24621000001,0.99853741918304839,1096.5,6159.8,5999.0479999999998,0.97390304880028566,36802.811000000002,150640.77973000001,150572.19821,0.99954473469851302,null,null,5178,null,"Nájemné za nájem s právem koupě",null,null,1564.47,1577.9469999999999,13.477,{"$f":"AE82/AD82","v":8.5408445277312863E-3},0,13.477,13.477,{"$f":"AI82/AH82","v":1},1564.47,1564.47,0,"x",null,null,null,5178,null,"Nájemné za nájem s právem koupě",null,null,{"$f":"BA82+BE82","v":1564.47},1564.47,26.0745,{"$f":"AY82/AX82","v":1.6666666666666666E-2},null,null,null,null,1564.47,1564.47,26.0745,{"$f":"BG82/BF82","v":1.6666666666666666E-2},null,null,5178,null,"Nájemné za nájem s právem koupě",null,null,1564.47,1564.47,0,{"$f":"BR82/BQ82","v":0},0,0,0,0,1564.47,1564.47,0,{"$f":"BZ82/BY82","v":0}]
[{"$error":"#REF!"},"OK",null,null,5213,null,"Neinvestiční transfery nefinančním podnikatelským subjektům-právnickým osobám",null,null,823119.79500000004,3962468.8395699998,3957840.0461999997,0.9988318410674234,13379.5,1209935.80048,1206016.24251,0.99676052401421211,809740.29500000004,2752533.0390900001,2751823.8036899995,0.99974233355606335,null,null,5179,null,"Ostatní nákupy jinde nezařazené",null,null,2654.4,3205.5740000000001,2723.9661000000001,{"$f":"AE83/AD83","v":0.84975923188795521},1444.4,1872.0740000000001,1511.4661000000001,{"$f":"AI83/AH83","v":0.80737518922863094},1210,1333.5,1212.5,{"$f":"AM83/AL83","v":0.90926134233220846},null,null,null,5179,null,"Ostatní nákupy jinde nezařazené",null,null,3305.723,1337.0751499999999,963.80968999999993,{"$f":"AY83/AX83","v":0.72083434502540866},2095.723,1174.8251499999999,802.45268999999996,{"$f":"BC83/BB83","v":0.68304010175471641},1210,162.25,161.357,{"$f":"BG83/BF83","v":0.99449614791987673},null,null,5179,null,"Ostatní nákupy jinde nezařazené",null,null,1219.6040000000003,920.66740000000004,289.24502999999999,{"$f":"BR83/BQ83","v":0.31416886271850181},1217.1040000000003,904.66740000000004,274.84503000000001,{"$f":"BV83/BU83","v":0.30380781931569545},2.5,16,14.4,0]
[null,null,null,null,5215,null,"Neinvestiční transfery vybraným podnikatelským subjektům ve vlastnictví státu",null,null,85,70,0,0,85,70,0,0,0,0,0,"x ",null,null,518,null,"Poskytnuté zálohy, jistiny, záruky a vládní úvěry",null,null,{"$f":"SUM(AC85:AC87)","v":0},{"$f":"SUM(AD85:AD87)","v":4942.6899999999996},{"$f":"AE87","v":4872.6935999999996},{"$f":"AE84/AD84","v":0.98583839973779464},0,{"$f":"SUM(AH85:AH87)","v":4937.6899999999996},{"$f":"AI87","v":4872.6935999999996},{"$f":"AI84/AH84","v":0.98683667868983271},0,{"$f":"SUM(AL85:AL87)","v":5},0,"x",null,null,null,518,"Poskytnuté zálohy, jistiny, záruky a vládní úvěry",null,null,null,{"$f":"BA84+BE84","v":517.5},{"$f":"BB84+BF84","v":709.5},{"$f":"BC84+BG84","v":88.21},{"$f":"AY84/AX84","v":0.12432699083861874},{"$f":"SUM(BA85:BA87)","v":517.5},{"$f":"SUM(BB85:BB87)","v":709.5},{"$f":"SUM(BC85:BC87)","v":88.21},{"$f":"BC84/BB84","v":0.12432699083861874},0,0,0,"x",null,null,518,"Poskytnuté zálohy, jistiny, záruky a vládní úvěry",null,null,null,0,9.8000000000000007,0,{"$f":"BR84/BQ84","v":0},{"$f":"SUM(BT85:BT87)","v":0},{"$f":"SUM(BU85:BU87)","v":9.8000000000000007},{"$f":"SUM(BV85:BV87)","v":0},{"$f":"BV84/BU84","v":0},{"$f":"SUM(BX85:BX87)","v":0},{"$f":"SUM(BY85:BY87)","v":0},{"$f":"SUM(BZ85:BZ87)","v":0},0]
[{"$f":"IF(COUNTBLANK(C85:IV85)=254,\"odstr\",IF(AND($A$1=\"TISK\",SUM(J71:U71)=0),\"odstr\",\"OK\"))","v":{"$error":"#REF!"}},"OK",null,null,5219,null,"Ostatní neinvestiční transfery podnikatelským subjektům",null,null,40,61,61.02,1.0003278688524591,40,61,61.02,1.0003278688524591,0,0,0,"x ",null,null,5182,null,"Poskytované zálohy vlastní pokladně",null,null,null,null,null,"x",null,null,null,"x",null,null,null,"x",null,null,null,5182,null,"Poskytované zálohy vlastní pokladně",null,null,null,null,null,null,null,null,null,null,null,null,null,"x",null,null,5182,null,"Poskytované zálohy vlastní pokladně",null,null,0,0,0,0,0,0,0,0,0,0,0,0]
[{"$f":"IF(COUNTBLANK(C86:IV86)=254,\"odstr\",IF(AND($A$1=\"TISK\",SUM(J72:U72)=0),\"odstr\",\"OK\"))","v":{"$error":"#REF!"}},"OK",null,null,5221,null,"Neinvestiční transfery obecně prospěšným společnostem",null,null,287431.451,1040458.8377500001,1029632.3613800001,0.98959451736369286,16847.2,275650.59600000002,265280.61041999998,0.96237996314725893,270584.25099999999,764808.24175000004,764351.75096000009,0.9994031303991241,null,null,5183,null,"Výdaje na realizaci záruk",null,null,null,null,null,"x",null,null,null,"x",null,null,null,"x",null,null,null,5183,null,"Výdaje na realizaci záruk",null,null,null,null,null,null,null,null,null,null,null,null,null,"x",null,null,5183,null,"Výdaje na realizaci záruk",null,null,0,0,0,0,0,0,0,0,0,0,0,0]
[{"$f":"IF(COUNTBLANK(C87:IV87)=254,\"odstr\",IF(AND($A$1=\"TISK\",SUM(J73:U73)=0),\"odstr\",\"OK\"))","v":{"$error":"#REF!"}},"OK",null,null,5222,null,"Neinvestiční transfery občanským sdružením",null,null,85512.027000000002,189283.37286999999,186740.74631000002,0.98656708974778118,36657.97,61071.0484,59999.905850000003,0.9824607145601254,48854.057000000001,128212.32446999999,126740.84046000001,0.98852306893207997,null,null,5189,null,"Ostatní poskytované zálohy a jistiny",null,null,0,4942.6899999999996,4872.6935999999996,{"$f":"AE87/AD87","v":0.98583839973779464},0,4937.6899999999996,4872.6935999999996,{"$f":"AI87/AH87","v":0.98683667868983271},0,5,0,"x",null,null,null,5189,null,"Ostatní poskytované zálohy a jistiny",null,null,{"$f":"BA87+BE87","v":517.5},709.5,88.21,{"$f":"AY87/AX87","v":0.12432699083861874},517.5,709.5,88.21,{"$f":"BC87/BB87","v":0.12432699083861874},null,null,null,"x",null,null,5189,null,"Ostatní poskytované zálohy a jistiny",null,null,0,9.8000000000000007,0,{"$f":"BR87/BQ87","v":0},0,9.8000000000000007,0,{"$f":"BV87/BU87","v":0},0,0,0,0]
[null,null,null,null,5223,null,"Neinvestiční transfery církvím a náboženským společnostem",null,null,835,8674.2883000000002,8132.8035500000005,0.93757588734974373,835,7410.3489500000005,6868.8720000000003,0.92692962859731454,0,1263.9393500000001,1263.93155,0.99999382881781462,null,null,519,null,"Výdaje související s neinvestičními nákupy, příspěvky, náhrady a věcné dary",null,null,{"$f":"SUM(AC89:AC94)","v":43089.731},{"$f":"SUM(AD89:AD94)","v":31336.37284},{"$f":"SUM(AE89:AE94)","v":19920.049939999997},{"$f":"AE88/AD88","v":0.63568460975715135},{"$f":"AG90+AG92+AG94","v":19628.731},{"$f":"SUM(AH89:AH94)","v":23263.072410000001},{"$f":"SUM(AI89:AI94)","v":18534.664049999999},{"$f":"AI88/AH88","v":0.79674188014961345},{"$f":"AK92+AK94","v":23461},{"$f":"SUM(AL89:AL94)","v":8073.3004300000002},{"$f":"AM90+AM92","v":1385.38589},{"$f":"AM88/AL88","v":0.17160093347349889},null,null,null,519,"Výdaje související s neinvestičními nákupy, příspěvky, náhrady a věcné dary",null,null,null,43619.210180000002,38789.824509999999,16614.274789999999,{"$f":"AY88/AX88","v":0.42831528628640347},{"$f":"SUM(BA89:BA94)","v":22798.210180000002},{"$f":"SUM(BB89:BB94)","v":20148.100559999999},{"$f":"SUM(BC89:BC94)","v":14435.61565},{"$f":"BC88/BB88","v":0.71647526311532372},{"$f":"SUM(BE89:BE94)","v":20821},{"$f":"SUM(BF89:BF94)","v":18641.72395},{"$f":"SUM(BG89:BG94)","v":2178.6591400000002},{"$f":"BG88/BF88","v":0.11687004623840062},null,null,519,"Výdaje související s neinvestičními nákupy, příspěvky, náhrady a věcné dary",null,null,null,34350.864000000001,24914.42426,13087.11735,0.52528275240986844,{"$f":"SUM(BT89:BT94)","v":13829.864},{"$f":"SUM(BU89:BU94)","v":15684.25966},{"$f":"SUM(BV89:BV94)","v":11425.51347},0.72847005326867942,{"$f":"SUM(BX89:BX94)","v":20521},{"$f":"SUM(BY89:BY94)","v":9230.1646000000001},{"$f":"SUM(BZ89:BZ94)","v":1661.6038799999999},{"$f":"BZ88/BY88","v":0.18001887853657561}]
[{"$f":"IF(COUNTBLANK(C89:IV89)=254,\"odstr\",IF(AND($A$1=\"TISK\",SUM(J74:U74)=0),\"odstr\",\"OK\"))","v":{"$error":"#REF!"}},"OK",null,null,5224,null,"Neinvestiční transfery politickým stranám a hnutím",null,null,0,0,0,"x ",0,0,0,"x ",0,0,0,"x ",null,null,5191,null,"Zaplacené sankce",null,null,0,43.335999999999999,5.5359999999999996,{"$f":"AE89/AD89","v":0.12774598486246999},0,43.335999999999999,5.5359999999999996,{"$f":"AI89/AH89","v":0.12774598486246999},0,0,0,"x",null,null,null,5191,null,"Zaplacené sankce",null,null,{"$f":"BA89+BE89","v":0},23.169,16.160360000000001,{"$f":"AY89/AX89","v":0.69749924468039193},0,23.169,16.160360000000001,{"$f":"BC89/BB89","v":0.69749924468039193},null,null,null,"x",null,null,5191,null,"Zaplacené sankce",null,null,15,{"$f":"SUM(BU89,BY89)","v":685.76299999999992},670.05673000000002,0.9770966500088224,15,685.76299999999992,670.05673000000002,0.9770966500088224,0,0,0,0]
[{"$error":"#REF!"},"OK",null,null,5229,null,"Ostatní neinvestiční transfery neziskovým a podobným organizacím",null,null,74521.036000000007,100315.27228999999,81361.142609999995,0.81105439633153986,21752.45,67514.721289999987,50552.091609999996,0.74875657699689813,52768.586000000003,32800.550999999999,30809.050999999999,0.93928455653077292,null,null,5192,null,"Poskytnuté neinvestiční příspěvky a náhrady (část)",null,null,4083.511,5680.8230000000003,5117.1416399999998,{"$f":"AE90/AD90","v":0.90077470113045233},4083.511,5678.8230000000003,5115.1416399999998,{"$f":"AI90/AH90","v":0.90073975540354045},0,2,2,{"$f":"AM90/AL90","v":1},null,null,null,5192,null,"Poskytnuté neinvestiční příspěvky a náhrady (část)",null,null,4691.8310000000001,6160.3989999999994,5153.8032300000004,{"$f":"AY90/AX90","v":0.83660217950168503},4691.8310000000001,6160.3989999999994,5153.8032300000004,{"$f":"BC90/BB90","v":0.83660217950168503},null,null,null,"x",null,null,5192,null,"Poskytnuté neinvestiční příspěvky a náhrady (část)",null,null,4413.9179999999997,4297.2950000000001,3314.4493899999998,0.77128737729199404,4413.9179999999997,4297.2950000000001,3314.4493899999998,0.77128737729199404,0,0,0,0]
[{"$error":"#REF!"},"OK",null,null,5230,null,"Neinvestiční nedotační transfery podnikatelským subjektům",null,null,0,6.5,6.5,1,0,6.5,6.5,1,0,0,0,"x ",null,null,5193,null,"Výdaje na dopravní územní obslužnost",null,null,0,0,0,"x",0,0,0,"x",0,0,0,"x",null,null,null,5193,null,"Výdaje na dopravní územní obslužnost",null,null,6112.5649999999996,0,0,"x",6112.5649999999996,0,0,"x",null,null,null,"x",null,null,5193,null,"Výdaje na dopravní územní obslužnost",null,null,15,8.1,8.0950000000000006,0.99938271604938289,15,8.1,8.0950000000000006,0.99938271604938289,0,0,0,0]
[{"$error":"#REF!"},"OK",null,null,5240,null,"Neinvestiční nedotační transfery neziskovým a podobným organizacím",null,null,792,1246.606,1200.451,0.96297547099885616,792,1246.606,1200.451,0.96297547099885616,0,0,0,"x ",null,null,5194,null,"Věcné dary",null,null,16349.22,18619.258310000001,14624.5713,{"$f":"AE92/AD92","v":0.78545402059036151},13188.22,16796.113410000002,13241.18541,{"$f":"AI92/AH92","v":0.78834817834205129},3161,1823.1449,1383.38589,{"$f":"AM92/AL92","v":0.75879097157883613},null,null,null,5194,null,"Věcné dary",null,null,10290.652,16340.01938,10401.7372,{"$f":"AY92/AX92","v":0.63658046897616349},9769.652,12409.81538,8223.0780599999998,{"$f":"BC92/BB92","v":0.66262694554284329},521,3930.2040000000002,2178.6591400000002,{"$f":"BG92/BF92","v":0.554337418617456},null,null,5194,null,"Věcné dary",null,null,9384.9459999999999,12329.841899999999,8622.18966,0.69929442160973698,9163.9459999999999,10189.90166,6960.5857800000003,0.68308664914043937,221,2139.9402399999999,1661.6038799999999,{"$f":"BZ92/BY92","v":0.77647209437960751}]
[{"$error":"#REF!"},"OK",null,null,52,null,"Neinvestiční transfery podnikatelským subjektům a neziskovým organizacím. Neinvestiční transfery soukromoprávním subjektům",null,null,1310235.6200000001,5459385.2965099998,5421546.317259999,0.99306900370739726,91485.62,1629126.4211199998,1595984.7413899999,0.97965677844251298,1218750,3830258.8753900002,3825561.5758699994,0.99877363393106877,null,null,5197,null,"Náhrady zvýšených nákladů spojených s výkonem funkce v zahraničí",null,null,0,0,0,"x",0,0,0,"x",0,0,0,"x",null,null,null,5197,null,"Náhrady zvýšených nákladů spojených s výkonem funkce v zahraničí",null,null,null,null,null,null,null,null,null,null,null,null,null,"x",null,null,5197,null,"Náhrady zvýšených nákladů spojených s výkonem funkce v zahraničí",null,null,0,0,0,0,0,0,0,0,0,0,0,0]
[{"$error":"#REF!"},"OK",null,null,5311,null,"Neinvestiční transfery státnímu rozpočtu",null,null,1340,5302.4880000000003,1135.038,0.21405762728741676,300,300,0,0,1040,5002.4880000000003,1135.038,0.22689469719867392,null,null,5199,null,"Ostatní výdaje související s neinvestičními nákupy",null,null,22657,6992.9555300000002,172.80099999999999,{"$f":"AE94/AD94","v":2.4710724851413433E-2},2357,744.8,172.80099999999999,{"$f":"AI94/AH94","v":0.23200993555316862},20300,6248.15553,0,"x",null,null,null,5199,null,"Ostatní výdaje související s neinvestičními nákupy",null,null,{"$f":"BA94+BE94","v":22524.162179999999},{"$f":"BB94+BF94","v":16266.23713},{"$f":"BC94+BG94","v":1042.5740000000001},{"$f":"AY94/AX94","v":6.4094356406323952E-2},2224.1621799999998,1554.7171799999999,1042.5740000000001,{"$f":"BC94/BB94","v":0.6705875598544554},20300,14711.51995,0,{"$f":"BG94/BF94","v":0},null,null,5199,null,"Ostatní výdaje související s neinvestičními nákupy",null,null,20522,7593.42436,472.32657,{"$f":"BR94/BQ94","v":6.220205109147884E-2},222,503.20000000000005,472.32657,{"$f":"BV94/BU94","v":0.93864580683624799},20300,7090.2243600000002,0,{"$f":"BZ94/BY94","v":0}]
[{"$error":"#REF!"},"OK",null,null,5313,null,"Neinvestiční transfery zvláštním fondům ústřední úrovně",null,null,0,0,0,"x ",0,0,0,"x ",0,0,0,"x ",null,null,52,"Neinvestiční transfery soukromoprávním subjektům ","Neinvestiční transfery podnikatelským subjektům a neziskovým organizacím. Neinvestiční transfery soukromoprávním subjektům",null,null,{"$f":"AC96+AC104","v":1814134.1269999999},{"$f":"AD96+AD104+AD112","v":6704385.9537400007},{"$f":"AE96+AE104+AE112","v":6505544.9403499998},{"$f":"AE95/AD95","v":0.97034165175424025},{"$f":"AG96+AG104+AG110+AG112","v":310361.69699999999},{"$f":"AH96+AH104+AH110+AH112","v":2244057.8457800001},{"$f":"AI96+AI104+AI110+AI112","v":2054623.72159},{"$f":"AI95/AH95","v":0.9155841171624719},{"$f":"AK96+AK104+AK110+AK112","v":1503772.43},{"$f":"AL96+AL104","v":4460328.1079600006},{"$f":"AM96+AM104+AM110+AM112","v":4450921.2187599996},{"$f":"AM95/AL95","v":0.99789098717127711},null,null,null,52,"Neinvestiční transfery soukromoprávním subjektům ","Neinvestiční transfery podnikatelským subjektům a neziskovým organizacím. Neinvestiční transfery soukromoprávním subjektům",null,null,1760894.2889999999,7193577.8747199997,7138856.7398300003,0.99239305727372429,{"$f":"BA96+BA104","v":90520.731},{"$f":"BB96+BB104+BB110+BB112","v":2128003.9928600001},{"$f":"BC96+BC104+BC110+BC112","v":2078712.2809900003},0.97683664502727152,{"$f":"BE96+BE104+BE110+BE112","v":1670373.558},{"$f":"BF96+BF104+BF110+BF112","v":5065573.8818599992},{"$f":"BG96+BG104+BG110+BG112","v":5060144.4588399995},{"$f":"BG95/BF95","v":0.99892817217819241},null,null,52,"Neinvestiční transfery soukromoprávním subjektům ","Neinvestiční transfery podnikatelským subjektům a neziskovým organizacím. Neinvestiční transfery soukromoprávním subjektům",null,null,2057945.061,8720663.8664500006,8646673.6335400008,0.99151552748241401,{"$f":"SUM(BT96,BT104,BT110)","v":81450.732000000004},{"$f":"SUM(BU96,BU104)","v":2637628.9140499998},{"$f":"SUM(BV96,BV104)","v":2570796.9259500001},0.9746620960423954,{"$f":"SUM(BX96,BX104)","v":1976494.3289999999},{"$f":"SUM(BY96,BY104)","v":6083034.9523999998},{"$f":"SUM(BZ96,BZ104)","v":6075876.7075900007},{"$f":"BZ95/BY95","v":0.99882324450442705}]
[null,null,null,null,5319,null,"Ostatní neinvestiční transfery jiným veřejným rozpočtům",null,null,100,10,0,0,100,10,0,0,0,0,0,"x ",null,null,521,null,"Neinvestiční transfery podnikatelským subjektům",null,null,{"$f":"SUM(AC97:AC103)","v":1054971.392},{"$f":"SUM(AD97:AD103)","v":4804541.6412400007},{"$f":"SUM(AE98:AE103)","v":4657608.0201300001},{"$f":"AE96/AD96","v":0.96941776508943345},{"$f":"SUM(AG97:AG103)","v":15991.23},{"$f":"SUM(AH98:AH103)","v":1559693.456},{"$f":"SUM(AI98:AI103)","v":1415120.4673000001},{"$f":"AI96/AH96","v":0.90730679279069826},{"$f":"AK98+AK99","v":1038980.162},{"$f":"SUM(AL97:AL103)","v":3244848.18524},{"$f":"AM98+AM99","v":3242487.5528299999},{"$f":"AM96/AL96","v":0.99927249834961829},null,null,null,521,"Neinvestiční transfery podnikatelským subjektům",null,null,null,1165758.486,5353810.8281299993,5344266.0929899998,0.99821720724799434,{"$f":"SUM(BA97:BA103)","v":14764.199000000001},{"$f":"SUM(BB97:BB103)","v":1661923.7500000002},{"$f":"SUM(BC97:BC103)","v":1653171.6265600002},0.99473373947511134,{"$f":"SUM(BE97:BE103)","v":1150994.287},{"$f":"SUM(BF97:BF103)","v":3691887.0781299993},{"$f":"SUM(BG97:BG103)","v":3691094.4664299996},{"$f":"BG96/BF96","v":0.99978530987453673},null,null,521,"Neinvestiční transfery podnikatelským subjektům",null,null,null,1380629.5959999997,6476163.0160399992,6455100.5990100009,0.99674770122712608,{"$f":"SUM(BT97:BT103)","v":14447.64},{"$f":"SUM(BU97:BU103)","v":2045101.2229999998},{"$f":"SUM(BV97:BV103)","v":2026135.4124800002},0.99072622405839739,{"$f":"SUM(BX97:BX103)","v":1366181.9559999998},{"$f":"SUM(BY97:BY103)","v":4431061.7930399999},{"$f":"SUM(BZ97:BZ103)","v":4428965.1865300005},{"$f":"BZ96/BY96","v":0.9995268388011892}]
[{"$f":"IF(COUNTBLANK(C97:IV97)=254,\"odstr\",IF(AND($A$1=\"TISK\",SUM(J81:U81)=0),\"odstr\",\"OK\"))","v":{"$error":"#REF!"}},"OK",null,null,5322,null,"Neinvestiční dotace obcím v rámci souhrnného dotačního vztahu",null,null,0,0,0,"x ",0,0,0,"x ",0,0,0,"x ",null,null,5211,null,"Neinvestiční transfery finančním institucím",null,null,0,"x","x","x",0,"x",0,"x",0,"x","x","x",null,null,null,5211,null,"Neinvestiční transfery finančním institucím",null,null,0,3,3,1,0,3,3,1,null,null,null,"x",null,null,5211,null,"Neinvestiční transfery finančním institucím",null,null,0,3,3,1,0,3,3,1,null,null,null,0]
[{"$f":"IF(COUNTBLANK(C98:IV98)=254,\"odstr\",IF(AND($A$1=\"TISK\",SUM(J82:U82)=0),\"odstr\",\"OK\"))","v":{"$error":"#REF!"}},"OK",null,null,5324,null,"Neinvestiční dotace krajům v rámci souhrnného dotačního vztahu",null,null,0,0,0,"x ",0,0,0,"x ",0,0,0,"x ",null,null,5212,null,"Neinvestiční transfery nefinančním podnikatelským subjektům-fyzickým osobám",null,null,60720.66,202108.37100000001,201847.40100000001,{"$f":"AE98/AD98","v":0.99870876204330994},1235.5,10188.252,9985.4120000000003,{"$f":"AI98/AH98","v":0.98009079477029026},59485.16,191920.11900000001,191861.989,{"$f":"AM98/AL98","v":0.99969711356837998},null,null,null,5212,null,"Neinvestiční transfery nefinančním podnikatelským subjektům-fyzickým osobám",null,null,54333.534,227501.37099999998,227369.52460999996,0.99942045892110243,1104.5,9412.9519999999993,9281.1090000000004,0.98599344817651269,53229.034,218088.41899999999,218088.41560999997,{"$f":"BG98/BF98","v":0.9999999844558457},null,null,5212,null,"Neinvestiční transfery nefinančním podnikatelským subjektům-fyzickým osobám",null,null,69530.085000000006,276783.087,276581.28200000001,0.99927089114372081,1046.5,19660.100000000002,19495.295000000002,0.99161728577168984,68483.585000000006,257122.98699999999,257085.98699999999,{"$f":"BZ98/BY98","v":0.99985609999155778}]
[{"$f":"IF(COUNTBLANK(C99:IV99)=254,\"odstr\",IF(AND($A$1=\"TISK\",SUM(J83:U83)=0),\"odstr\",\"OK\"))","v":{"$error":"#REF!"}},"OK",null,null,5331,null,"Neinvestiční příspěvky zřízeným příspěvkovým organizacím",null,null,18709549.541029997,20596942.245030001,20443288.480079994,0.99253997204429301,13133157.247029999,14510176.458670001,14416912.247299999,0.9935724964037721,5576392.2939999998,6086765.7863599993,6026376.2327799965,0.99007854816504826,null,null,5213,null,"Neinvestiční transfery nefinančním podnikatelským subjektům-právnickým osobám",null,null,994095.73199999996,4602128.2702400004,4455697.6871300004,{"$f":"AE99/AD99","v":0.96818198570063674},14600.73,1549200.2039999999,1405072.1233000001,{"$f":"AI99/AH99","v":0.90696613625026357},979495.00199999998,3052928.0662400001,3050625.5638299999,{"$f":"AM99/AL99","v":0.99924580522041717},null,null,null,5213,null,"Neinvestiční transfery nefinančním podnikatelským subjektům-právnickým osobám",null,null,1111299.952,5124189.4521300001,5114871.5633800002,0.99818158777362798,13534.699000000001,1652372.7980000002,1643847.5175600003,0.99484058291789923,1097765.253,3471816.6541299997,3471024.0458199997,{"$f":"BG99/BF99","v":0.99977170214070576},null,null,5213,null,"Neinvestiční transfery nefinančním podnikatelským subjektům-právnickým osobám",null,null,1308763.5109999997,6196888.4990399992,6176030.8370099999,0.99663417180521641,13261.14,2025395.1729999997,2006597.1174800002,0.99071882081551721,1295502.3709999998,4171493.3260399997,4169433.7195299999,{"$f":"BZ99/BY99","v":0.99950626637776385}]
[null,null,null,null,null,null,null,null,null,null,null,null,null,null,null,null,null,null,null,null,null,null,null,5214,null,"Neinvestiční transfery finančním a podobným institucím ve vlastnictví státu",null,null,null,160,0,"x",null,160,0,"x",null,0,0,"x",null,null,null,5214,null,"Neinvestiční transfery finančním a podobným institucím ve vlastnictví státu",null,null,0,10,0,0,0,10,0,0,null,null,null,"x",null,null,5214,null,"Neinvestiční transfery finančním a podobným institucím ve vlastnictví státu",null,null,{"$f":"SUM(BT100,BX100)","v":0},0,0,0,0,0,0,0,0,0,0,0]
[{"$f":"IF(COUNTBLANK(C101:IV101)=254,\"odstr\",IF(AND($A$1=\"TISK\",SUM(J84:U84)=0),\"odstr\",\"OK\"))","v":{"$error":"#REF!"}},"OK",null,null,5332,null,"Neinvestiční dotace vysokým školám",null,null,18399.599999999999,59407.898999999998,54693.610090000002,0.92064541939111499,9099.6,24934.1,23960.810089999999,0.96096550868088282,9300,34473.798999999999,30732.799999999999,0.89148283309303977,null,null,5215,null,"Neinvestiční transfery vybraným podnikatelským subjektům ve vlastnictví státu",null,null,85,75,0,"x",85,75,0,"x",0,0,0,"x",null,null,null,5215,null,"Neinvestiční transfery vybraným podnikatelským subjektům ve vlastnictví státu",null,null,85,85,0,0,85,85,0,0,null,null,null,"x",null,null,5215,null,"Neinvestiční transfery vybraným podnikatelským subjektům ve vlastnictví státu",null,null,100,2.95,0,{"$f":"BR101/BQ101","v":0},100,2.95,0,{"$f":"BV101/BU101","v":0},0,0,0,0]
[null,null,null,null,null,null,null,null,null,null,null,null,null,null,null,null,null,null,null,null,null,null,null,null,null,null,null,null,null,null,null,null,null,null,null,null,null,null,null,null,null,null,null,5216,null,"Neivestiční transfery obecním a krajským nemocnicím - obchodním společnostem",null,null,0,1982.0050000000001,1982.0050000000001,1,null,null,null,null,0,1982.0050000000001,1982.0050000000001,{"$f":"BG102/BF102","v":1},null,null,5216,null,"Neivestiční transfery obecním a krajským nemocnicím - obchodním společnostem",null,null,2196,2445.48,2445.48,1,0,0,0,0,2196,2445.48,2445.48,{"$f":"BZ102/BY102","v":1}]
[{"$f":"IF(COUNTBLANK(C103:IV103)=254,\"odstr\",IF(AND($A$1=\"TISK\",SUM(J85:U85)=0),\"odstr\",\"OK\"))","v":{"$error":"#REF!"}},"OK",null,null,5333,null,"Neinvestiční transfery školským právnickým osobám zřízeným státem, kraji a obcemi",null,null,76432.024999999994,120492.12652999999,120549.78439,1.0004785197312096,56432.025000000001,69684.676529999997,69742.334390000004,1.0008274108867419,20000,50807.45,50807.45,1,null,null,5219,null,"Ostatní neinvestiční transfery podnikatelským subjektům",null,null,70,70,62.932000000000002,{"$f":"AE103/AD103","v":0.89902857142857151},70,70,62.932000000000002,{"$f":"AI103/AH103","v":0.89902857142857151},0,0,0,"x",null,null,null,5219,null,"Ostatní neinvestiční transfery podnikatelským subjektům",null,null,40,40,40,1,40,40,40,{"$f":"BC103/BB103","v":1},null,null,null,"x",null,null,5219,null,"Ostatní neinvestiční transfery podnikatelským subjektům",null,null,40,40,40,1,40,40,40,{"$f":"BV103/BU103","v":1},0,0,0,0]
[null,null,null,null,5334,null,"Neinvestiční transfery veřejným výzkumným institucím",null,null,0,0,0,"x ",0,0,0,"x ",0,0,0,"x ",null,null,522,"Neinvestiční transfery neziskovým a podobným organizacím",null,null,null,{"$f":"SUM(AC105:AC109)","v":759162.73499999999},{"$f":"SUM(AD105:AD109)","v":1899663.1544999999},{"$f":"SUM(AE105:AE109)","v":1847838.7622199999},{"$f":"AE104/AD104","v":0.97271916752333887},{"$f":"SUM(AG105:AG109)","v":294370.467},{"$f":"SUM(AH105:AH109)","v":684183.23178000003},{"$f":"SUM(AI105:AI109)","v":639405.0962899999},{"$f":"AI104/AH104","v":0.93455242190969301},{"$f":"SUM(AK105:AK109)","v":464792.26799999998},{"$f":"SUM(AL105:AL109)","v":1215479.9227200001},{"$f":"SUM(AM105:AM109)","v":1208433.6659299999},{"$f":"AM104/AL104","v":0.99420290153848689},null,null,null,522,"Neinvestiční transfery neziskovým a podobným organizacím",null,null,null,595135.80299999996,1839767.0465900002,1794590.6468400005,0.97544449997963933,{"$f":"SUM(BA105:BA109)","v":75756.531999999992},{"$f":"SUM(BB105:BB109)","v":466080.24286000006},{"$f":"SUM(BC105:BC109)","v":425540.65443000005},{"$f":"BC104/BB104","v":0.91302015253588598},{"$f":"SUM(BE105:BE109)","v":519379.27100000001},{"$f":"SUM(BF105:BF109)","v":1373686.80373},{"$f":"SUM(BG105:BG109)","v":1369049.9924100004},{"$f":"BG104/BF104","v":0.99662454985560811},null,null,522,"Neinvestiční transfery neziskovým a podobným organizacím",null,null,null,677315.46500000008,2244500.8504100004,2191573.0345300003,0.97641889248100222,{"$f":"SUM(BT105:BT109)","v":67003.092000000004},{"$f":"SUM(BU105:BU109)","v":592527.69105000002},{"$f":"SUM(BV105:BV109)","v":544661.51347000001},{"$f":"BV104/BU104","v":0.9192169778678565},{"$f":"SUM(BX105:BX109)","v":610312.37300000002},{"$f":"SUM(BY105:BY109)","v":1651973.1593600002},{"$f":"SUM(BZ105:BZ109)","v":1646911.5210600004},{"$f":"BZ104/BY104","v":0.99693600451598097}]
[{"$f":"IF(COUNTBLANK(C105:IV105)=254,\"odstr\",IF(AND($A$1=\"TISK\",SUM(J86:U86)=0),\"odstr\",\"OK\"))","v":{"$error":"#REF!"}},"OK",null,null,5335,null,"Neinvestiční transfery veřejným zdravotnickým zařízením zřízeným státem, kraji a obcemi",null,null,0,0,0,"x ",0,0,0,"x ",0,0,0,"x ",null,null,5221,null,"Neinvestiční transfery obecně prospěšným společnostem",null,null,363264.49300000002,1187739.7525899999,1179507.10197,{"$f":"AE105/AD105","v":0.99306864100317616},22888.78,309801.48074000003,301593.89497000002,{"$f":"AI105/AH105","v":0.97350695112755703},340375.71299999999,877938.27185000002,877913.20700000005,{"$f":"AM105/AL105","v":0.99997145032765555},null,null,null,5221,null,"Neinvestiční transfery obecně prospěšným společnostem",null,null,396575.59599999996,1341680.9404000002,1328938.2226600002,0.99050242322425708,21291.360000000001,319275.12100000004,306842.33644000004,{"$f":"BC105/BB105","v":0.96105933803717825},375284.23599999998,1022405.8194000002,1022095.8862200002,{"$f":"BG105/BF105","v":0.99969685894375893},null,null,5221,null,"Neinvestiční transfery obecně prospěšným společnostem",null,null,454292.15599999996,{"$f":"SUM(BU105,BY105)","v":1570284.4701700003},1551293.0999400003,0.98790577720739736,7918.6,391058.27,372151.90839000006,{"$f":"BV105/BU105","v":0.95165333900239479},446373.55599999998,1179226.2001700003,1179141.1915500003,{"$f":"BZ105/BY105","v":0.99992791152368588}]
[{"$f":"IF(COUNTBLANK(C106:IV106)=254,\"odstr\",IF(AND($A$1=\"TISK\",SUM(J87:U87)=0),\"odstr\",\"OK\"))","v":{"$error":"#REF!"}},null,null,null,5336,null,"Neinvestiční dotace zřízeným příspěvkovým organizacím",null,null,19693365.799000002,41134059.526059985,41090577.916709989,0.99894292929385076,9356464.978000002,13426302.157719996,13386970.06514,0.99707051933451529,10336900.821,27707757.368339993,27703607.851569988,0.99985023989076982,null,null,5222,null,"Neinvestiční transfery občanským sdružením",null,null,273786.05800000002,485206.29029999999,472308.89898,{"$f":"AE106/AD106","v":0.97341874666953387},186649.64,229056.2616,218141.94774,{"$f":"AI106/AH106","v":0.95235094738837733},87136.418000000005,256150.0287,254166.95123999999,{"$f":"AM106/AL106","v":0.9922581407854435},null,null,null,5222,null,"Neinvestiční transfery občanským sdružením",null,null,140755.70500000002,380383.01627000002,376094.50981000002,0.98872582035325163,38968.581999999995,82646.713780000005,80932.043220000007,{"$f":"BC106/BB106","v":0.97925300981035568},101787.12300000001,297736.30249000003,295162.46659000003,{"$f":"BG106/BF106","v":0.99135531717672742},null,null,5222,null,"Neinvestiční transfery občanským sdružením",null,null,180662.777,526858.29111999995,515356.72166999994,0.97816951988066869,43250.542000000001,131413.59669999999,123772.44552000001,{"$f":"BV106/BU106","v":0.94185418121198117},137412.23499999999,395444.69441999996,391584.27614999993,{"$f":"BZ106/BY106","v":0.99023777958214332}]
[{"$f":"IF(COUNTBLANK(C107:IV107)=254,\"odstr\",IF(AND($A$1=\"TISK\",SUM(J88:U88)=0),\"odstr\",\"OK\"))","v":{"$error":"#REF!"}},"OK",null,null,5339,null,"Neinvestiční příspěvky ostatním příspěvkovým organizacím",null,null,20683779.098000001,58947049.228899993,58938267.205219999,0.99985101843442759,24790.35,38760.364099999999,35109.352810000004,0.9058055471155908,20658988.748,58908288.864799991,58903157.852409996,0.99991289829514873,null,null,5223,null,"Neinvestiční transfery církvím a náboženským společnostem",null,null,3186,19059.53141,14290.422570000001,{"$f":"AE107/AD107","v":0.74977827432327204},2979,17298.89215,12583.28953,{"$f":"AI107/AH107","v":0.72740435750968024},207,1760.6392599999999,1707.1330399999999,{"$f":"AM107/AL107","v":0.96960977684889293},null,null,null,5223,null,"Neinvestiční transfery církvím a náboženským společnostem",null,null,713.35,20069.932400000002,12224.964690000003,0.60911837899364329,713.35,17842.915400000002,10097.853530000002,{"$f":"BC107/BB107","v":0.56593069594445322},0,2227.0169999999998,2127.1111599999999,{"$f":"BG107/BF107","v":0.95513916597852644},null,null,5223,null,"Neinvestiční transfery církvím a náboženským společnostem",null,null,903.25,22731.158589999999,15150.679620000001,0.66651594374363132,703.25,21578.002,14266.25963,{"$f":"BV107/BU107","v":0.66114831345367375},200,1153.1565900000001,884.41998999999998,{"$f":"BZ107/BY107","v":0.76695567425062361}]
[{"$f":"IF(COUNTBLANK(C108:IV108)=254,\"odstr\",IF(AND($A$1=\"TISK\",SUM(J89:U89)=0),\"odstr\",\"OK\"))","v":{"$error":"#REF!"}},"OK",null,null,5341,null,"Převody vlastním fondům hospodářské (podnikatelské) činnosti",null,null,0,0,0,"x ",0,0,0,"x ",0,0,0,"x ",null,null,5224,null,"Neinvestiční transfery politickým stranám a hnutím",null,null,0,0,0,"x",0,0,0,"x",0,0,0,"x",null,null,null,5224,null,"Neinvestiční transfery politickým stranám a hnutím",null,null,null,null,null,null,null,null,null,null,null,null,null,"x",null,null,5224,null,"Neinvestiční transfery politickým stranám a hnutím",null,null,0,0,0,0,0,0,0,0,0,0,0,0]
[{"$f":"IF(COUNTBLANK(C109:IV109)=254,\"odstr\",IF(AND($A$1=\"TISK\",SUM(J90:U90)=0),\"odstr\",\"OK\"))","v":{"$error":"#REF!"}},"OK",null,null,5342,null,"Převody fondu kulturních a sociálních potřeb a sociálnímu fondu obcí a krajů",null,null,0,0,0,"x ",0,0,0,"x ",0,0,0,"x ",null,null,5229,null,"Ostatní neinvestiční transfery neziskovým a podobným organizacím",null,null,118926.18399999999,207657.5802,181732.33869999999,{"$f":"AE109/AD109","v":0.87515388807367023},81853.047000000006,128026.59729000001,107085.96405,{"$f":"AI109/AH109","v":0.83643529014079598},37073.137000000002,79630.982910000006,74646.374649999998,{"$f":"AM109/AL109","v":0.93740365774922463},null,null,null,5229,null,"Ostatní neinvestiční transfery neziskovým a podobným organizacím",null,null,{"$f":"BA109+BE109","v":57091.151999999995},{"$f":"BB109+BF109","v":97633.157520000008},{"$f":"BC109+BG109","v":77332.949679999991},{"$f":"AY109/AX109","v":0.79207670472153324},14783.24,46315.492680000003,27668.421239999996,{"$f":"BC109/BB109","v":0.5973901957853468},42307.911999999997,51317.664839999998,49664.528439999995,{"$f":"BG109/BF109","v":0.9677862115286382},null,null,5229,null,"Ostatní neinvestiční transfery neziskovým a podobným organizacím",null,null,41457.282000000007,124626.93053000001,109772.5333,{"$f":"BR109/BQ109","v":0.88080909024374721},15130.7,48477.822350000002,34470.89993,{"$f":"BV109/BU109","v":0.7110653544032387},26326.582000000002,76149.10818000001,75301.633369999996,{"$f":"BZ109/BY109","v":0.98887085048984724}]
[null,null,null,null,5343,null,"Převody jiným vlastním fondům a účtům nemajícím charakter veřejných rozpočtů",null,null,0,0,0,"x ",0,0,0,"x ",0,0,0,"x ",null,null,523,"Neinvestiční nedotační transfery podnikatelským subjektům ",null,null,null,"x","x","x","x",0,null,0,"x",0,null,null,"x",null,null,null,523,"Neinvestiční nedotační transfery podnikatelským subjektům ",null,null,null,null,null,null,null,"x",null,null,null,null,null,null,"x",null,null,523,"Neinvestiční nedotační transfery podnikatelským subjektům ",null,null,null,"x","x","x","x","x","x","x","x","x","x","x","x"]
[{"$f":"IF(COUNTBLANK(C111:IV111)=254,\"odstr\",IF(AND($A$1=\"TISK\",SUM(J91:U91)=0),\"odstr\",\"OK\"))","v":{"$error":"#REF!"}},"OK",null,null,5361,null,"Nákup kolků",null,null,48,53,52.1,0.98301886792452831,48,51,50.1,0.98235294117647065,0,2,2,1,null,null,5230,null,"Neinvestiční nedotační transfery podnikatelským subjektům (zrušeno)",null,null,"x","x","x","x","x",null,"x","x","x",null,"x","x",null,null,null,5230,null,"Neinvestiční nedotační transfery podnikatelským subjektům (zrušeno)",null,null,null,null,null,null,null,null,null,null,null,null,null,"x",null,null,5230,null,"Neinvestiční nedotační transfery podnikatelským subjektům (zrušeno)",null,null,"x","x","x","x","x","x","x","x","x","x","x","x"]
[null,null,null,null,5362,null,"Platby daní a poplatků státnímu rozpočtu",null,null,198.8,745.91958999999997,704.53458999999998,0.94451814839720194,48.8,641.16958999999997,599.78458999999998,0.93545389449926974,150,104.75,104.75,1,null,null,524,"Neinvestiční nedotační transfery neziskovým a podobným organizacím",null,null,null,"x",{"$f":"AD113","v":181.15799999999999},{"$f":"AE113","v":98.158000000000001},{"$f":"AE112/AD112","v":0.54183640799743871},0,{"$f":"AH113","v":181.15799999999999},{"$f":"AI113","v":98.158000000000001},{"$f":"AI112/AH112","v":0.54183640799743871},0,null,null,"x",null,null,null,524,"Neinvestiční nedotační transfery neziskovým a podobným organizacím",null,null,null,null,null,null,null,"x",null,null,null,null,null,null,"x",null,null,524,"Neinvestiční nedotační transfery neziskovým a podobným organizacím",null,null,null,"x","x","x","x","x","x","x","x","x","x","x","x"]
[{"$f":"IF(COUNTBLANK(C113:IV113)=254,\"odstr\",IF(AND($A$1=\"TISK\",SUM(J92:U92)=0),\"odstr\",\"OK\"))","v":{"$error":"#REF!"}},"OK",null,null,5363,null,"Úhrady sankcí jiným rozpočtům",null,null,27000,48652.737960000006,16076.471399999999,0.33043302543871872,0,13665.978580000001,13364.5839,0.97794562034210353,27000,34986.759380000003,2711.8874999999998,7.7511822988391321E-2,null,null,5240,null,"Neinvestiční nedotační transfery neziskovým a podobným organizacím (zrušeno)",null,null,"x",181.15799999999999,98.158000000000001,{"$f":"AE113/AD113","v":0.54183640799743871},"x",181.15799999999999,98.158000000000001,{"$f":"AI113/AH113","v":0.54183640799743871},"x",null,0,"x",null,null,null,5240,null,"Neinvestiční nedotační transfery neziskovým a podobným organizacím (zrušeno)",null,null,null,null,null,null,null,null,null,null,null,null,null,"x",null,null,5240,null,"Neinvestiční nedotační transfery neziskovým a podobným organizacím (zrušeno)",null,null,"x","x","x","x","x","x","x","x","x","x","x","x"]
[{"$f":"IF(COUNTBLANK(C114:IV114)=254,\"odstr\",IF(AND($A$1=\"TISK\",SUM(J93:U93)=0),\"odstr\",\"OK\"))","v":{"$error":"#REF!"}},"OK",null,null,5364,null,"Vratky veřejným rozpočtům ústřední úrovně transferů poskytnutých v minulých rozpočtových obdobích",null,null,0,900.74808000000007,900.72268999999994,0.99997181231848964,0,900.74808000000007,900.72268999999994,0.99997181231848964,0,0,0,"x ",null,null,53,"Neinvestiční transfery veřejnoprávním subjektům a mezi peněžními fondy téhož subjektu a platby daní","Neinvestiční transfery veřejnoprávním subjektům a mezi peněžními fondy téhož subjektu a platby daní",null,null,{"$f":"AC115+AC119+AC125+AC133+AC137","v":65961062.479659997},{"$f":"AD115+AD125+AD137","v":136748660.91242},{"$f":"AE115+AE119+AE125+AE133+AE137","v":136514805.98295999},{"$f":"AE114/AD114","v":0.99828989236238452},{"$f":"AG115+AG125+AG133+AG137","v":24722100.900660001},{"$f":"AH115+AH125+AH133+AH137","v":31779430.641510002},{"$f":"AI115+AI119+AI125+AI133+AI137","v":31613490.398929998},{"$f":"AI114/AH114","v":0.99477837584782736},{"$f":"AK115+AK119+AK125+AK133+AK137","v":41238961.578999996},{"$f":"AL115+AL125+AL133+AL137","v":104969230.27090998},{"$f":"AM115+AM119+AM125+AM133+AM137","v":104901315.58403},{"$f":"AM114/AL114","v":0.99935300385927661},null,null,null,53,"Neinvestiční transfery veřejnoprávním subjektům a mezi peněžními fondy téhož subjektu a platby daní","Neinvestiční transfery veřejnoprávním subjektům a mezi peněžními fondy téhož subjektu a platby daní",null,null,{"$f":"BA114+BE114","v":73372417.143700004},158814863.44518995,158555882.70603001,{"$f":"AY114/AX114","v":0.99836929155406595},{"$f":"BA115+BA119+BA125+BA133+BA137","v":26836966.605700005},{"$f":"BB115+BB119+BB125+BB133+BB137","v":36316210.117509998},{"$f":"BC115+BC119+BC125+BC133+BC137","v":36205435.891960002},{"$f":"BC114/BB114","v":0.99694973056958425},{"$f":"BE115+BE119+BE125+BE133+BE137","v":46535450.538000003},{"$f":"BF115+BF119+BF125+BF133+BF137","v":122498653.32767996},{"$f":"BG115+BG119+BG125+BG133+BG137","v":122350446.81407},{"$f":"BG114/BF114","v":0.99879013760899471},null,null,53,"Neinvestiční transfery veřejnoprávním subjektům a mezi peněžními fondy téhož subjektu a platby daní","Neinvestiční transfery veřejnoprávním subjektům a mezi peněžními fondy téhož subjektu a platby daní",null,null,{"$f":"SUM(BT114,BX114)","v":82785694.837819993},{"$f":"SUM(BU114,BY114)","v":174568793.68644002},174124495.85171002,{"$f":"BR114/BQ114","v":0.9974548839724009},{"$f":"SUM(BT115,BT119,BT125,BT133,BT137)","v":29237085.079819996},{"$f":"SUM(BU115,BU119,BU125,BU133,BU137)","v":35097985.601609997},{"$f":"SUM(BV115,BV119,BV125,BV133,BV137)","v":34874980.395900011},{"$f":"BV114/BU114","v":0.99364621069022951},{"$f":"SUM(BX115,BX119,BX125,BX133,BX137)","v":53548609.758000001},{"$f":"SUM(BY115,BY119,BY125,BY133,BY137)","v":139470808.08483002},{"$f":"SUM(BZ115,BZ119,BZ125,BZ133,BZ137)","v":139249515.45581001},{"$f":"BZ114/BY114","v":0.99841334088431311}]
[null,null,null,null,5365,null,"Výdaje z finančního vypořádání minulých let mezi krajem a obcemi",null,null,29,331.7,319.64999999999998,0.96367199276454629,29,330.7,318.64999999999998,0.96356214091321435,0,1,1,1,null,null,531,"Neinvestiční transfery veřejným rozpočtům ústřední úrovně",null,null,null,{"$f":"SUM(AC116:AC118)","v":1043},{"$f":"SUM(AD116:AD118)","v":6201.0803999999998},{"$f":"AE116+AE118","v":2260.8104000000003},{"$f":"AE115/AD115","v":0.3645833071282224},{"$f":"AG116+AG117+AG118","v":3},{"$f":"AH116+AH118","v":152.31039999999999},{"$f":"AI116","v":150.81039999999999},{"$f":"AI115/AH115","v":0.99015169023257765},{"$f":"AK116","v":1040},{"$f":"AL116+AL118","v":6048.77},{"$f":"AM116+AM118","v":2110},{"$f":"AM115/AL115","v":0.3488312499896673},null,null,null,531,"Neinvestiční transfery veřejným rozpočtům ústřední úrovně",null,null,null,840,5877.8890000000001,1429.1220000000001,{"$f":"AY115/AX115","v":0.24313524804568443},{"$f":"SUM(BA116:BA118)","v":0},{"$f":"SUM(BB116:BB118)","v":834.745},{"$f":"SUM(BC116:BC118)","v":324.74799999999999},{"$f":"BC115/BB115","v":0.38903856866468201},{"$f":"SUM(BE116:BE118)","v":840},{"$f":"SUM(BF116:BF118)","v":5043.1440000000002},{"$f":"SUM(BG116:BG118)","v":1104.374},{"$f":"BG115/BF115","v":0.2189852203308095},null,null,531,"Neinvestiční transfery veřejným rozpočtům ústřední úrovně",null,null,null,840,5186.3340000000007,1247.5630000000001,{"$f":"BR115/BQ115","v":0.2405481405555446},{"$f":"SUM(BT116:BT118)","v":0},{"$f":"SUM(BU116:BU118)","v":0},{"$f":"SUM(BV116:BV118)","v":0},0,{"$f":"SUM(BX116:BX118)","v":840},{"$f":"SUM(BY116:BY118)","v":5186.3340000000007},{"$f":"SUM(BZ116:BZ118)","v":1247.5630000000001},{"$f":"BZ115/BY115","v":0.2405481405555446}]
[{"$f":"IF(COUNTBLANK(C116:IV116)=254,\"odstr\",IF(AND($A$1=\"TISK\",SUM(J94:U94)=0),\"odstr\",\"OK\"))","v":{"$error":"#REF!"}},"OK",null,null,5369,null,"Ostatní neinvestiční transfery jiným veřejným rozpočtům",null,null,0,195.9,195.8212,0.99959775395610007,0,195.9,195.8212,0.99959775395610007,0,0,0,"x ",null,null,5311,null,"Neinvestiční transfery státnímu rozpočtu",null,null,1040,5129.5803999999998,1190.8104000000001,{"$f":"AE116/AD116","v":0.23214577161126085},0,150.81039999999999,150.81039999999999,{"$f":"AI116/AH116","v":1},1040,4978.7700000000004,1040,{"$f":"AM116/AL116","v":0.20888693392143037},null,null,null,5311,null,"Neinvestiční transfery státnímu rozpočtu",null,null,840,5553.1410000000005,1104.374,{"$f":"AY116/AX116","v":0.19887375451118564},0,509.99700000000001,0,{"$f":"BC116/BB116","v":0},840,5043.1440000000002,1104.374,{"$f":"BG116/BF116","v":0.2189852203308095},null,null,5311,null,"Neinvestiční transfery státnímu rozpočtu",null,null,840,5186.3340000000007,1247.5630000000001,{"$f":"BR116/BQ116","v":0.2405481405555446},0,0,0,0,840,5186.3340000000007,1247.5630000000001,{"$f":"BZ116/BY116","v":0.2405481405555446}]
[{"$f":"IF(COUNTBLANK(C117:IV117)=254,\"odstr\",IF(AND($A$1=\"TISK\",SUM(J95:U95)=0),\"odstr\",\"OK\"))","v":{"$error":"#REF!"}},"OK",null,null,53,null,"Neinvestiční transfery veřejnoprávním subjektům a mezi peněžními fondy téhož subjektu",null,null,59210241.863030002,120914143.51914997,120666761.33436999,0.99795406742685311,22580470.000030003,28085953.253269996,27948124.472109996,0.99509260804085564,36629771.862999998,92828190.265879974,92718636.862259984,0.99881982614003129,null,null,5313,null,"Neinvestiční transfery zvláštním fondům ústřední úrovně",null,null,0,0,0,"x",0,0,null,"x",0,0,0,"x",null,null,null,5313,null,"Neinvestiční transfery zvláštním fondům ústřední úrovně",null,null,null,null,null,null,null,null,null,null,null,null,null,"x",null,null,5313,null,"Neinvestiční transfery zvláštním fondům ústřední úrovně",null,null,0,0,0,0,0,0,0,0,0,0,0,0]
[{"$f":"IF(COUNTBLANK(C118:IV118)=254,\"odstr\",IF(AND($A$1=\"TISK\",SUM(J96:U96)=0),\"odstr\",\"OK\"))","v":{"$error":"#REF!"}},"OK",null,null,5421,null,"Náhrady z úrazového pojištění",null,null,0,14,13.5,0.9642857142857143,0,14,13.5,0.9642857142857143,0,0,0,"x ",null,null,5319,null,"Ostatní neinvestiční transfery jiným veřejným rozpočtům",null,null,3,1071.5,1070,{"$f":"AE118/AD118","v":0.99860009332711153},3,1.5,0,"x",0,1070,1070,{"$f":"AM118/AL118","v":1},null,null,null,5319,null,"Ostatní neinvestiční transfery jiným veřejným rozpočtům",null,null,{"$f":"BA118+BE118","v":0},324.74799999999999,324.74799999999999,{"$f":"AY118/AX118","v":1},0,324.74799999999999,324.74799999999999,{"$f":"BC118/BB118","v":1},null,null,null,"x",null,null,5319,null,"Ostatní neinvestiční transfery jiným veřejným rozpočtům",null,null,0,0,0,0,0,0,0,0,0,0,0,0]
[null,null,null,null,5424,null,"Náhrady mezd v době nemoci",null,null,84,428.71699999999998,220.1677,0.51355019744959962,84,303.31599999999997,172.946,0.57018423030766596,0,125.401,47.221699999999998,0.37656557762697268,null,null,532,null,"Neinvestiční transfery veřejným rozpočtům územní úrovně",null,null,{"$f":"SUM(AC121:AC123)","v":0},{"$f":"SUM(AD121:AD123)","v":0},0,"x",0,null,0,"x",0,null,0,"x",null,null,null,532,"Neinvestiční transfery veřejným rozpočtům územní úrovně",null,null,null,68787.532000000007,206777.79323000001,184676.84333999999,{"$f":"AY119/AX119","v":0.89311739164651482},{"$f":"SUM(BA120:BA124)","v":64312.531999999999},{"$f":"SUM(BB120:BB124)","v":89758.454029999994},{"$f":"SUM(BC120:BC124)","v":77362.891059999994},{"$f":"BC119/BB119","v":0.86190088606186299},{"$f":"SUM(BE120:BE124)","v":4475},{"$f":"SUM(BF120:BF124)","v":117019.33920000002},{"$f":"SUM(BG120:BG124)","v":107313.95228},{"$f":"BG119/BF119","v":0.91706168410836475},null,null,532,"Neinvestiční transfery veřejným rozpočtům územní úrovně",null,null,null,0,0,0,0,{"$f":"SUM(BT120:BT124)","v":0},{"$f":"SUM(BU120:BU124)","v":0},{"$f":"SUM(BV120:BV124)","v":0},0,{"$f":"SUM(BX120:BX124)","v":0},{"$f":"SUM(BY120:BY124)","v":0},{"$f":"SUM(BZ120:BZ124)","v":0},0]
[null,null,null,null,null,null,null,null,null,null,null,null,null,null,null,null,null,null,null,null,null,null,null,null,null,null,null,null,null,null,null,null,null,null,null,null,null,null,null,null,null,null,null,5321,null,"Neinvestiční transfery obcím",null,null,60729.131999999998,177632.29523000002,157120.87333999999,{"$f":"AY120/AX120","v":0.88452875720914581},56404.131999999998,62541.956030000001,51685.921059999993,{"$f":"BC120/BB120","v":0.8264199641470662},4325,115090.33920000002,105434.95228,{"$f":"BG120/BF120","v":0.916106017350238},null,null,5321,null,"Neinvestiční transfery obcím",null,null,0,0,0,0,0,0,0,0,0,0,0,0]
[{"$f":"IF(COUNTBLANK(C121:IV121)=254,\"odstr\",IF(AND($A$1=\"TISK\",SUM(J97:U97)=0),\"odstr\",\"OK\"))","v":{"$error":"#REF!"}},"OK",null,null,5429,null,"Ostatní náhrady placené obyvatelstvu",null,null,45,79.5,61.89,0.77849056603773581,45,79.5,61.89,0.77849056603773581,0,0,0,"x ",null,null,5322,null,"Neinvestiční dotace obcím v rámci souhrnného dotačního vztahu",null,null,0,null,0,"x",0,null,0,"x",0,null,0,"x",null,null,null,5322,null,"Neinvestiční dotace obcím v rámci souhrnného dotačního vztahu",null,null,null,null,null,null,null,null,null,null,null,null,null,"x",null,null,5322,null,"Neinvestiční dotace obcím v rámci souhrnného dotačního vztahu",null,null,0,0,0,0,0,0,0,0,0,0,0,0]
[null,null,null,null,null,null,null,null,null,null,null,null,null,null,null,null,null,null,null,null,null,null,null,null,null,null,null,null,null,null,null,null,null,null,null,null,null,null,null,null,null,null,null,5323,null,"Neinvestiční transfery krajům ",null,null,{"$f":"BA122+BE122","v":107},{"$f":"BB122+BF122","v":201},{"$f":"BC122+BG122","v":144},{"$f":"AY122/AX122","v":0.71641791044776115},7,51,44,{"$f":"BC122/BB122","v":0.86274509803921573},100,150,100,{"$f":"BG122/BF122","v":0.66666666666666663},null,null,5323,null,"Neinvestiční transfery krajům ",null,null,0,0,0,0,0,0,0,0,0,0,0,0]
[{"$f":"IF(COUNTBLANK(C123:IV123)=254,\"odstr\",IF(AND($A$1=\"TISK\",SUM(J98:U98)=0),\"odstr\",\"OK\"))","v":{"$error":"#REF!"}},"OK",null,null,5491,null,"Stipendia studentům a doktorandům",null,null,15174,7537,6579,0.87289372429348544,1824,1937,1713,0.88435725348477023,13350,5600,4866,0.86892857142857138,null,null,5324,null,"Neinvestiční dotace krajům v rámci souhrnného dotačního vztahu",null,null,0,null,0,"x",0,null,0,"x",0,null,0,"x",null,null,null,5324,null,"Neinvestiční dotace krajům v rámci souhrnného dotačního vztahu",null,null,null,null,null,null,null,null,null,null,null,null,null,"x",null,null,5324,null,"Neinvestiční dotace krajům v rámci souhrnného dotačního vztahu",null,null,0,0,0,0,0,0,0,0,0,0,0,0]
[null,null,null,null,null,null,null,null,null,null,null,null,null,null,null,null,null,null,null,null,null,null,null,null,null,null,null,null,null,null,null,null,null,null,null,null,null,null,null,null,null,null,null,5329,null,"Ostatní neinvestiční transfery veřejným rozpočtům územní úrovně",null,null,{"$f":"BA124+BE124","v":7951.4},28944.498,27411.97,{"$f":"AY124/AX124","v":0.94705287339929001},7901.4,27165.498,25632.97,{"$f":"BC124/BB124","v":0.94358549951854376},50,1779,1779,{"$f":"BG124/BF124","v":1},null,null,5329,null,"Ostatní neinvestiční transfery veřejným rozpočtům územní úrovně",null,null,0,0,0,0,0,0,0,0,0,0,0,0]
[null,null,null,null,5492,null,"Dary obyvatelstvu",null,null,12111.1,12736.573,11490.5365,0.9021686210254517,11219.1,11885.316000000001,11033.0365,0.92829138913933795,892,851.25699999999995,457.5,0.53744051443923524,null,null,533,"Neinvestiční transfery příspěvkovým a podobným organizacím",null,null,null,{"$f":"SUM(AC126:AC132)","v":65958744.820659995},{"$f":"SUM(AD126:AD132)","v":136728343.56459001},{"$f":"SUM(AE126:AE132)","v":136505607.45201999},{"$f":"AE125/AD125","v":0.99837095874371651},{"$f":"SUM(AG126:AG132)","v":24720823.241659999},{"$f":"SUM(AH126:AH132)","v":31772925.612679999},{"$f":"SUM(AI126:AI132)","v":31608060.571989998},{"$f":"AI125/AH125","v":0.99481114699037321},{"$f":"SUM(AK126:AK132)","v":41237921.578999996},{"$f":"SUM(AL126:AL132)","v":104955417.95190999},{"$f":"SUM(AM126:AM132)","v":104897546.88003001},{"$f":"AM125/AL125","v":0.9994486128204787},null,null,null,533,"Neinvestiční transfery příspěvkovým a podobným organizacím",null,null,null,73302248.000699997,158584210.15181997,158358004.88981,0.99857359530439116,{"$f":"SUM(BA126:BA132)","v":26772112.462700002},{"$f":"SUM(BB126:BB132)","v":36214711.283140004},{"$f":"SUM(BC126:BC132)","v":36116965.892070003},0.99730094794058166,{"$f":"SUM(BE126:BE132)","v":46530135.538000003},{"$f":"SUM(BF126:BF132)","v":122369498.86867997},{"$f":"SUM(BG126:BG132)","v":122241038.99774},{"$f":"BG125/BF125","v":0.99895022965585711},null,null,533,"Neinvestiční transfery příspěvkovým a podobným organizacím",null,null,null,82784568.797820002,174520676.89929003,174086189.18893003,{"$f":"BR125/BQ125","v":0.99751039408006237},{"$f":"SUM(BT126:BT132)","v":29236799.039819997},{"$f":"SUM(BU126:BU132)","v":35082596.851799995},{"$f":"SUM(BV126:BV132)","v":34858298.53095001},{"$f":"BV125/BU125","v":0.99360656447989038},{"$f":"SUM(BX126:BX132)","v":53547769.758000001},{"$f":"SUM(BY126:BY132)","v":139438080.04749003},{"$f":"SUM(BZ126:BZ132)","v":139227890.65798002},{"$f":"BZ125/BY125","v":0.99849259693307291}]
[{"$f":"IF(COUNTBLANK(C126:IV126)=254,\"odstr\",IF(AND($A$1=\"TISK\",SUM(J99:U99)=0),\"odstr\",\"OK\"))","v":{"$error":"#REF!"}},"OK",null,null,5493,null,"Účelové neinvestiční transfery nepodnikajícím fyzickým osobám",null,null,1341.8,1435.57933,816.38823000000002,0.56868207345950017,341.8,475.73232999999993,360.95249999999999,0.75873022966507242,1000,959.84699999999998,455.43572999999998,0.47448784024953977,null,null,5331,null,"Neinvestiční příspěvky zřízeným příspěvkovým organizacím",null,null,19852327.558400001,21960332.216669999,21799764.104249999,{"$f":"AE126/AD126","v":0.99268826578597413},14105513.9794,15632216.516729999,15520011.796010001,{"$f":"AI126/AH126","v":0.9928222129856048},5746813.5789999999,6328115.6999399997,6279752.3082400002,{"$f":"AM126/AL126","v":0.99235737872168517},null,null,null,5331,null,"Neinvestiční příspěvky zřízeným příspěvkovým organizacím",null,null,20602445.140560001,22486622.875870001,22354437.559489999,0.99412160211385736,14561022.11256,16002305.407680001,15945239.463789999,0.99643389234012403,6041423.0279999999,6484317.4681900004,6409198.0957000004,{"$f":"BG126/BF126","v":0.98841522290379646},null,null,5331,null,"Neinvestiční příspěvky zřízeným příspěvkovým organizacím",null,null,21222767.634899996,22651144.914640002,22477842.063750003,{"$f":"BR126/BQ126","v":0.99234904674606583},15063115.601899998,16248914.027550001,16124509.379460003,{"$f":"BV126/BU126","v":0.99234381769273505},6159652.0329999998,6402230.8870900013,6353332.6842900002,{"$f":"BZ126/BY126","v":0.99236231812592024}]
[{"$f":"IF(COUNTBLANK(C127:IV127)=254,\"odstr\",IF(AND($A$1=\"TISK\",SUM(J101:U101)=0),\"odstr\",\"OK\"))","v":{"$error":"#REF!"}},"OK",null,null,5494,null,"Neinvestiční transfery obyvatelstvu nemající charakter daru",null,null,1219,1260.0149999999999,1053.2850000000001,0.83593052463661166,369,504.64499999999998,460.43099999999998,0.91238593466694407,850,755.37,592.85400000000004,0.78485245641208945,null,null,5332,null,"Neinvestiční dotace vysokým školám",null,null,40009.599999999999,185925.86199999999,175115.38201,{"$f":"AE127/AD127","v":0.94185596412617412},10359.6,147660.20000000001,137509.10576000001,{"$f":"AI127/AH127","v":0.93125368758812455},29650,38265.661999999997,37606.276250000003,{"$f":"AM127/AL127","v":0.98276821266021752},null,null,null,5332,null,"Neinvestiční dotace vysokým školám",null,null,25311.82,65299.903550000003,57424.64993,0.87939869445641772,4943,27781.1,20505.78068,0.73811982534888831,20368.82,37518.803550000004,36918.869249999996,{"$f":"BG127/BF127","v":0.98400976994907374},null,null,5332,null,"Neinvestiční dotace vysokým školám",null,null,26376.993999999999,81495.968590000004,76542.708910000001,{"$f":"BR127/BQ127","v":0.93922080115496909},6340,32423,29716.302199999998,{"$f":"BV127/BU127","v":0.91651920550226684},20036.993999999999,49072.968590000004,46826.406710000003,{"$f":"BZ127/BY127","v":0.95421997192039043}]
[{"$f":"IF(COUNTBLANK(C128:IV128)=254,\"odstr\",IF(AND($A$1=\"TISK\",SUM(J103:U103)=0),\"odstr\",\"OK\"))","v":{"$error":"#REF!"}},"OK",null,null,5499,null,"Ostatní neinvestiční transfery obyvatelstvu",null,null,5606.85,8794.2286999999997,7186.7310800000005,0.81720993678501908,5571.85,7223.2287000000006,5818.0610800000004,0.8054654395755183,35,1571,1368.67,0.87120942075111396,null,null,5333,null,"Neinvestiční transfery školským právnickým osobám zřízeným státem, kraji a obcemi",null,null,93690.797000000006,136773.28218000001,136138.92194,{"$f":"AE128/AD128","v":0.99536195790662418},69717.797000000006,76153.852180000002,75519.491940000007,{"$f":"AI128/AH128","v":0.99167001770966756},23973,60619.43,60619.43,{"$f":"AM128/AL128","v":1},null,null,null,5333,null,"Neinvestiční transfery školským právnickým osobám zřízeným státem, kraji a obcemi",null,null,108583.557,152487.67400000003,151139.21544000003,0.99115693403520599,63083.557000000001,73168.274000000005,71819.815440000006,0.98157044732256493,45500,79319.400000000023,79319.400000000023,{"$f":"BG128/BF128","v":1},null,null,5333,null,"Neinvestiční transfery školským právnickým osobám zřízeným státem, kraji a obcemi",null,null,113889.42,129389.249,127788.13806,{"$f":"BR128/BQ128","v":0.98762562614456473},67358.42,36180.851999999999,34579.74106,{"$f":"BV128/BU128","v":0.95574700838996274},46531,93208.396999999997,93208.396999999997,{"$f":"BZ128/BY128","v":1}]
[null,null,null,null,54,null,"Neinvestiční transfery obyvatelstvu",null,null,35581.75,32285.613030000004,27421.498510000001,0.84934111316144945,19454.75,22422.738030000004,19633.817080000001,0.87562085654889121,16127,9862.875,7787.6814300000005,0.78959547089464288,null,null,5334,null,"Neinvestiční transfery veřejným výzkumným institucím",null,null,0,58126.400000000001,56090.092290000001,{"$f":"AE129/AD129","v":0.9649675928665804},0,58126.400000000001,56090.092290000001,{"$f":"AI129/AH129","v":0.9649675928665804},0,0,0,"x",null,null,null,5334,null,"Neinvestiční transfery veřejným výzkumným institucím",null,null,0,1388.9,713.09186,0.51342203182374535,0,1388.9,713.09186,0.51342203182374535,null,null,null,"x",null,null,5334,null,"Neinvestiční transfery veřejným výzkumným institucím",null,null,0,186.5,159.19735999999997,{"$f":"BR129/BQ129","v":0.85360514745308302},0,186.5,159.19735999999997,{"$f":"BV129/BU129","v":0.85360514745308302},0,0,0,0]
[{"$f":"IF(COUNTBLANK(C130:IV130)=254,\"odstr\",IF(AND($A$1=\"TISK\",SUM(J105:U105)=0),\"odstr\",\"OK\"))","v":{"$error":"#REF!"}},"OK",null,null,5511,null,"Neinvestiční transfery mezinárodním organizacím",null,null,646,5,5,1,646,5,5,1,0,0,0,"x ",null,null,5335,null,"Neinvestiční transfery veřejným zdravotnickým zařízením zřízeným státem, kraji a obcemi",null,null,0,0,0,"x",0,0,0,"x",0,0,0,"x",null,null,null,5335,null,"Neinvestiční transfery veřejným zdravotnickým zařízením zřízeným státem, kraji a obcemi",null,null,null,null,null,null,null,null,null,null,null,null,null,"x",null,null,5335,null,"Neinvestiční transfery veřejným zdravotnickým zařízením zřízeným státem, kraji a obcemi",null,null,0,{"$f":"SUM(BU130,BY130)","v":0},0,0,0,0,0,0,0,0,0,0]
[{"$f":"IF(COUNTBLANK(C131:IV131)=254,\"odstr\",IF(AND($A$1=\"TISK\",SUM(J106:U106)=0),\"odstr\",\"OK\"))","v":{"$error":"#REF!"}},"OK",null,null,5513,null,"Vratky neoprávněně použitých nebo zadržených prostředků Evropských společenství",null,null,0,0,0,"x ",0,0,0,"x ",0,0,0,"x ",null,null,5336,null,"Neinvestiční dotace zřízeným příspěvkovým organizacím",null,null,22422218.864259999,47185696.632080004,47142483.317000002,{"$f":"AE131/AD131","v":0.99908418613765637},10506641.65026,15815439.38449,15779922.81119,{"$f":"AI131/AH131","v":0.99775431004877224},11915577.214,31370257.247590002,31362560.50581,{"$f":"AM131/AL131","v":0.99975464843277329},null,null,null,5336,null,"Neinvestiční dotace zřízeným příspěvkovým organizacím",null,null,{"$f":"BA131+BE131","v":25304350.538139999},56627349.112010002,56572323.220819995,{"$f":"AY131/AX131","v":0.99902828064437266},12116238.258140001,20064507.079,20039011.866,{"$f":"BC131/BB131","v":0.99872933768571448},13188112.279999999,36562842.033010006,36533311.354819998,{"$f":"BG131/BF131","v":0.99919233088709714},null,null,5336,null,"Neinvestiční dotace zřízeným příspěvkovým organizacím",null,null,29375654.582320001,59662055.727230012,59460253.865390003,{"$f":"BR131/BQ131","v":0.99661758450358073},14071328.41832,18717077.159049999,18628240.498290006,{"$f":"BV131/BU131","v":0.99525371082220282},15304326.164000001,40944978.56818001,40832013.367099993,{"$f":"BZ131/BY131","v":0.99724104871878461}]
[{"$f":"IF(COUNTBLANK(C132:IV132)=254,\"odstr\",IF(AND($A$1=\"TISK\",SUM(J107:U107)=0),\"odstr\",\"OK\"))","v":{"$error":"#REF!"}},"OK",null,null,5531,null,"Peněžní dary do zahraničí",null,null,0,0,0,"x ",0,0,0,"x ",0,0,0,"x ",null,null,5339,null,"Neinvestiční příspěvky cizím příspěvkovým organizacím",null,null,23550498.000999998,67201489.171660006,67196015.634529993,{"$f":"AE132/AD132","v":0.99991855035956079},28590.215,43329.259279999998,39007.274799999999,{"$f":"AI132/AH132","v":0.90025251869479916},23521907.785999998,67158159.912379995,67157008.359730005,{"$f":"AM132/AL132","v":0.99998285312385726},null,null,null,5339,null,"Neinvestiční příspěvky cizím příspěvkovým organizacím",null,null,27261556.945,79251061.686389968,79221967.152270004,{"$f":"AY132/AX132","v":0.99963288145924034},26825.535,45560.52246,39675.874300000003,{"$f":"BC132/BB132","v":0.87083887887443689},27234731.41,79205501.163929969,79182291.277970001,{"$f":"BG132/BF132","v":0.99970696623821709},null,null,5339,null,"Neinvestiční příspěvky cizím příspěvkovým organizacím",null,null,32045880.166599996,91996404.539830014,91943603.215460017,{"$f":"BR132/BQ132","v":0.99942605013060992},28656.599600000001,47815.313200000004,41093.412580000004,{"$f":"BV132/BU132","v":0.85941950036207226},32017223.566999998,91948589.226630017,91902509.802880019,{"$f":"BZ132/BY132","v":0.9994988566530757}]
[null,null,null,null,5532,null,"Ostatní neinvestiční transfery do zahraničí",null,null,943.4,3857.7620000000002,0,0,50,0,0,"x ",893.4,3857.7620000000002,0,0,null,null,534,null,"Převody vlastním fondům a ve vztahu k útvarům bez plné právní subjektivity",null,null,{"$f":"SUM(AC134:AC136)","v":0},{"$f":"SUM(AD134:AD136)","v":0},0,"x",0,{"$f":"SUM(AH134:AH136)","v":0},0,"x",0,null,null,"x",null,null,null,534,"Převody vlastním fondům a ve vztahu k útvarům bez plné právní subjektivity",null,null,null,{"$f":"BA133+BE133","v":0},{"$f":"BB133+BF133","v":0},{"$f":"BC133+BG133","v":0},"x",{"$f":"SUM(BA134:BA136)","v":0},0,0,"x",null,null,null,"x",null,null,534,"Převody vlastním fondům a ve vztahu k útvarům bez plné právní subjektivity",null,null,null,0,0,0,null,{"$f":"SUM(BT134:BT136)","v":0},{"$f":"SUM(BU134:BU136)","v":0},{"$f":"SUM(BV134:BV136)","v":0},0,{"$f":"SUM(BX134:BX136)","v":0},{"$f":"SUM(BY134:BY136)","v":0},{"$f":"SUM(BZ134:BZ136)","v":0},0]
[{"$f":"IF(COUNTBLANK(C134:IV134)=254,\"odstr\",IF(AND($A$1=\"TISK\",SUM(J108:U108)=0),\"odstr\",\"OK\"))","v":{"$error":"#REF!"}},"OK",null,null,55,null,"Neinvestiční transfery do zahraničí",null,null,1589.4,3862.7620000000002,5,1.2944105797872093E-3,696,5,5,1,893.4,3857.7620000000002,0,0,null,null,5341,null,"Převody vlastním fondům hospodářské (podnikatelské) činnosti",null,null,null,null,null,"x",null,null,null,"x",null,null,null,"x",null,null,null,5341,null,"Převody vlastním fondům hospodářské (podnikatelské) činnosti",null,null,null,null,null,null,null,null,null,null,null,null,null,"x",null,null,5341,null,"Převody vlastním fondům hospodářské (podnikatelské) činnosti",null,null,0,0,0,0,0,0,0,0,0,0,0,0]
[{"$f":"IF(COUNTBLANK(C135:IV135)=254,\"odstr\",IF(AND($A$1=\"TISK\",SUM(J109:U109)=0),\"odstr\",\"OK\"))","v":{"$error":"#REF!"}},"OK",null,null,5612,null,"Neinvestiční půjčené prostředky nefinančním podnikatelským subjektům – fyzickým osobám",null,null,0,0,0,"x ",0,0,0,"x ",0,0,0,"x ",null,null,5342,null,"Převody fondu kulturních a sociálních potřeb a sociálnímu fondu obcí a krajů",null,null,null,null,null,"x",null,null,null,"x",null,null,null,"x",null,null,null,5342,null,"Převody fondu kulturních a sociálních potřeb a sociálnímu fondu obcí a krajů",null,null,null,null,null,null,null,null,null,null,null,null,null,"x",null,null,5342,null,"Převody fondu kulturních a sociálních potřeb a sociálnímu fondu obcí a krajů",null,null,0,0,0,0,0,0,0,0,0,0,0,0]
[{"$f":"IF(COUNTBLANK(C136:IV136)=254,\"odstr\",IF(AND($A$1=\"TISK\",SUM(J110:U110)=0),\"odstr\",\"OK\"))","v":{"$error":"#REF!"}},"OK",null,null,5613,null,"Neinvestiční půjčené prostředky nefinančním podnikatelským subjektům – právnickým osobám",null,null,0,0,0,"x ",0,0,0,"x ",0,0,0,"x ",null,null,5343,null,"Převody jiným vlastním fondům a účtům nemajícím charakter veřejných rozpočtů",null,null,null,null,null,"x",null,null,null,"x",null,null,null,"x",null,null,null,5343,null,"Převody jiným vlastním fondům a účtům nemajícím charakter veřejných rozpočtů",null,null,null,null,null,null,null,null,null,null,null,null,null,"x",null,null,5343,null,"Převody jiným vlastním fondům a účtům nemajícím charakter veřejných rozpočtů",null,null,0,0,0,0,0,0,0,0,0,0,0,0]
[null,null,null,null,5615,null,"Neinvestiční půjčené prostředky vybraným podnikatelským subjektům ve vlastnictví státu",null,null,0,0,0,"x ",0,0,0,"x ",0,0,0,"x ",null,null,536,null,"Ostatní neinvestiční transfery jiným veřejným rozpočtům, platby daní a další povinné platby",null,null,{"$f":"SUM(AC138:AC145)","v":1274.6590000000001},{"$f":"SUM(AD138:AD145)","v":14116.267430000002},{"$f":"SUM(AE138:AE145)","v":6937.7205400000003},{"$f":"AE137/AD137","v":0.49146989984448031},{"$f":"SUM(AG138:AG145)","v":1274.6590000000001},{"$f":"SUM(AH138:AH145)","v":6352.7184299999999},{"$f":"SUM(AI138:AI145)","v":5279.0165399999996},{"$f":"AI137/AH137","v":0.83098544318766532},0,{"$f":"SUM(AL138:AL145)","v":7763.549},{"$f":"SUM(AM138:AM145)","v":1658.704},{"$f":"AM137/AL137","v":0.21365280234593739},null,null,null,536,"Ostatní neinvestiční transfery jiným veřejným rozpočtům, platby daní a další povinné platby",null,null,null,{"$f":"BA137+BE137","v":541.61099999999999},17997.611140000001,11771.850880000002,{"$f":"AY137/AX137","v":0.65407852122312282},{"$f":"SUM(BA138:BA145)","v":541.61099999999999},{"$f":"SUM(BB138:BB145)","v":10905.635340000001},{"$f":"SUM(BC138:BC145)","v":10782.360830000001},{"$f":"BC137/BB137","v":0.98869625600373323},0,{"$f":"SUM(BF138:BF145)","v":7091.9757999999993},{"$f":"SUM(BG138:BG145)","v":989.49005},{"$f":"BG137/BF137","v":0.13952247975803866},null,null,536,"Ostatní neinvestiční transfery jiným veřejným rozpočtům, platby daní a další povinné platby",null,null,null,286.04000000000002,42930.453150000001,37059.099780000004,{"$f":"BR137/BQ137","v":0.86323570008717698},{"$f":"SUM(BT138:BT145)","v":286.04000000000002},{"$f":"SUM(BU138:BU145)","v":15388.749809999999},{"$f":"SUM(BV138:BV145)","v":16681.864949999999},{"$f":"BV137/BU137","v":1.0840299021015796},{"$f":"SUM(BX138:BX145)","v":0},{"$f":"SUM(BY138:BY145)","v":27541.70334},{"$f":"SUM(BZ138:BZ145)","v":20377.234830000001},{"$f":"BZ137/BY137","v":0.73986835812022078}]
[{"$f":"IF(COUNTBLANK(C138:IV138)=254,\"odstr\",IF(AND($A$1=\"TISK\",SUM(J111:U111)=0),\"odstr\",\"OK\"))","v":{"$error":"#REF!"}},"OK",null,null,5621,null,"Neinvestiční půjčené prostředky obecně prospěšným společnostem",null,null,0,757.49,757.49,1,0,757.49,757.49,1,0,0,0,"x ",null,null,5361,null,"Nákup kolků",null,null,21,18.8,14,0.74468085106382975,21,18.8,14,0.74468085106382975,0,0,0,"x",null,null,null,5361,null,"Nákup kolků",null,null,21,16,9,0.5625,21,16,9,0.5625,null,null,null,"x",null,null,5361,null,"Nákup kolků",null,null,21,25,18.5,0.74,21,25,18.5,0.74,0,0,0,0]
[{"$error":"#REF!"},"OK",null,null,5622,null,"Neinvestiční půjčené prostředky občanským sdružením",null,null,3000,7225.4790000000003,6225.4790000000003,0.86160087102875815,0,225.47900000000001,225.47900000000001,1,3000,7000,6000,0.8571428571428571,null,null,5362,null,"Platby daní a poplatků státnímu rozpočtu",null,null,820.5,2494.4622300000001,1637.01423,0.65625937739694695,820.5,2494.4622300000001,1637.01423,0.65625937739694695,0,0,0,"x",null,null,null,5362,null,"Platby daní a poplatků státnímu rozpočtu",null,null,135.5,1171.105,1077.79,0.92031884416854159,135.5,1155.7049999999999,1063.2249999999999,0.91997957956398901,0,15.4,14.565,{"$f":"BG139/BF139","v":0.94577922077922072},null,null,5362,null,"Platby daní a poplatků státnímu rozpočtu",null,null,101.9,358.22717999999998,1783.8294599999999,4.9796038927029489,101.9,358.22717999999998,1783.8294599999999,4.9796038927029489,0,0,0,0]
[{"$error":"#REF!"},"OK",null,null,5629,null,"Ostatní neinvestiční půjčené prostředky neziskovým a podobným organizacím",null,null,200,186.23,186.23,1,200,186.23,186.23,1,0,0,0,"x ",null,null,5363,null,"Úhrady sankcí jiným rozpočtům",null,null,1.5589999999999999,9677.9850000000006,3509.0764600000002,0.36258337453509176,1.5589999999999999,1942.576,1874.7064600000001,0.96506209280872413,0,7735.4089999999997,1634.37,{"$f":"AM140/AL140","v":0.21128423849340092},null,null,null,5363,null,"Úhrady sankcí jiným rozpočtům",null,null,2.1,7244.0483599999998,1143.4286499999998,0.15784387309087483,2.1,618.83935999999994,619.21964999999989,1.0006145213517124,0,6625.2089999999998,524.20899999999995,{"$f":"BG140/BF140","v":7.9123390673411204E-2},null,null,5363,null,"Úhrady sankcí jiným rozpočtům",null,null,118,29771.255000000001,23552.153340000001,0.79110381272136499,118,9565.68,9447.57834,0.98765360538926661,0,20205.575000000001,14104.575000000001,{"$f":"BZ140/BY140","v":0.69805363123791331}]
[{"$error":"#REF!"},"OK",null,null,5649,null,"Ostatní neinvestiční půjčené prostředky veřejným rozpočtům územní úrovně",null,null,0,0,0,"x ",0,0,0,"x ",0,0,0,"x ",null,null,5364,null,"Vratky veřejným rozpočtům ústřední úrovně transferů poskytnutých v minulých rozpočtových obdobích",null,null,201.7,1673.7582,1547.66785,0.9246663287444985,201.7,1659.6181999999999,1533.53385,0.92402809875186964,0,14.14,14.134,{"$f":"AM141/AL141","v":0.99957567185289953},null,null,null,5364,null,"Vratky veřejným rozpočtům ústřední úrovně transferů poskytnutých v minulých rozpočtových obdobích",null,null,227.3,3480.3485800000008,3472.3638300000007,0.99770576141542688,227.3,3039.3817800000006,3031.3977800000007,0.99737315000947335,0,440.96680000000003,440.96605,{"$f":"BG141/BF141","v":0.99999829919168504},null,null,5364,null,"Vratky veřejným rozpočtům ústřední úrovně transferů poskytnutých v minulých rozpočtových obdobích",null,null,16.14,12671.920969999999,11630.06698,0.91778247414369729,16.14,5349.7926299999999,5370.4071499999991,1.0038533306663886,0,7322.1283399999993,6259.6598299999996,{"$f":"BZ141/BY141","v":0.85489621860411147}]
[{"$error":"#REF!"},"OK",null,null,5651,null,"Neinvestiční půjčené prostředky zřízeným příspěvkovým organizacím",null,null,66582.899999999994,99349.481180000002,47340.671359999993,0.47650647791737155,28212.9,38653.686270000006,18350.800670000001,0.4747490457137194,38370,60695.794910000004,28989.870689999996,0.47762568614491835,null,null,5365,null,"Výdaje z finančního vypořádání minulých let mezi krajem a obcemi",null,null,74,251.262,229.96199999999999,0.91522792941232656,74,237.262,219.762,0.92624187606949282,0,14,10.199999999999999,{"$f":"AM142/AL142","v":0.72857142857142854},null,null,null,5365,null,"Platby daní a poplatků krajům, obcím a státním fondům ",null,null,72.111000000000004,103.93100000000001,88.12,0.84787022158932368,72.111000000000004,93.531000000000006,78.37,0.83790401043504292,0,10.4,9.75,{"$f":"BG142/BF142","v":0.9375},null,null,5365,null,"Platby daní a poplatků krajům, obcím a státním fondům ",null,null,29,104.05,74.550000000000011,0.71648246035559837,29,90.05,61.550000000000004,0.68350916157690178,0,14,13,{"$f":"BZ142/BY142","v":0.9285714285714286}]
[null,null,null,null,null,null,null,null,null,null,null,null,null,null,null,null,null,null,null,null,null,null,null,null,null,null,null,null,null,null,null,null,null,null,null,null,null,null,null,null,null,null,null,5366,null,"Výdaje z finančního vypořádání minulých let mezi krajem a obcemi",null,null,0,5864.5781999999999,5885.9124000000002,1.0036378063813696,null,5864.5781999999999,5885.9124000000002,1.0036378063813696,null,null,null,null,null,null,5366,null,"Výdaje z finančního vypořádání minulých let mezi krajem a obcemi",null,null,0,0,0,0,null,null,null,null,null,null,null,0]
[null,null,null,null,null,null,null,null,null,null,null,null,null,null,null,null,null,null,null,null,null,null,null,null,null,null,null,null,null,null,null,null,null,null,null,null,null,null,null,null,null,null,null,5367,null,"Výdaje z finančního vypořádání minulých let mezi obcemi",null,null,83.6,117.6,95.236000000000004,0.80982993197278919,83.6,117.6,95.236000000000004,0.80982993197278919,null,null,null,null,null,null,5367,null,"Výdaje z finančního vypořádání minulých let mezi obcemi",null,null,0,0,0,0,null,null,null,null,null,null,null,0]
[{"$f":"IF(COUNTBLANK(C145:IV145)=254,\"odstr\",IF(AND($A$1=\"TISK\",SUM(J116:U116)=0),\"odstr\",\"OK\"))","v":{"$error":"#REF!"}},"OK",null,null,5659,null,"Neinvestiční půjčené prostředky ostatním příspěvkovým organizacím",null,null,0,330,330,1,0,330,330,1,0,0,0,"x ",null,null,5369,null,"Ostatní neinvestiční transfery jiným veřejným rozpočtům",null,null,155.9,0,0,"x",155.9,0,0,"x",0,0,0,"x",null,null,null,5369,null,"Ostatní neinvestiční transfery jiným veřejným rozpočtům",null,null,null,null,null,null,null,null,null,null,null,null,null,"x",null,null,5369,null,"Ostatní neinvestiční transfery jiným veřejným rozpočtům",null,null,0,0,0,0,0,0,0,0,0,0,0,0]
[{"$f":"IF(COUNTBLANK(C146:IV146)=254,\"odstr\",IF(AND($A$1=\"TISK\",SUM(J117:U117)=0),\"odstr\",\"OK\"))","v":{"$error":"#REF!"}},"OK",null,null,5660,null,"Neinvestiční půjčené prostředky obyvatelstvu",null,null,225,0,0,"x ",225,0,0,"x ",0,0,0,"x ",null,null,54,"Neinvestiční transfery obyvatelstvu","Neinvestiční transfery obyvatelstvu",null,null,{"$f":"AC147+AC151","v":34036.5},{"$f":"AD147+AD151","v":40507.873160000003},{"$f":"AE147+AE151","v":34913.21658},{"$f":"AE146/AD146","v":0.86188718035375611},{"$f":"AG147+AG151","v":25920.5},{"$f":"AH147+AH151","v":30717.004159999997},{"$f":"AI147+AI151","v":26852.388470000002},{"$f":"AI146/AH146","v":0.87418643856445677},{"$f":"AK147+AK151","v":8116},{"$f":"AL147+AL151","v":9790.8689999999988},{"$f":"AM147+AM151","v":8060.8281100000004},{"$f":"AM146/AL146","v":0.8233005783245595},null,null,null,54,"Neinvestiční transfery obyvatelstvu","Neinvestiční transfery obyvatelstvu",null,null,{"$f":"BA146+BE146","v":29443.279999999999},{"$f":"BB146+BF146","v":31299.996279999996},{"$f":"BC146+BG146","v":26548.227709999999},{"$f":"AY146/AX146","v":0.84818628962469644},{"$f":"BA147+BA151","v":22044.28},{"$f":"BB147+BB151","v":21364.660879999996},{"$f":"BC147+BC151","v":19230.749309999999},{"$f":"BC146/BB146","v":0.90011956744899213},{"$f":"BE147+BE151","v":7399},{"$f":"BF147+BF151","v":9935.3353999999999},{"$f":"BG147+BG151","v":7317.4784},{"$f":"BG146/BF146","v":0.73651045539942217},null,null,54,"Neinvestiční transfery obyvatelstvu","Neinvestiční transfery obyvatelstvu",null,null,{"$f":"SUM(BT146,BX146)","v":30419.800000000003},{"$f":"SUM(BU146,BY146)","v":30444.024979999995},20781.069479999998,{"$f":"BR146/BQ146","v":0.68259927830344336},{"$f":"SUM(BT147,BT151)","v":21875.800000000003},{"$f":"SUM(BU147,BU151)","v":20285.754889999997},{"$f":"SUM(BV147,BV151)","v":13474.769019999998},{"$f":"BV146/BU146","v":0.66424784747066423},{"$f":"SUM(BX147,BX151)","v":8544},{"$f":"SUM(BY147,BY151)","v":10158.27009},{"$f":"SUM(BZ147,BZ151)","v":7306.3004600000004},{"$f":"BZ146/BY146","v":0.71924652477910245}]
[null,null,null,null,56,null,"Neinvestiční půjčené prostředky",null,null,70007.899999999994,107848.68018,54839.870360000001,0.50848902618439074,28637.9,40152.885270000006,19849.999670000001,0.49436048086015905,41370,67695.794909999997,34989.870689999996,0.51686919012500299,null,null,542,null,"Náhrady placené obyvatelstvu",null,null,{"$f":"SUM(AC148:AC150)","v":282.25},{"$f":"SUM(AD148:AD150)","v":886.42916000000002},{"$f":"SUM(AE148:AE150)","v":349.42830000000004},0.394197659291804,{"$f":"AG148+AG149+AG150","v":188.25},{"$f":"SUM(AH148:AH150)","v":504.27015999999998},{"$f":"SUM(AI148:AI150)","v":274.48180000000002},0.54431497592480993,{"$f":"AK149","v":94},{"$f":"AL149","v":382.15899999999999},{"$f":"AM149","v":74.9465},{"$f":"AM147/AL147","v":0.19611339782655909},null,null,null,542,"Náhrady placené obyvatelstvu",null,null,null,138.03,1229.25828,429.11180000000002,{"$f":"AY147/AX147","v":0.34908188700587806},{"$f":"SUM(BA148:BA150)","v":108.03},{"$f":"SUM(BB148:BB150)","v":664.82288000000005},{"$f":"SUM(BC148:BC150)","v":269.75540000000001},{"$f":"BC147/BB147","v":0.40575528928847931},{"$f":"SUM(BE148:BE150)","v":30},{"$f":"SUM(BF148:BF150)","v":564.43540000000007},{"$f":"SUM(BG148:BG150)","v":159.35639999999998},{"$f":"BG147/BF147","v":0.28232885463952112},null,null,542,"Náhrady placené obyvatelstvu",null,null,null,245.9,1203.38598,676.25510999999995,{"$f":"BR147/BQ147","v":0.56196026980470548},{"$f":"SUM(BT148:BT150)","v":180.9},{"$f":"SUM(BU148:BU150)","v":657.21588999999983},{"$f":"SUM(BV148:BV150)","v":421.59064999999998},{"$f":"BV147/BU147","v":0.64147969702923657},{"$f":"SUM(BX148:BX150)","v":65},{"$f":"SUM(BY148:BY150)","v":546.17009000000007},{"$f":"SUM(BZ148:BZ150)","v":254.66445999999999},{"$f":"BZ147/BY147","v":0.46627317142174513}]
[{"$f":"IF(COUNTBLANK(C148:IV148)=254,\"odstr\",IF(AND($A$1=\"TISK\",SUM(J118:U118)=0),\"odstr\",\"OK\"))","v":{"$error":"#REF!"}},"OK",null,null,5901,null,"Nespecifikované rezervy",null,null,4497965.0420000004,109816.10424999999,0.5,4.5530662685113425E-6,144930.64199999999,45397.300230000001,0.5,1.1013870813171922E-5,4353034.4000000004,64418.804019999989,0,0,null,null,5421,null,"Náhrady z úrazového pojištění",null,null,10,25,26.5,1.06,10,25,26.5,1.06,0,0,0,"x",null,null,null,5421,null,"Náhrady z úrazového pojištění",null,null,0,32.35,33,{"$f":"AY148/AX148","v":1.0200927357032457},0,32.35,33,{"$f":"BC148/BB148","v":1.0200927357032457},null,null,null,"x",null,null,5421,null,"Náhrady z úrazového pojištění",null,null,25,25,16.5,{"$f":"BR148/BQ148","v":0.66},25,25,16.5,{"$f":"BV148/BU148","v":0.66},0,0,0,0]
[{"$f":"IF(COUNTBLANK(C149:IV149)=254,\"odstr\",IF(AND($A$1=\"TISK\",SUM(J119:U119)=0),\"odstr\",\"OK\"))","v":{"$error":"#REF!"}},"OK",null,null,5902,null,"Ostatní výdaje z finančního vypořádání minulých let",null,null,0,0.1,6.2060000000000004E-2,0.62060000000000004,0,0.1,6.2060000000000004E-2,0.62060000000000004,0,0,0,"x ",null,null,5424,null,"Náhrady mezd v době nemoci",null,null,187.25,771.92916000000002,283.14030000000002,0.36679570441412007,93.25,389.77015999999998,208.19380000000001,0.53414504589063472,94,382.15899999999999,74.9465,{"$f":"AM149/AL149","v":0.19611339782655909},null,null,null,5424,null,"Náhrady mezd v době nemoci",null,null,123.03,1196.9082800000001,396.11180000000002,{"$f":"AY149/AX149","v":0.33094582652565491},93.03,632.47288000000003,236.75540000000001,{"$f":"BC149/BB149","v":0.37433288839198925},30,564.43540000000007,159.35639999999998,{"$f":"BG149/BF149","v":0.28232885463952112},null,null,5424,null,"Náhrady mezd v době nemoci",null,null,220.9,1178.38598,659.75510999999995,{"$f":"BR149/BQ149","v":0.5598803118821899},155.9,632.21588999999983,405.09064999999998,{"$f":"BV149/BU149","v":0.6407473402795999},65,546.17009000000007,254.66445999999999,{"$f":"BZ149/BY149","v":0.46627317142174513}]
[{"$f":"IF(COUNTBLANK(C150:IV150)=254,\"odstr\",IF(AND($A$1=\"TISK\",SUM(J121:U121)=0),\"odstr\",\"OK\"))","v":{"$error":"#REF!"}},"OK",null,null,5909,null,"Ostatní neinvestiční výdaje jinde nezařazené",null,null,909724.18065999995,26312.466189999999,3703.4345800000001,0.14074828840663681,867982.79065999994,17693.018550000001,2872.3579,0.16234414110191503,41741.39,8619.4476399999985,831.0766799999999,9.6418786297076467E-2,null,null,5429,null,"Ostatní náhrady placené obyvatelstvu",null,null,85,89.5,39.787999999999997,0.44455865921787707,85,89.5,39.787999999999997,0.44455865921787707,0,0,0,"x",null,null,null,5429,null,"Ostatní náhrady placené obyvatelstvu",null,null,15,0,0,"x",15,0,0,"x",null,null,null,"x",null,null,5429,null,"Ostatní náhrady placené obyvatelstvu",null,null,0,0,0,0,0,0,0,0,0,0,0,0]
[null,null,null,null,59,null,"Ostatní neinvestiční výdaje",null,null,5407689.2226599995,136128.67043999999,3703.9966400000003,2.7209526310863163E-2,1012913.4326599999,63090.41878,2872.9199600000002,4.5536549218638742E-2,4394775.79,73038.25165999998,831.0766799999999,1.137864969535061E-2,null,null,549,null,"Ostatní neinvestiční transfery obyvatelstvu",null,null,{"$f":"SUM(AC152:AC156)","v":33754.25},{"$f":"SUM(AD152:AD156)","v":39621.444000000003},{"$f":"SUM(AE152:AE156)","v":34563.788280000001},0.87235054532590983,{"$f":"SUM(AG152:AG156)","v":25732.25},{"$f":"SUM(AH152:AH156)","v":30212.733999999997},{"$f":"SUM(AI152:AI156)","v":26577.90667},0.87969220759696898,{"$f":"SUM(AK152:AK156)","v":8022},{"$f":"SUM(AL152:AL156)","v":9408.7099999999991},{"$f":"SUM(AM152:AM156)","v":7985.8816100000004},{"$f":"AM151/AL151","v":0.84877540172882371},null,null,null,549,"Ostatní neinvestiční transfery obyvatelstvu",null,null,null,29305.25,30070.737999999998,26119.11591,{"$f":"AY151/AX151","v":0.86858912175683889},{"$f":"SUM(BA152:BA156)","v":21936.25},{"$f":"SUM(BB152:BB156)","v":20699.837999999996},{"$f":"SUM(BC152:BC156)","v":18960.993910000001},{"$f":"BC151/BB151","v":0.91599721263519085},{"$f":"SUM(BE152:BE156)","v":7369},{"$f":"SUM(BF152:BF156)","v":9370.9},{"$f":"SUM(BG152:BG156)","v":7158.1220000000003},{"$f":"BG151/BF151","v":0.76386707786872132},null,null,549,"Ostatní neinvestiční transfery obyvatelstvu",null,null,null,30173.9,29240.638999999996,20104.81437,{"$f":"BR151/BQ151","v":0.68756412505212361},{"$f":"SUM(BT152:BT156)","v":21694.9},{"$f":"SUM(BU152:BU156)","v":19628.538999999997},{"$f":"SUM(BV152:BV156)","v":13053.178369999998},{"$f":"BV151/BU151","v":0.66501018593385886},{"$f":"SUM(BX152:BX156)","v":8479},{"$f":"SUM(BY152:BY156)","v":9612.1},{"$f":"SUM(BZ152:BZ156)","v":7051.6360000000004},{"$f":"BZ151/BY151","v":0.73362074884780648}]
[{"$f":"IF(COUNTBLANK(C152:IV152)=254,\"odstr\",IF(AND($A$1=\"TISK\",SUM(J123:U123)=0),\"odstr\",\"OK\"))","v":{"$error":"#REF!"}},"OK",null,null,5,null,"Běžné výdaje",null,null,68369775.364409998,130058413.02361995,128801303.79438999,0.99033427211662461,25720178.493410006,32761511.902689993,31909918.22163,0.97400627652382332,42649596.870999992,97296901.120929956,96891385.572759986,0.99583218433991072,null,null,5491,null,"Stipendia studentům a doktorandům",null,null,5516,7125,6522.28,0.9154077192982456,2192,2238,2009.28,0.89780160857908842,3324,4887,4513,0.92347043175772459,null,null,null,5491,null,"Stipendia studentům a doktorandům",null,null,5786,7148,6797.3,0.95093732512590934,2462,2464,2296.8000000000002,0.93214285714285716,3324,4684,4500.5,0.96082408198121261,null,null,5491,null,"Stipendia studentům a doktorandům",null,null,5460,5951.5,5870.5,0.98638998571788628,2130,1720,1639,0.95290697674418601,3330,4231.5,4231.5,1]
[{"$f":"IF(COUNTBLANK(C153:IV153)=254,\"odstr\",IF(AND($A$1=\"TISK\",SUM(J125:U125)=0),\"odstr\",\"OK\"))","v":{"$error":"#REF!"}},"OK",null,null,6111,null,"Programové vybavení",null,null,588,1551.1680000000001,1357.15157,0.87492236172999949,588,1400.2280000000001,1206.2161699999999,0.86144268647677369,0,150.94,150.93539999999999,0.99996952431429698,null,null,5492,null,"Dary obyvatelstvu",null,null,14205.8,16591.713,15254.820809999999,0.9194241010557499,13873.8,16125.013000000001,14835.52081,0.92003155656370628,332,466.7,419.3,0.89843582601242777,null,null,null,5492,null,"Dary obyvatelstvu",null,null,12332.3,8510.7060000000001,7671.9036399999995,0.90144150673281387,11918.3,8110.2060000000001,7271.4036399999995,0.89657446925515816,414,400.5,400.5,1,null,null,5492,null,"Dary obyvatelstvu",null,null,10270.08,8160.6930000000002,6683.3859999999995,0.81897284948716975,10036.08,8025.6930000000002,6548.3859999999995,0.81592779589251663,234,135,135,1]
[{"$f":"IF(COUNTBLANK(C154:IV154)=254,\"odstr\",IF(AND($A$1=\"TISK\",SUM(J126:U126)=0),\"odstr\",\"OK\"))","v":{"$error":"#REF!"}},"OK",null,null,6112,null,"Ocenitelná práva",null,null,0,0,0,"x ",0,0,0,"x ",0,0,0,"x ",null,null,5493,null,"Účelové neinvestiční transfery nepodnikajícím fyzickým osobám",null,null,1682.9,3126.9169999999999,2820.4886099999999,0.90200303046099395,457.9,1830.1669999999999,1532.106,0.83713999869957223,1225,1296.75,1288.3826100000001,0.99354741469057273,null,null,null,5493,null,"Účelové neinvestiční transfery nepodnikajícím fyzickým osobám",null,null,1016,1221.2919999999999,961.44499999999994,0.78723597632670972,251,341.29199999999997,227.39500000000001,0.66627697103946193,765,880,734.05,0.83414772727272724,null,null,5493,null,"Účelové neinvestiční transfery nepodnikajícím fyzickým osobám",null,null,1028,685.84300000000007,483.363,0.70477208340684372,188,249.84300000000002,131.363,0.52578219121608372,840,436,352,0.80733944954128445]
[{"$f":"IF(COUNTBLANK(C155:IV155)=254,\"odstr\",IF(AND($A$1=\"TISK\",SUM(J127:U127)=0),\"odstr\",\"OK\"))","v":{"$error":"#REF!"}},"OK",null,null,6113,null,"Nehmotné výsledky výzkumné a obdobné činnosti",null,null,0,0,0,"x ",0,0,0,"x ",0,0,0,"x ",null,null,5494,null,"Neinvestiční transfery obyvatelstvu nemající charakter daru",null,null,1608,1699.452,1544.9909,0.90911123114980597,702,916.19200000000001,849.56190000000004,0.92727495983374664,906,783.26,695.42899999999997,0.88786482138753409,null,null,null,5494,null,"Neinvestiční transfery obyvatelstvu nemající charakter daru",null,null,1268,1625.5500000000002,1202.0632000000001,0.73948091415213313,437,542.15,438.42120000000006,0.80867140090380907,831,1083.4000000000001,763.64200000000005,0.70485693188111498,null,null,5494,null,"Neinvestiční transfery obyvatelstvu nemající charakter daru",null,null,1645,1425.614,1060.2804899999999,0.74373602531961658,605,414.01399999999995,241.74448999999998,0.583904143338148,1040,1011.6,818.53599999999994,0.8091498616053775]
[{"$f":"IF(COUNTBLANK(V156:IV156)=254,\"odstr\",IF(AND($A$1=\"TISK\",SUM(J128:U128)=0),\"odstr\",\"OK\"))","v":{"$error":"#REF!"}},"OK",null,null,6119,null,"Ostatní nákupy dlouhodobého nehmotného majetku",null,null,10420,6990.2,2047.4988000000001,0.29290990243483739,10420,6990.2,2047.4988000000001,0.29290990243483739,0,0,0,"x ",null,null,5499,null,"Ostatní neinvestiční transfery obyvatelstvu",null,null,10741.55,11078.361999999999,8421.2079599999997,0.76014919534133296,8506.5499999999993,9103.3619999999992,7351.4379600000002,0.80755197475394269,2235,1975,1069.77,0.54165569620253162,null,null,null,5499,null,"Ostatní neinvestiční transfery obyvatelstvu",null,null,8902.9499999999989,11565.189999999999,9486.4040700000005,0.82025492620527651,6867.9499999999989,9242.1899999999987,8726.9740700000002,0.94425391276310067,2035,2323,759.43,0.32691777873439515,null,null,5499,null,"Ostatní neinvestiční transfery obyvatelstvu",null,null,11770.82,13016.989,6007.2848799999992,0.46149573299939023,8735.82,9218.9889999999996,4492.6848799999989,0.48732945445536374,3035,3798,1514.6,0.39878883622959449]
[{"$f":"IF(COUNTBLANK(C157:IV157)=254,\"odstr\",IF(AND($A$1=\"TISK\",SUM(J129:U129)=0),\"odstr\",\"OK\"))","v":{"$error":"#REF!"}},null,null,null,6121,null,"Budovy, haly a stavby",null,null,8809758.7896100003,13742376.018879997,8786988.876459999,0.63940827003918199,7853672.2095499998,11876689.691859996,7924724.1696099993,0.66725025029839913,956086.58005999995,1865686.3270200002,862264.70685000019,0.46217024499893689,null,null,55,"Neinvestiční transfery a související platby do zahraničí","Neinvestiční transfery a související platby do zahraničí",null,null,{"$f":"AC158","v":600},{"$f":"AD158+AD163","v":4196.8385799999996},{"$f":"AE158+AE163","v":3444.9761199999998},0.82085027916417985,{"$f":"AG158+AG163","v":600},{"$f":"AH158+AH163","v":624.6},{"$f":"AI158+AI163","v":624.57501999999999},0.99996000640409854,null,{"$f":"AL163","v":3572.2385800000002},{"$f":"AM158+AM163","v":2820.4011},0.78953323996629587,null,null,null,55,"Neinvestiční transfery a související platby do zahraničí","Neinvestiční transfery a související platby do zahraničí",null,null,299,4259.9715500000002,4163.2643200000002,0.97729862069149265,{"$f":"BA158+BA161+BA163","v":299},{"$f":"BB158+BB161+BB163","v":792.91639000000009},{"$f":"BC158+BC161+BC163","v":792.78014000000007},0.99982816599364277,0,{"$f":"BF158+BF161+BF163","v":3467.0551600000003},{"$f":"BG158+BG161+BG163","v":3370.4841800000004},0.9721461079955821,null,null,55,"Neinvestiční transfery a související platby do zahraničí","Neinvestiční transfery a související platby do zahraničí",null,null,65,3414.5236500000001,1780.5313999999998,0.52145821277295878,{"$f":"SUM(BT158,BT161,BT163)","v":65},{"$f":"SUM(BU158,BU161,BU163)","v":1179.81675},{"$f":"SUM(BV158,BV161,BV163)","v":1178.97506},0.99928659260007968,{"$f":"SUM(BX158,BX161,BX163)","v":0},{"$f":"SUM(BY158,BY161,BY163)","v":2234.7069000000001},{"$f":"SUM(BZ158,BZ161,BZ163)","v":601.55633999999998},0.26918802640292555]
[null,null,null,null,6122,null,"Stroje, přístroje a zařízení",null,null,136430.28399999999,397880.93423000001,312571.15768999996,0.7855896847505498,98730.284,358901.47674000001,292832.79076999996,0.81591414287252328,37700,38979.457490000001,19738.36692,0.50637869767848331,null,null,551,null,"Neinvestiční transfery mezinárodním vládním organizacím a nednárodním orgánům",null,null,{"$f":"SUM(AC159:AC160)","v":600},{"$f":"AD159","v":18},{"$f":"AE159","v":18},1,{"$f":"AG159","v":600},{"$f":"SUM(AH159)","v":18},{"$f":"AI159","v":18},1,0,null,0,"x",null,null,null,551,"Neinvestiční transfery mezinárodním vládním organizacím a nednárodním orgánům",null,null,null,65,66.2,66.19,0.99984894259818724,{"$f":"SUM(BA159:BA160)","v":65},{"$f":"SUM(BB159:BB160)","v":66.2},{"$f":"SUM(BC159:BC160)","v":66.19},0.99984894259818724,null,null,null,"x",null,null,551,"Neinvestiční transfery mezinárodním vládním organizacím a nednárodním orgánům",null,null,null,65,69,68.162499999999994,0.98786231884057962,{"$f":"SUM(BT159:BT160)","v":65},{"$f":"SUM(BU159:BU160)","v":69},{"$f":"SUM(BV159:BV160)","v":68.162499999999994},0.98786231884057962,{"$f":"SUM(BX159:BX160)","v":0},{"$f":"SUM(BY159:BY160)","v":0},{"$f":"SUM(BZ159:BZ160)","v":0},0]
[{"$f":"IF(COUNTBLANK(C159:IV159)=254,\"odstr\",IF(AND($A$1=\"TISK\",SUM(J130:U130)=0),\"odstr\",\"OK\"))","v":{"$error":"#REF!"}},"OK",null,null,6123,null,"Dopravní prostředky",null,null,775.9,1279,1178.327,0.92128772478498822,775.9,1121.7,1117.827,0.99654720513506279,0,157.30000000000001,60.5,0.38461538461538458,null,null,5511,null,"Neinvestiční transfery mezinárodním vládním organizacím",null,null,600,18,18,1,600,18,18,1,0,0,0,"x",null,null,null,5511,"Neinvestiční transfery mezinárodním vládním organizacím",null,null,null,65,66.2,66.19,0.99984894259818724,65,66.2,66.19,0.99984894259818724,null,null,null,"x",null,null,5511,"Neinvestiční transfery mezinárodním vládním organizacím",null,null,null,65,69,68.162499999999994,0.98786231884057962,65,69,68.162499999999994,0.98786231884057962,0,0,0,0]
[{"$f":"IF(COUNTBLANK(C160:IV160)=254,\"odstr\",IF(AND($A$1=\"TISK\",SUM(J131:U131)=0),\"odstr\",\"OK\"))","v":{"$error":"#REF!"}},"OK",null,null,6124,null,"Pěstitelské celky trvalých porostů",null,null,0,0,0,"x ",0,0,0,"x ",null,null,null,"x ",null,null,5513,null,"Vratky neoprávněně použitých nebo zadržených prostředků Evropské unie",null,null,"x",null,null,"x","x",null,null,"x","x",null,null,"x",null,null,null,5513,"Vratky neoprávněně použitých nebo zadržených prostředků Evropské unie",null,null,null,null,null,null,null,null,null,null,null,null,null,null,"x",null,null,5513,"Vratky neoprávněně použitých nebo zadržených prostředků Evropské unie",null,null,null,0,0,0,0,0,0,0,0,0,0,0,0]
[null,null,null,null,null,null,null,null,null,null,null,null,null,null,null,null,null,null,null,null,null,null,null,null,null,null,null,null,null,null,null,null,null,null,null,null,null,null,null,null,null,null,null,552,"Neivestiční transfery cizím státům",null,null,null,{"$f":"BA161+BE161","v":0},389.5,389.42374999999998,{"$f":"AY161/AX161","v":0.99980423620025671},{"$f":"SUM(BA162)","v":0},{"$f":"SUM(BB162)","v":380.5},{"$f":"BC162","v":380.42374999999998},{"$f":"BC161/BB161","v":0.99979960578186589},null,{"$f":"BF162","v":9},{"$f":"BG162","v":9},{"$f":"BG161/BF161","v":1},null,null,552,"Neivestiční transfery cizím státům",null,null,null,0,0,0,0,{"$f":"BT162","v":0},{"$f":"BU162","v":0},{"$f":"BV162","v":0},0,{"$f":"BX162","v":0},{"$f":"BY162","v":0},{"$f":"BZ162","v":0},0]
[null,null,null,null,null,null,null,null,null,null,null,null,null,null,null,null,null,null,null,null,null,null,null,null,null,null,null,null,null,null,null,null,null,null,null,null,null,null,null,null,null,null,null,5520,null,"Neinvestiční transfery cizím státům",null,null,0,389.5,389.42374999999998,{"$f":"AY162/AX162","v":0.99980423620025671},null,380.5,380.42374999999998,{"$f":"BC162/BB162","v":0.99979960578186589},null,9,9,{"$f":"BG162/BF162","v":1},null,null,5520,null,"Neinvestiční transfery cizím státům",null,null,0,{"$f":"SUM(BU162,BY162)","v":0},0,0,0,0,0,0,0,0,0,0]
[null,null,null,null,6125,null,"Výpočetní technika",null,null,1420,16747.72867,11350.419250000001,0.67772887139805804,1420,15882.81,10486.584580000001,0.66024743606452518,0,864.91867000000002,863.83467000000007,0.99874670297034984,null,null,553,null,"Ostatní neinvestiční transfery do zahraničí",null,null,{"$f":"SUM(AC164:AC165)","v":0},{"$f":"AD165","v":4178.8385799999996},{"$f":"AE165","v":3426.9761199999998},{"$f":"AE163/AD163","v":0.82007860662567156},0,{"$f":"AH165","v":606.6},{"$f":"AI165","v":606.57501999999999},{"$f":"AI163/AH163","v":0.99995881965051103},0,{"$f":"AL165","v":3572.2385800000002},{"$f":"AM165","v":2820.4011},{"$f":"AM163/AL163","v":0.78953323996629587},null,null,null,553,"Ostatní neinvestiční transfery do zahraničí",null,null,null,234,3804.2715500000004,3707.6505700000002,{"$f":"AY163/AX163","v":0.97460197603401888},{"$f":"SUM(BA164:BA165)","v":234},{"$f":"SUM(BB164:BB165)","v":346.21639000000005},{"$f":"SUM(BC164:BC165)","v":346.16639000000004},{"$f":"BC163/BB163","v":0.99985558164938404},null,{"$f":"SUM(BF164:BF165)","v":3458.0551600000003},{"$f":"SUM(BG164:BG165)","v":3361.4841800000004},{"$f":"BG163/BF163","v":0.97207361492753053},null,null,553,"Ostatní neinvestiční transfery do zahraničí",null,null,null,0,3345.5236500000001,1712.3688999999999,{"$f":"BR163/BQ163","v":0.51183882678575587},{"$f":"SUM(BT164:BT165)","v":0},{"$f":"SUM(BU164:BU165)","v":1110.81675},{"$f":"SUM(BV164:BV165)","v":1110.8125600000001},{"$f":"BV163/BU163","v":0.9999962280007032},{"$f":"SUM(BX164:BX165)","v":0},{"$f":"SUM(BY164:BY165)","v":2234.7069000000001},{"$f":"SUM(BZ164:BZ165)","v":601.55633999999998},{"$f":"BZ163/BY163","v":0.26918802640292555}]
[{"$f":"IF(COUNTBLANK(C164:IV164)=254,\"odstr\",IF(AND($A$1=\"TISK\",SUM(J132:U132)=0),\"odstr\",\"OK\"))","v":{"$error":"#REF!"}},"OK",null,null,6127,null,"Umělecká díla a předměty",null,null,0,140,0,0,0,140,0,0,0,0,0,"x ",null,null,5531,null,"Peněžní dary do zahraničí",null,null,"x",null,null,"x","x",null,null,"x","x",null,null,"x",null,null,null,5531,null,"Peněžní dary do zahraničí",null,null,null,null,null,null,null,null,null,null,null,null,null,"x",null,null,5531,null,"Peněžní dary do zahraničí",null,null,0,0,0,0,0,0,0,0,0,0,0,0]
[{"$f":"IF(COUNTBLANK(C165:IV165)=254,\"odstr\",IF(AND($A$1=\"TISK\",SUM(J133:U133)=0),\"odstr\",\"OK\"))","v":{"$error":"#REF!"}},"OK",null,null,6129,null,"Nákup dlouhodobého hmotného majetku jinde nezařazený",null,null,1100,12789.332,8892.3039899999985,0.69529073058702351,1100,12789.332,8892.3039899999985,0.69529073058702351,0,0,0,"x ",null,null,5532,null,"Ostatní neinvestiční transfery do zahraničí",null,null,0,4178.8385799999996,3426.9761199999998,{"$f":"AE165/AD165","v":0.82007860662567156},0,606.6,606.57501999999999,{"$f":"AI165/AH165","v":0.99995881965051103},0,3572.2385800000002,2820.4011,{"$f":"AM165/AL165","v":0.78953323996629587},null,null,null,5532,null,"Ostatní neinvestiční transfery do zahraničí",null,null,{"$f":"BA165+BE165","v":234},3804.2715500000004,3707.6505700000002,{"$f":"AY165/AX165","v":0.97460197603401888},234,346.21639000000005,346.16639000000004,{"$f":"BC165/BB165","v":0.99985558164938404},0,3458.0551600000003,3361.4841800000004,{"$f":"BG165/BF165","v":0.97207361492753053},null,null,5532,null,"Ostatní neinvestiční transfery do zahraničí",null,null,0,3345.5236500000001,1712.3688999999999,{"$f":"BR165/BQ165","v":0.51183882678575587},0,1110.81675,1110.8125600000001,{"$f":"BV165/BU165","v":0.9999962280007032},0,2234.7069000000001,601.55633999999998,{"$f":"BZ165/BY165","v":0.26918802640292555}]
[{"$f":"IF(COUNTBLANK(C166:IV166)=254,\"odstr\",IF(AND($A$1=\"TISK\",SUM(J134:U134)=0),\"odstr\",\"OK\"))","v":{"$error":"#REF!"}},"OK",null,null,6130,null,"Pozemky",null,null,16307,58121.672999999995,54726.032599999999,0.94157703615998811,16245,57862.470999999998,54567.888599999998,0.94306184400593607,62,259.202,158.14400000000001,0.61011874908372621,null,null,56,"Neinvestiční půjčené prostředky","Neinvestiční půjčené prostředky",null,null,{"$f":"AC167+AC171+AC177","v":111469.42600000001},{"$f":"AD167+AD171+AD177","v":431952.60839999997},{"$f":"AE167+AE171+AE177","v":390625.79103000002},{"$f":"AE166/AD166","v":0.90432557515260981},{"$f":"AG167+AG171+AG175+AG177+AG180","v":36898.815999999999},{"$f":"AH167+AH171+AH175+AH177+AH180","v":117793.86026},{"$f":"AI167+AI171+AI175+AI177","v":105112.17362999999},{"$f":"AI166/AH166","v":0.89234000310365569},{"$f":"AK167+AK171+AK175+AK177+AK180","v":74570.61},{"$f":"AL171+AL177","v":314158.74814000004},{"$f":"AM167+AM171+AM175+AM177","v":285513.61739999999},{"$f":"AM166/AL166","v":0.9088195668285679},null,null,null,56,"Neinvestiční půjčené prostředky","Neinvestiční půjčené prostředky",null,null,88970.469000000012,296350.53889999999,247332.40849999999,{"$f":"AY166/AX166","v":0.83459409055928668},{"$f":"BA167+BA171+BA175+BA177+BA180","v":77721.27900000001},{"$f":"BB167+BB171+BB175+BB177+BB180","v":180699.66131},{"$f":"BC167+BC171+BC175+BC177+BC180","v":158408.29327999998},{"$f":"BC166/BB166","v":0.87663857326352168},{"$f":"BE167+BE171+BE175+BE177+BE180","v":11249.19},{"$f":"BF167+BF171+BF175+BF177+BF180","v":115650.87759},{"$f":"BG167+BG171+BG175+BG177+BG180","v":88924.115220000007},{"$f":"BG166/BF166","v":0.76890134405421073},null,null,56,"Neinvestiční půjčené prostředky","Neinvestiční půjčené prostředky",null,null,67527.458190000005,290778.52388999995,285375.27470000001,{"$f":"BR166/BQ166","v":0.981417990855322},{"$f":"SUM(BT167,BT171,BT175,BT177,BT180)","v":53671.27319},{"$f":"SUM(BU167,BU171,BU175,BU177,BU180)","v":157426.95486999999},{"$f":"SUM(BV167,BV171,BV175,BV177,BV180)","v":154763.81211999999},{"$f":"BV166/BU166","v":0.98308331154471507},{"$f":"SUM(BX167,BX171,BX175,BX177,BX180)","v":13856.184999999999},{"$f":"SUM(BY167,BY171,BY175,BY177,BY180)","v":133351.56902},{"$f":"SUM(BZ167,BZ171,BZ175,BZ177,BZ180)","v":130611.46258000002},{"$f":"BZ166/BY166","v":0.97945201200003118}]
[null,null,null,null,61,null,"Investiční nákupy a související výdaje",null,null,8976799.9736100007,14237876.054779997,9179111.7673599981,0.64469670420247471,7982951.3935500002,12331777.909599997,8295875.2795199985,0.67272337698052898,993848.58005999995,1906098.1451800002,883236.48784000019,0.46337408704450145,null,null,561,null,"Neinvestiční půjčené prostředky podnikatelským subjektům ",null,null,{"$f":"SUM(AC168:AC170)","v":0},{"$f":"AD168+AD169+AD170","v":599.88499999999999},{"$f":"AE168+AE169","v":599.88499999999999},{"$f":"AE167/AD167","v":1},0,{"$f":"AH168+AH169","v":599.88499999999999},{"$f":"AI168+AI169","v":599.88499999999999},{"$f":"AI167/AH167","v":1},0,null,0,"x",null,null,null,561,"Neinvestiční půjčené prostředky podnikatelským subjektům ",null,null,null,0,0,0,"x",0,0,0,"x",null,null,null,"x",null,null,561,"Neinvestiční půjčené prostředky podnikatelským subjektům ",null,null,null,0,100,100,{"$f":"BR167/BQ167","v":1},{"$f":"SUM(BT168:BT170)","v":0},{"$f":"SUM(BU168:BU170)","v":100},{"$f":"SUM(BV168:BV170)","v":100},{"$f":"BV167/BU167","v":1},{"$f":"SUM(BX168:BX170)","v":0},{"$f":"SUM(BY168:BY170)","v":0},{"$f":"SUM(BZ168:BZ170)","v":0},0]
[{"$f":"IF(COUNTBLANK(C168:IV168)=254,\"odstr\",IF(AND($A$1=\"TISK\",SUM(J135:U135)=0),\"odstr\",\"OK\"))","v":{"$error":"#REF!"}},"OK",null,null,6202,null,"Nákup majetkových podílů",null,null,0,0,0,"x ",0,0,0,"x ",0,0,0,"x ",null,null,5612,null,"Neinvestiční půjčené prostředky nefinančním podnikatelským subjektům – fyzickým osobám",null,null,0,499.88499999999999,499.88499999999999,{"$f":"AE168/AD168","v":1},0,499.88499999999999,499.88499999999999,{"$f":"AI168/AH168","v":1},0,0,0,"x",null,null,null,5612,null,"Neinvestiční půjčené prostředky nefinančním podnikatelským subjektům – fyzickým osobám",null,null,null,null,null,null,null,null,null,null,null,null,null,"x",null,null,5612,null,"Neinvestiční půjčené prostředky nefinančním podnikatelským subjektům – fyzickým osobám",null,null,0,0,0,0,0,0,0,0,0,0,0,0]
[{"$f":"IF(COUNTBLANK(C169:IV169)=254,\"odstr\",IF(AND($A$1=\"TISK\",SUM(J136:U136)=0),\"odstr\",\"OK\"))","v":{"$error":"#REF!"}},"OK",null,null,62,null,"Nákup akcií a majetkových podílů",null,null,0,0,0,"x ",0,0,0,"x ",0,0,0,"x ",null,null,5613,null,"Neinvestiční půjčené prostředky nefinančním podnikatelským subjektům – právnickým osobám",null,null,0,100,100,{"$f":"AE169/AD169","v":1},0,100,100,{"$f":"AI169/AH169","v":1},0,0,0,"x",null,null,null,5613,null,"Neinvestiční půjčené prostředky nefinančním podnikatelským subjektům – právnickým osobám",null,null,null,null,null,null,null,null,null,null,null,null,null,"x",null,null,5613,null,"Neinvestiční půjčené prostředky nefinančním podnikatelským subjektům – právnickým osobám",null,null,0,100,100,{"$f":"BR169/BQ169","v":1},0,100,100,{"$f":"BV169/BU169","v":1},0,0,0,0]
[{"$f":"IF(COUNTBLANK(C170:IV170)=254,\"odstr\",IF(AND($A$1=\"TISK\",SUM(J137:U137)=0),\"odstr\",\"OK\"))","v":{"$error":"#REF!"}},"OK",null,null,6312,null,"Investiční transfery nefinančním podnikatelským subjektům-fyzickým osobám",null,null,0,0,0,"x ",0,0,0,"x ",0,0,0,"x ",null,null,5615,null,"Neinvestiční půjčené prostředky vybraným podnikatelským subjektům ve vlastnictví státu",null,null,"x",0,0,"x","x",0,0,"x","x",0,0,"x",null,null,null,5615,null,"Neinvestiční půjčené prostředky vybraným podnikatelským subjektům ve vlastnictví státu",null,null,null,null,null,null,null,null,null,null,null,null,null,"x",null,null,5615,null,"Neinvestiční půjčené prostředky vybraným podnikatelským subjektům ve vlastnictví státu",null,null,0,0,0,0,0,0,0,0,0,0,0,0]
[null,null,null,null,6313,null,"Investiční dotace nefinančním podnikatelským subjektům – právnickým osobám",null,null,0,1832,1832,1,0,1368,1368,1,0,464,464,1,null,null,562,null,"Neinvestiční půjčené prostředky neziskovým a podobným organizacím ",null,null,{"$f":"SUM(AC172:AC174)","v":500},{"$f":"SUM(AD172:AD174)","v":27813.957629999997},{"$f":"AE172+AE173+AE174","v":21658.989000000001},{"$f":"AE171/AD171","v":0.77870935478231706},{"$f":"AG173","v":500},{"$f":"AH172+AH173+AH174","v":4967.9889999999996},{"$f":"SUM(AI172:AI174)","v":4967.9889999999996},{"$f":"AI171/AH171","v":1},0,{"$f":"SUM(AL172:AL174)","v":22845.968629999999},{"$f":"SUM(AM172:AM174)","v":16691},{"$f":"AM171/AL171","v":0.73058841453902501},null,null,null,562,"Neinvestiční půjčené prostředky neziskovým a podobným organizacím ",null,null,null,{"$f":"BA171+BE171","v":0},32132.940559999999,32132.940559999999,{"$f":"AY171/AX171","v":1},0,{"$f":"SUM(BB172:BB174)","v":500},{"$f":"SUM(BC172:BC174)","v":500},{"$f":"BC171/BB171","v":1},0,{"$f":"SUM(BF172:BF174)","v":31632.940559999999},{"$f":"SUM(BG172:BG174)","v":31632.940559999999},{"$f":"BG171/BF171","v":1},null,null,562,"Neinvestiční půjčené prostředky neziskovým a podobným organizacím ",null,null,null,3000,29414.889000000003,29414.889000000003,{"$f":"BR171/BQ171","v":1},{"$f":"SUM(BT172:BT174)","v":0},{"$f":"SUM(BU172:BU174)","v":0},{"$f":"SUM(BV172:BV174)","v":0},0,{"$f":"SUM(BX172:BX174)","v":3000},{"$f":"SUM(BY172:BY174)","v":29414.889000000003},{"$f":"SUM(BZ172:BZ174)","v":29414.889000000003},{"$f":"BZ171/BY171","v":1}]
[{"$f":"IF(COUNTBLANK(C172:IV172)=254,\"odstr\",IF(AND($A$1=\"TISK\",SUM(J138:U138)=0),\"odstr\",\"OK\"))","v":{"$error":"#REF!"}},"OK",null,null,null,null,null,null,null,null,null,null,null,null,null,null,null,null,null,null,null,null,null,5621,null,"Neinvestiční půjčené prostředky obecně prospěšným společnostem",null,null,0,7750,7750,{"$f":"AE172/AD172","v":1},0,2050,2050,{"$f":"AI172/AH172","v":1},0,5700,5700,{"$f":"AM172/AL172","v":1},null,null,null,5621,null,"Neinvestiční půjčené prostředky obecně prospěšným společnostem",null,null,0,500,500,{"$f":"AY172/AX172","v":1},0,500,500,{"$f":"BC172/BB172","v":1},null,null,null,"x",null,null,5621,null,"Neinvestiční půjčené prostředky obecně prospěšným společnostem",null,null,0,0,0,0,0,0,0,0,0,0,0,0]
[{"$f":"IF(COUNTBLANK(C173:IV173)=254,\"odstr\",IF(AND($A$1=\"TISK\",SUM(J139:U139)=0),\"odstr\",\"OK\"))","v":{"$error":"#REF!"}},null,null,null,6314,null,"Investiční transfery finančním a podobným institucím ve vlastnictví státu",null,null,0,0,0,"x ",0,0,0,"x ",0,0,0,"x ",null,null,5622,null,"Neinvestiční půjčené prostředky občanským sdružením",null,null,500,8865.9686299999994,2711,{"$f":"AE173/AD173","v":0.30577595219846837},500,1156,1156,{"$f":"AI173/AH173","v":1},0,7709.9686300000003,1555,{"$f":"AM173/AL173","v":0.20168694253169742},null,null,null,5622,null,"Neinvestiční půjčené prostředky občanským sdružením",null,null,{"$f":"BA173+BE173","v":0},null,null,null,null,null,null,null,0,6132.94056,6132.94056,{"$f":"BG173/BF173","v":1},null,null,5622,null,"Neinvestiční půjčené prostředky občanským sdružením",null,null,0,8211.4,8211.4,{"$f":"BR173/BQ173","v":1},0,0,0,0,0,8211.4,8211.4,{"$f":"BZ173/BY173","v":1}]
[{"$f":"IF(COUNTBLANK(C174:IV174)=254,\"odstr\",IF(AND($A$1=\"TISK\",SUM(J140:U140)=0),\"odstr\",\"OK\"))","v":{"$error":"#REF!"}},"OK",null,null,6321,null,"Investiční transfery obecně prospěšným organizacím",null,null,604,1705,1555.57,0.91235777126099704,604,1705,1555.57,0.91235777126099704,0,0,0,"x ",null,null,5629,null,"Ostatní neinvestiční půjčené prostředky neziskovým a podobným organizacím",null,null,0,11197.989,11197.989,{"$f":"AE174/AD174","v":1},0,1761.989,1761.989,{"$f":"AI174/AH174","v":1},0,9436,9436,{"$f":"AM174/AL174","v":1},null,null,null,5629,null,"Ostatní neinvestiční půjčené prostředky neziskovým a podobným organizacím",null,null,{"$f":"BA174+BE174","v":0},{"$f":"BB174+BF174","v":25500},{"$f":"BC174+BG174","v":25500},{"$f":"AY174/AX174","v":1},null,null,null,null,0,25500,25500,{"$f":"BG174/BF174","v":1},null,null,5629,null,"Ostatní neinvestiční půjčené prostředky neziskovým a podobným organizacím",null,null,3000,21203.489000000001,21203.489000000001,{"$f":"BR174/BQ174","v":1},0,0,0,0,3000,21203.489000000001,21203.489000000001,{"$f":"BZ174/BY174","v":1}]
[null,null,null,null,6322,null,"Investiční transfery občanským sdružením",null,null,0,3080.279,3065.279,0.99513031124777984,0,2015,2000,0.99255583126550873,0,1065.279,1065.279,1,null,null,564,null,"Neinvestiční půjdčené prostřeky veřejným rozpočtům územní úrovně",null,null,"x","x","x","x",0,null,0,"x",0,null,0,"x",null,null,null,564,"Neinvestiční půjdčené prostřeky veřejným rozpočtům územní úrovně",null,null,null,{"$f":"BA175+BE175","v":0},{"$f":"BB175+BF175","v":0},{"$f":"BC175+BG175","v":0},"x",0,0,0,"x",null,null,null,"x",null,null,564,"Neinvestiční půjdčené prostřeky veřejným rozpočtům územní úrovně",null,null,null,0,0,0,0,{"$f":"BT176","v":0},{"$f":"BU176","v":0},{"$f":"BV176","v":0},0,{"$f":"BX176","v":0},{"$f":"BY176","v":0},{"$f":"BZ176","v":0},0]
[{"$f":"IF(COUNTBLANK(C176:IV176)=254,\"odstr\",IF(AND($A$1=\"TISK\",SUM(J141:U141)=0),\"odstr\",\"OK\"))","v":{"$error":"#REF!"}},"OK",null,null,6323,null,"Investiční transfery církvím a náboženským společnostem",null,null,0,365,300,0.82191780821917804,0,215,150,0.69767441860465118,0,150,150,1,null,null,5649,null,"Ostatní neinvestiční půjčené prostředky veřejným rozpočtům územní úrovně",null,null,"x","x","x","x","x",null,0,"x","x",null,0,"x",null,null,null,5649,null,"Ostatní neinvestiční půjčené prostředky veřejným rozpočtům územní úrovně",null,null,null,null,null,null,null,null,null,null,null,null,null,"x",null,null,5649,null,"Ostatní neinvestiční půjčené prostředky veřejným rozpočtům územní úrovně",null,null,0,0,0,0,0,0,0,0,0,0,0,0]
[null,null,null,null,6329,null,"Ostatní investiční transfery neziskovým a podobným organizacím",null,null,0,488.142,488.14190000000002,0.99999979514157766,0,488.142,488.14190000000002,0.99999979514157766,0,0,0,"x ",null,null,565,null,"Neinvestiční půjčené prostředky příspěvkovým a podobným organizacím ",null,null,{"$f":"SUM(AC178:AC179)","v":110969.42600000001},{"$f":"AD178","v":403538.76577},{"$f":"AE178","v":368366.91703000001},{"$f":"AE177/AD177","v":0.91284146227466423},{"$f":"AG178","v":36398.815999999999},{"$f":"AH178","v":112225.98626000001},{"$f":"AI178","v":99544.299629999994},{"$f":"AI177/AH177","v":0.88699866178391462},{"$f":"AK178","v":74570.61},{"$f":"AL178","v":291312.77951000002},{"$f":"AM178","v":268822.61739999999},{"$f":"AM177/AL177","v":0.92279720049415814},null,null,null,565,"Neinvestiční půjčené prostředky příspěvkovým a podobným organizacím ",null,null,null,{"$f":"BA177+BE177","v":88970.469000000012},264217.59834000003,215199.46794,{"$f":"AY177/AX177","v":0.81447817742661255},{"$f":"SUM(BA178:BA179)","v":77721.27900000001},{"$f":"SUM(BB178:BB179)","v":180199.66131},{"$f":"SUM(BC178:BC179)","v":157908.29327999998},{"$f":"BC177/BB177","v":0.87629628231291812},{"$f":"SUM(BE178:BE179)","v":11249.19},{"$f":"SUM(BF178:BF179)","v":84017.937030000001},{"$f":"SUM(BG178:BG179)","v":57291.174660000004},{"$f":"BG177/BF177","v":0.68189218499310733},null,null,565,"Neinvestiční půjčené prostředky příspěvkovým a podobným organizacím ",null,null,null,64527.458189999998,261263.63488999999,255860.38569999998,{"$f":"BR177/BQ177","v":0.97931878582231724},{"$f":"SUM(BT178:BT179)","v":53671.27319},{"$f":"SUM(BU178:BU179)","v":157326.95486999999},{"$f":"SUM(BV178:BV179)","v":154663.81211999999},{"$f":"BV177/BU177","v":0.98307255897630152},{"$f":"SUM(BX178:BX179)","v":10856.184999999999},{"$f":"SUM(BY178:BY179)","v":103936.68002},{"$f":"SUM(BZ178:BZ179)","v":101196.57358000001},{"$f":"BZ177/BY177","v":0.97363677154713113}]
[{"$f":"IF(COUNTBLANK(C178:IV178)=254,\"odstr\",IF(AND($A$1=\"TISK\",SUM(J142:U142)=0),\"odstr\",\"OK\"))","v":{"$error":"#REF!"}},"OK",null,null,6331,null,"Investiční transfery státnímu rozpočtu",null,null,300,50,50,1,300,50,50,1,0,0,0,"x ",null,null,5651,null,"Neinvestiční půjčené prostředky zřízeným příspěvkovým organizacím",null,null,110969.42600000001,403538.76577,368366.91703000001,{"$f":"AE178/AD178","v":0.91284146227466423},36398.815999999999,112225.98626000001,99544.299629999994,{"$f":"AI178/AH178","v":0.88699866178391462},74570.61,291312.77951000002,268822.61739999999,{"$f":"AM178/AL178","v":0.92279720049415814},null,null,null,5651,null,"Neinvestiční půjčené prostředky zřízeným příspěvkovým organizacím",null,null,88970.469000000012,263817.59834000003,214799.46794,{"$f":"AY178/AX178","v":0.81419688940983015},77721.27900000001,179799.66131,157508.29327999998,{"$f":"BC178/BB178","v":0.87602107886306557},11249.19,84017.937030000001,57291.174660000004,{"$f":"BG178/BF178","v":0.68189218499310733},null,null,5651,null,"Neinvestiční půjčené prostředky zřízeným příspěvkovým organizacím",null,null,{"$f":"SUM(BT178,BX178)","v":64527.458189999998},{"$f":"SUM(BU178,BY178)","v":261263.63488999999},255860.38569999998,{"$f":"BR178/BQ178","v":0.97931878582231724},53671.27319,157326.95486999999,154663.81211999999,{"$f":"BV178/BU178","v":0.98307255897630152},10856.184999999999,103936.68002,101196.57358000001,{"$f":"BZ178/BY178","v":0.97363677154713113}]
[{"$f":"IF(COUNTBLANK(C179:IV179)=254,\"odstr\",IF(AND($A$1=\"TISK\",SUM(J145:U145)=0),\"odstr\",\"OK\"))","v":{"$error":"#REF!"}},"OK",null,null,6335,null,"Investiční transfery státním finančním aktivům",null,null,0,0,0,"x ",0,0,0,"x ",0,0,0,"x ",null,null,5659,null,"Neinvestiční půjčené prostředky ostatním příspěvkovým organizacím",null,null,"x","x","x","x","x","x","x","x","x","x","x","x",null,null,null,5659,null,"Neinvestiční půjčené prostředky ostatním příspěvkovým organizacím",null,null,0,400,400,{"$f":"AY179/AX179","v":1},0,400,400,{"$f":"BC179/BB179","v":1},null,null,null,"x",null,null,5659,null,"Neinvestiční půjčené prostředky ostatním příspěvkovým organizacím",null,null,0,0,0,0,0,0,0,0,0,0,0,0]
[null,null,null,null,6339,null,"Ostatní investiční transfery jiným veřejným rozpočtům",null,null,60,60,0,0,60,60,0,0,0,0,0,"x ",null,null,566,null,"Neinvestiční půjčené prostředky obyvatelstvu",null,null,"x","x","x","x",0,null,0,"x",0,null,"x","x",null,null,null,566,"Neinvestiční půjčené prostředky obyvatelstvu",null,null,null,0,0,0,"x",0,0,0,"x",null,null,null,"x",null,null,566,"Neinvestiční půjčené prostředky obyvatelstvu",null,null,null,0,0,0,0,{"$f":"BT181","v":0},{"$f":"BU181","v":0},{"$f":"BV181","v":0},0,{"$f":"BX181","v":0},{"$f":"BY181","v":0},{"$f":"BZ181","v":0},0]
[{"$f":"IF(COUNTBLANK(C181:IV181)=254,\"odstr\",IF(AND($A$1=\"TISK\",SUM(J146:U146)=0),\"odstr\",\"OK\"))","v":{"$error":"#REF!"}},"OK",null,null,6351,null,"Investiční dotace zřízeným příspěvkovým a podobným organizacím",null,null,1193872.798,2488502.63136,2026160.92405,0.81420887344719262,639711.79799999995,1350701.4188400002,1030414.7503100003,0.76287381943741039,554161,1137801.2125200001,995746.17373999988,0.87514951011049025,null,null,5660,null,"Neinvestiční půjčené prostředky obyvatelstvu",null,null,"x","x","x","x","x",null,"x","x","x",null,"x","x",null,null,null,5660,null,"Neinvestiční půjčené prostředky obyvatelstvu",null,null,null,null,null,null,null,null,null,null,null,null,null,"x",null,null,5660,null,"Neinvestiční půjčené prostředky obyvatelstvu",null,null,0,0,0,0,0,0,0,0,0,0,0,0]
[null,null,null,null,null,null,null,null,null,null,null,null,null,null,null,null,null,null,null,null,null,null,null,null,null,null,null,null,null,null,null,null,null,null,null,null,null,null,null,null,null,null,null,58,"Výdaje na náhrady za nezpůsobenou újmu",null,null,null,{"$f":"BA182+BE182","v":63},96,70.022000000000006,{"$f":"AY182/AX182","v":0.72939583333333335},{"$f":"BA183","v":63},96,70.022000000000006,{"$f":"BC182/BB182","v":0.72939583333333335},null,null,null,null,null,null,58,"Výdaje na náhrady za nezpůsobenou újmu",null,null,null,95,70,37.5,{"$f":"BR182/BQ182","v":0.5357142857142857},{"$f":"BT183","v":95},70,37.5,{"$f":"BV182/BU182","v":0.5357142857142857},{"$f":"BX183","v":0},0,0,0]
[null,null,null,null,null,null,null,null,null,null,null,null,null,null,null,null,null,null,null,null,null,null,null,null,null,null,null,null,null,null,null,null,null,null,null,null,null,null,null,null,null,null,null,581,"Výdaje na náhrady za nezpůsobenou újmu",null,null,null,63,96,70.022000000000006,0.72939583333333335,63,96,70.022000000000006,0.72939583333333335,null,null,null,null,null,null,581,"Výdaje na náhrady za nezpůsobenou újmu",null,null,null,95,70,37.5,0.5357142857142857,95,70,37.5,0.5357142857142857,0,0,0,0]
[null,null,null,null,null,null,null,null,null,null,null,null,null,null,null,null,null,null,null,null,null,null,null,null,null,null,null,null,null,null,null,null,null,null,null,null,null,null,null,null,null,null,null,5811,null,"Výdaje na náhrady za nezpůsobenou újmu",null,null,63,96,70.022000000000006,0.72939583333333335,63,96,70.022000000000006,0.72939583333333335,null,null,null,null,null,null,5811,null,"Výdaje na náhrady za nezpůsobenou újmu",null,null,95,70,37.5,0.5357142857142857,95,70,37.5,0.5357142857142857,0,0,0,0]
[{"$f":"IF(COUNTBLANK(C185:IV185)=254,\"odstr\",IF(AND($A$1=\"TISK\",SUM(J147:U147)=0),\"odstr\",\"OK\"))","v":{"$error":"#REF!"}},"OK",null,null,6352,null,"Investiční dotace vysokým školám",null,null,0,11415,11415,1,0,2525,2525,1,0,8890,8890,1,null,null,59,"Ostatní neinvestiční výdaje","Ostatní neinvestiční výdaje",null,null,{"$f":"AC186","v":6006851.1339999996},{"$f":"AD186","v":195938.09401999996},{"$f":"AE186","v":13204.675789999999},{"$f":"AE185/AD185","v":6.7392080422361153E-2},{"$f":"AG186","v":1193300.064},{"$f":"AH186","v":84060.01801},{"$f":"AI186","v":9407.0254999999997},{"$f":"AI185/AH185","v":0.11190844021566727},{"$f":"AK186","v":4813551.0699999994},{"$f":"AL186","v":111878.07601},{"$f":"AM186","v":3797.65029},{"$f":"AM185/AL185","v":3.3944544145186717E-2},null,null,null,59,"Ostatní neinvestiční výdaje","Ostatní neinvestiční výdaje",null,null,6848468.0599999996,203407.78200000001,12971.599549999999,6.3771402561186172E-2,{"$f":"BA186","v":1364053.665},{"$f":"BB186","v":78220.010320000001},{"$f":"BC186","v":6100.5223099999994},7.7991837191565327E-2,{"$f":"BE186","v":5484414.3949999996},{"$f":"BF186","v":125187.77168000002},{"$f":"BG186","v":6871.0772399999996},{"$f":"BG185/BF185","v":5.4886169374142812E-2},null,null,59,"Ostatní neinvestiční výdaje","Ostatní neinvestiční výdaje",null,null,8636012.4749999996,613407.89367000002,11731.47414,1.9125078534302783E-2,{"$f":"BT186","v":2148431.15},{"$f":"BU186","v":430396.13007000001},{"$f":"BV186","v":4669.6519900000003},1.0849660728223843E-2,{"$f":"BX186","v":6487581.3249999993},{"$f":"BY186","v":183011.76360000001},{"$f":"BZ186","v":7061.82215},{"$f":"BZ185/BY185","v":3.8586711646769793E-2}]
[null,null,null,null,6353,null,"Investiční transfery školským právnickým osobám zřízeným státem, kraji a obcemi",null,null,2973.2750000000001,3474.4167400000001,2014.60374,0.57983940636896658,2973.2750000000001,3474.4167400000001,2014.60374,0.57983940636896658,0,0,0,"x ",null,null,590,null,"Ostatní neinvestiční výdaje",null,null,{"$f":"SUM(AC187:AC190)","v":6006851.1339999996},{"$f":"SUM(AD187:AD190)","v":195938.09401999996},{"$f":"AE188+AE190","v":13204.675789999999},{"$f":"AE186/AD186","v":6.7392080422361153E-2},{"$f":"AG187+AG190","v":1193300.064},{"$f":"AH187+AH188+AH190","v":84060.01801},{"$f":"AI187+AI188+AI190","v":9407.0254999999997},{"$f":"AI186/AH186","v":0.11190844021566727},{"$f":"AK187+AK190","v":4813551.0699999994},{"$f":"AL187+AL190","v":111878.07601},{"$f":"AM190","v":3797.65029},{"$f":"AM186/AL186","v":3.3944544145186717E-2},null,null,null,590,"Ostatní neinvestiční výdaje",null,null,null,6848468.0599999996,203407.78200000001,12971.599549999999,6.3771402561186172E-2,{"$f":"SUM(BA187:BA190)","v":1364053.665},{"$f":"SUM(BB187:BB190)","v":78220.010320000001},{"$f":"SUM(BC187:BC190)","v":6100.5223099999994},7.7991837191565327E-2,{"$f":"SUM(BE187:BE190)","v":5484414.3949999996},{"$f":"SUM(BF187:BF190)","v":125187.77168000002},{"$f":"SUM(BG187:BG190)","v":6871.0772399999996},{"$f":"BG186/BF186","v":5.4886169374142812E-2},null,null,590,"Ostatní neinvestiční výdaje",null,null,null,8636012.4749999996,613407.89367000002,11731.47414,1.9125078534302783E-2,{"$f":"SUM(BT187:BT190)","v":2148431.15},{"$f":"SUM(BU187:BU190)","v":430396.13007000001},{"$f":"SUM(BV187:BV190)","v":4669.6519900000003},1.0849660728223843E-2,{"$f":"SUM(BX187:BX190)","v":6487581.3249999993},{"$f":"SUM(BY187:BY190)","v":183011.76360000001},{"$f":"SUM(BZ187:BZ190)","v":7061.82215},{"$f":"BZ186/BY186","v":3.8586711646769793E-2}]
[{"$f":"IF(COUNTBLANK(C187:IV187)=254,\"odstr\",IF(AND($A$1=\"TISK\",SUM(J148:U148)=0),\"odstr\",\"OK\"))","v":{"$error":"#REF!"}},"OK",null,null,6354,null,"Investiční transfery veřejným výzkumným institucím",null,null,0,0,0,"x ",0,0,0,"x ",0,0,0,"x ",null,null,5901,null,"Nespecifikované rezervy",null,null,4943920.0999999996,148903.25365999999,0,"x",191687.13,66612.701289999997,0,"x",4752232.97,82290.552370000005,0,"x",null,null,null,5901,null,"Nespecifikované rezervy",null,null,5634900.9009999996,137229.05847000002,200,1.457417271748771E-3,183873.226,56865.578719999998,200,3.5170661145431845E-3,5451027.6749999998,80363.479750000013,0,{"$f":"BG187/BF187","v":0},null,null,5901,null,"Nespecifikované rezervy",null,null,6684986.4449999994,303116.55345000001,0,0,304741.55,174213.63946000001,0,0,6380244.8949999996,128902.91399,0,{"$f":"BZ187/BY187","v":0}]
[{"$f":"IF(COUNTBLANK(C188:IV188)=254,\"odstr\",IF(AND($A$1=\"TISK\",SUM(J149:U149)=0),\"odstr\",\"OK\"))","v":{"$error":"#REF!"}},"OK",null,null,6356,null,"Jiné investiční transfery zřízeným příspěvkovým organizacím",null,null,350,128631.74906,80441.803859999985,0.6253650785894086,350,95567.954870000001,47378.023669999995,0.49575219784129293,0,33063.794190000001,33063.780189999998,0.9999995765761206,null,null,5902,null,"Ostatní výdaje z finančního vypořádání minulých let",null,null,0,16.14357,16.14357,{"$f":"AE188/AD188","v":1},0,16.14357,16.14357,{"$f":"AI188/AH188","v":1},0,0,0,"x",null,null,null,5902,null,"Ostatní výdaje z finančního vypořádání minulých let",null,null,null,null,null,null,null,null,null,null,null,null,null,"x",null,null,5902,null,"Ostatní výdaje z finančního vypořádání minulých let",null,null,0,144.65084000000002,144.65084000000002,1,0,144.65084000000002,144.65084000000002,1,null,null,null,0]
[null,null,null,null,null,null,null,null,null,null,null,null,null,null,null,null,null,null,null,null,null,null,null,null,null,null,null,null,null,null,null,null,null,null,null,null,null,null,null,null,null,null,null,5904,null,"Převody domněle neoprávněně použitých dotací zpět poskytovateli",null,null,{"$f":"BA189+BE189","v":0},4150.7350499999993,4111.5845899999995,{"$f":"AY189/AX189","v":0.99056782484827599},0,2228.3722499999999,2189.23315,{"$f":"BC189/BB189","v":0.98243601355204457},null,1922.3627999999997,1922.3514399999997,{"$f":"BG189/BF189","v":0.99999409060558186},null,null,5904,null,"Převody domněle neoprávněně použitých dotací zpět poskytovateli",null,null,74,9682.8571599999996,9507.5854099999997,0.98189875704001406,74,2571.1431099999995,2515.6669500000003,0.97842354251529806,0,7111.7140500000005,6991.9184599999999,{"$f":"BZ189/BY189","v":0.98315517340014524}]
[{"$f":"IF(COUNTBLANK(C190:IV190)=254,\"odstr\",IF(AND($A$1=\"TISK\",SUM(J150:U150)=0),\"odstr\",\"OK\"))","v":{"$error":"#REF!"}},"OK",null,null,6359,null,"Investiční dotace ostatním příspěvkovým organizacím",null,null,75,760.2,623.34500000000003,0.81997500657721656,75,760.2,623.34500000000003,0.81997500657721656,0,0,0,"x ",null,null,5909,null,"Ostatní neinvestiční výdaje jinde nezařazené",null,null,1062931.034,47018.696790000002,13188.532219999999,0.28049548627228121,1001612.934,17431.173149999999,9390.8819299999996,0.53874067162255224,61318.1,29587.523639999999,3797.65029,{"$f":"AM190/AL190","v":0.12835309694069416},null,null,null,5909,null,"Ostatní neinvestiční výdaje jinde nezařazené",null,null,1213567.159,62027.98848,8660.0149600000004,0.13961463481589917,1180180.439,19126.05935,3711.2891599999994,0.19404358692424528,33386.720000000001,42901.929130000004,4948.7258000000002,0.1153497266988749,null,null,5909,null,"Ostatní neinvestiční výdaje jinde nezařazené",null,null,1950952.03,300463.83221999998,2079.2378899999999,6.9200937584979593E-3,1843615.6,253466.69666000002,2009.3342,7.927409109273708E-3,107336.43,46997.135559999995,69.903689999999997,1.4874032037709153E-3]
[null,null,null,null,6371,null,"Účelové investiční transfery nepodnikajícím fyzickým osobám",null,null,0,0,0,"x ",0,0,0,"x ",0,0,0,"x ",null,null,6,null,"KAPITÁLOVÉ VÝDAJE",null,null,{"$f":"AC192+AC208+AC213+AC244+AC260","v":17791054.800779998},{"$f":"AD192+AD208+AD213+AD244+AD260","v":28244967.443350006},{"$f":"AE192+AE208+AE213+AE260","v":20029888.189170003},0.70914892110756667,{"$f":"AG192+AG208+AG213+AG244+AG260","v":13626442.910780001},{"$f":"AH192+AH208+AH213+AH244+AH260","v":20741280.472260006},{"$f":"AI192+AI208+AI213+AI244+AI260","v":15311465.482620003},0.73821216115842048,{"$f":"AK192+AK208+AK213+AK244+AK260","v":4164611.89},{"$f":"AL192+AL208+AL213+AL244+AL260","v":7549566.9710900001},{"$f":"AM192+AM208+AM213+AM260","v":4897393.3783099996},{"$f":"AM191/AL191","v":0.64869858060255314},null,null,null,6,null,"KAPITÁLOVÉ VÝDAJE",null,null,17314690.77668,29332916.602600001,22805647.627070002,0.77747630540934898,{"$f":"BA192+BA208+BA213+BA244+BA260","v":14448258.686679998},{"$f":"BB192+BB208+BB213+BB244+BB260","v":22090106.626090001},{"$f":"BC192+BC208+BC213+BC244+BC260","v":16868972.016130004},0.76364375698424825,{"$f":"BE192+BE208+BE213+BE244+BE260","v":2866432.0900000003},{"$f":"BF192+BF208+BF213+BF244+BF260","v":7242809.9765099995},{"$f":"BG192+BG208+BG213+BG244+BG260","v":5936675.61094},0.8196646923216161,null,null,6,null,"KAPITÁLOVÉ VÝDAJE",null,null,17285483.444429997,26433454.287440002,20083825.821699999,0.75978816855740783,{"$f":"SUM(BT192,BT208,BT213,BT244,BT260)","v":13822596.910429997},{"$f":"SUM(BU192,BU208,BU213,BU244,BU260)","v":20962571.17523},{"$f":"SUM(BV192,BV208,BV213,BV244,BV260)","v":15702470.92464},0.74907180008502527,{"$f":"SUM(BX192,BX208,BX213,BX244,BX260)","v":3462886.534},{"$f":"SUM(BY192,BY208,BY213,BY244,BY260)","v":5470883.1122099999},{"$f":"SUM(BZ192,BZ208,BZ213,BZ244,BZ260)","v":4381354.8970600003},0.80084966306109262]
[{"$f":"IF(COUNTBLANK(C192:IV192)=254,\"odstr\",IF(AND($A$1=\"TISK\",SUM(J151:U151)=0),\"odstr\",\"OK\"))","v":{"$error":"#REF!"}},"OK",null,null,6380,null,"Investiční transfery do zahraničí",null,null,0,0,0,"x ",0,0,0,"x ",0,0,0,"x ",null,null,61,"Investiční nákupy a související výdaje","Investiční nákupy a související výdaje",null,null,{"$f":"AC193+AC198+AC206","v":14758877.76378},{"$f":"AD193+AD198+AD206","v":23012728.943360005},{"$f":"AE193+AE198+AE206","v":16678216.326730002},0.72473874644676872,{"$f":"AG193+AG198+AG206","v":12631127.553780001},{"$f":"AH193+AH198+AH206","v":18999420.441210005},{"$f":"AI193+AI198+AI206","v":13769173.630480003},0.72471545503643231,{"$f":"AK193+AK198+AK206","v":2127750.21},{"$f":"AL193+AL198+AL206","v":4059188.5021500001},{"$f":"AM193+AM198+AM206","v":2909042.6962499996},{"$f":"AM192/AL192","v":0.71665622197865131},null,null,null,61,"Investiční nákupy a související výdaje","Investiční nákupy a související výdaje",null,null,14846742.95599,23033694.029800002,17278152.443190001,0.75012511761406009,{"$f":"BA193+BA198+BA206","v":13308572.155989999},{"$f":"BB193+BB198+BB206","v":19900908.794950001},{"$f":"BC193+BC198+BC206","v":15018967.782610001},0.75468753398946142,{"$f":"BE193+BE198+BE206","v":1538170.8},{"$f":"BF193+BF198+BF206","v":3132785.2348499992},{"$f":"BG193+BG198+BG206","v":2259184.6605799999},0.72114252692721592,null,null,61,"Investiční nákupy a související výdaje","Investiční nákupy a související výdaje",null,null,14877640.368849998,21463247.172170002,15909932.348599998,0.74126399519031649,{"$f":"SUM(BT193,BT198,BT206)","v":12780641.164849998},{"$f":"SUM(BU193,BU198,BU206)","v":18596495.329640001},{"$f":"SUM(BV193,BV198,BV206)","v":13864820.974419998},0.74556096343172629,{"$f":"SUM(BX193,BX198,BX206)","v":2096999.2039999999},{"$f":"SUM(BY193,BY198,BY206)","v":2866751.84253},{"$f":"SUM(BZ193,BZ198,BZ206)","v":2045111.3741800005},0.71338974788104592]
[null,null,null,null,63,null,"Investiční transfery",null,null,1198235.0729999999,2640364.4181600004,2127946.6675499999,0.80592915618553485,644074.07299999997,1458930.1324500002,1088567.4346200002,0.74614089489806812,554161,1181434.2857100002,1039379.2329299998,0.8797605127105057,null,null,611,null,"Pořízení dlouhodobého nehmotného majetku",null,null,{"$f":"SUM(AC194:AC197)","v":9826.2999999999993},{"$f":"SUM(AD194:AD197)","v":55831.78095},38261.815609999998,0.68530530387818478,{"$f":"SUM(AG194:AG197)","v":5095.3},{"$f":"SUM(AH194:AH197)","v":23722.408640000001},{"$f":"SUM(AI194:AI197)","v":17239.351289999999},0.72671167382773816,{"$f":"SUM(AK194:AK197)","v":4731},{"$f":"SUM(AL194:AL197)","v":32109.372309999999},{"$f":"SUM(AM194:AM197)","v":21022.464319999999},{"$f":"AM193/AL193","v":0.65471427211465161},null,null,null,611,"Pořízení dlouhodobého nehmotného majetku",null,null,null,12220.03,61465.301679999997,57489.521029999996,0.93531666580441319,{"$f":"SUM(BA194:BA197)","v":12220.03},{"$f":"SUM(BB194:BB197)","v":48382.200549999994},{"$f":"SUM(BC194:BC197)","v":44463.028719999995},0.91899558545399818,0,{"$f":"SUM(BF194:BF197)","v":13083.101130000001},{"$f":"SUM(BG194:BG197)","v":13026.49231},0.99567313441687033,null,null,611,"Pořízení dlouhodobého nehmotného majetku",null,null,null,8236.5789999999997,23636.860769999999,-3260.7784900000006,-0.13795311152903156,{"$f":"SUM(BT194:BT197)","v":6714.5290000000005},{"$f":"SUM(BU194:BU197)","v":20064.85039},{"$f":"SUM(BV194:BV197)","v":-4521.8308100000004},-0.22536080369946881,{"$f":"SUM(BX194:BX197)","v":1522.05},{"$f":"SUM(BY194:BY197)","v":3572.0103800000002},{"$f":"SUM(BZ194:BZ197)","v":1261.05232},0.35303713759084876]
[{"$f":"IF(COUNTBLANK(C194:IV194)=254,\"odstr\",IF(AND($A$1=\"TISK\",SUM(J152:U152)=0),\"odstr\",\"OK\"))","v":{"$error":"#REF!"}},"OK",null,null,6412,null,"Investiční půjčené prostředky nefinančním podnikatelským subjektům – fyzickým osobám",null,null,0,0,0,"x ",0,0,0,"x ",0,0,0,"x ",null,null,6111,null,"Programové vybavení",null,null,4733,49263.180950000002,32966.4444,0.66919033168928976,1532,17153.808639999999,11943.980079999999,0.69628735697496968,3201,32109.372309999999,21022.464319999999,{"$f":"AM194/AL194","v":0.65471427211465161},null,null,null,6111,null,"Programové vybavení",null,null,8995.09,51355.581679999996,48746.586029999991,0.94919742772544513,8995.09,38629.430549999997,36077.043719999994,0.93392636666760276,0,12726.15113,12669.542309999999,0.99555177214055279,null,null,6111,null,"Programové vybavení",null,null,3781.5789999999997,{"$f":"SUM(BU194,BY194)","v":19047.31077},16214.20493,0.85125953609880645,2259.529,16062.150389999999,15144.591549999999,0.94287447086965048,1522.05,2985.1603800000003,1069.61338,0.35831018901570705]
[{"$f":"IF(COUNTBLANK(C195:IV195)=254,\"odstr\",IF(AND($A$1=\"TISK\",SUM(J153:U153)=0),\"odstr\",\"OK\"))","v":{"$error":"#REF!"}},"OK",null,null,6413,null,"Investiční půjčené prostředky nefinančním podnikatelským subjektům – právnickým osobám",null,null,0,770.7,770.649,0.99993382639159201,0,770.7,770.649,0.99993382639159201,0,0,0,"x ",null,null,6112,null,"Ocenitelná práva",null,null,600,0,0,"x",600,0,0,"x",0,0,0,"x",null,null,null,6112,null,"Ocenitelná práva",null,null,null,null,null,null,null,null,null,null,null,null,null,"x",null,null,6112,null,"Ocenitelná práva",null,null,0,0,-20000,0,0,0,-20000,0,0,0,0,0]
[{"$f":"IF(COUNTBLANK(C196:IV196)=254,\"odstr\",IF(AND($A$1=\"TISK\",SUM(J154:U154)=0),\"odstr\",\"OK\"))","v":{"$error":"#REF!"}},"OK",null,null,6421,null,"Investiční půjčené prostředky obecně prospěšným organizacím",null,null,0,0,0,"x ",0,0,0,"x ",0,0,0,"x ",null,null,6113,null,"Nehmotné výsledky výzkumné a obdobné činnosti",null,null,0,0,0,"x",",",0,0,"x",0,0,null,"x",null,null,null,6113,null,"Nehmotné výsledky výzkumné a obdobné činnosti",null,null,null,null,null,null,null,null,null,null,null,null,null,"x",null,null,6113,null,"Nehmotné výsledky výzkumné a obdobné činnosti",null,null,0,0,0,0,0,0,0,0,0,0,0,0]
[{"$f":"IF(COUNTBLANK(C197:IV197)=254,\"odstr\",IF(AND($A$1=\"TISK\",SUM(J155:U155)=0),\"odstr\",\"OK\"))","v":{"$error":"#REF!"}},"OK",null,null,6422,null,"Investiční půjčené prostředky občanským sdružením",null,null,0,0,0,"x ",0,0,0,"x ",0,0,0,"x ",null,null,6119,null,"Ostatní nákupy dlouhodobého nehmotného majetku",null,null,4493.3,6568.6,5295.3712100000002,{"$f":"AE197/AD197","v":0.80616435922418783},2963.3,6568.6,5295.3712100000002,{"$f":"AI197/AH197","v":0.80616435922418783},1530,0,0,"x",null,null,null,6119,null,"Ostatní nákupy dlouhodobého nehmotného majetku",null,null,{"$f":"BA197+BE197","v":3224.94},10109.720000000001,8742.9350000000013,{"$f":"AY197/AX197","v":0.86480486106440146},3224.94,9752.77,8385.9850000000006,{"$f":"BC197/BB197","v":0.85985673813696006},0,356.95,356.95,{"$f":"BG197/BF197","v":1},null,null,6119,null,"Ostatní nákupy dlouhodobého nehmotného majetku",null,null,4455,4589.55,525.01657999999998,{"$f":"BR197/BQ197","v":0.11439391225719296},4455,4002.7000000000003,333.57764000000003,{"$f":"BV197/BU197","v":8.3338156744197672E-2},0,586.85,191.43894,{"$f":"BZ197/BY197","v":0.32621443298969072}]
[null,null,null,null,6429,null,"Ostatní investiční půjčené prostředky neziskovým a podobným organizacím",null,null,0,180.5,180.5,1,0,180.5,180.5,1,0,0,0,"x ",null,null,612,null,"Pořízení dlouhodobého hmotného majektu",null,null,{"$f":"SUM(AC199:AC205)","v":14695667.063779999},{"$f":"SUM(AD199:AD205)","v":22876965.038410004},16521431.852320001,{"$f":"AE198/AD198","v":0.72218634878275245},{"$f":"SUM(AG199:AG205)","v":12587084.85378},{"$f":"SUM(AH199:AH205)","v":18876580.248570003},{"$f":"SUM(AI199:AI205)","v":13654972.912390001},{"$f":"AI198/AH198","v":0.72338171070072055},{"$f":"SUM(AK199:AK205)","v":2108582.21},{"$f":"SUM(AL199:AL205)","v":4000384.7898400002},{"$f":"SUM(AM199:AM205)","v":2866458.9399299999},{"$f":"AM198/AL198","v":0.71654580509607602},null,null,null,612,"Pořízení dlouhodobého hmotného majektu",null,null,null,14828624.725990001,22903450.156119999,17156382.75406,{"$f":"AY198/AX198","v":0.74907416293678653},{"$f":"SUM(BA199:BA205)","v":13292453.92599},{"$f":"SUM(BB199:BB205)","v":19792257.372400001},{"$f":"SUM(BC199:BC205)","v":14914237.86579},{"$f":"BC198/BB198","v":0.75353900190221235},{"$f":"SUM(BE199:BE205)","v":1536170.8},{"$f":"SUM(BF199:BF205)","v":3111192.7837199993},{"$f":"SUM(BG199:BG205)","v":2242144.88827},{"$f":"BG198/BF198","v":0.72067050939514787},null,null,612,"Pořízení dlouhodobého hmotného majektu",null,null,null,14851603.789849998,21397382.812060002,15885185.910089998,0.74238920010052734,{"$f":"SUM(BT199:BT205)","v":12756126.635849999},{"$f":"SUM(BU199:BU205)","v":18543076.774910003},{"$f":"SUM(BV199:BV205)","v":13844161.383229997},{"$f":"BV198/BU198","v":0.74659462133932675},{"$f":"SUM(BX199:BX205)","v":2095477.1539999999},{"$f":"SUM(BY199:BY205)","v":2854306.0371500002},{"$f":"SUM(BZ199:BZ205)","v":2041024.5268600006},0.71506856668318086]
[{"$f":"IF(COUNTBLANK(C199:IV199)=254,\"odstr\",IF(AND($A$1=\"TISK\",SUM(J156:U156)=0),\"odstr\",\"OK\"))","v":{"$error":"#REF!"}},"OK",null,null,6451,null,"Investiční půjčené prostředky zřízeným příspěvkovým organizacím",null,null,208213,242192.74198000002,132150.36950999999,0.5456413285948627,0,757,757,1,208213,241435.74198000002,131393.36950999999,0.54421672794777964,null,null,6121,null,"Budovy, haly a stavby",null,null,14233661.664039999,21426356.589590002,15370861.977390001,{"$f":"AE199/AD199","v":0.7173810401745081},12364189.45404,18100969.610010002,12984891.28324,{"$f":"AI199/AH199","v":0.71735887982814117},1869472.21,3325386.97958,2385970.6941499999,{"$f":"AM199/AL199","v":0.71750166485927314},null,null,null,6121,null,"Budovy, haly a stavby",null,null,14519183.768000001,21639974.836679999,16087391.55452,{"$f":"AY199/AX199","v":0.7434108253791355},12987172.968,18824579.346999999,14118236.6303,{"$f":"BC199/BB199","v":0.7499894882139807},1532010.8,2815395.4896799992,1969154.9242199999,{"$f":"BG199/BF199","v":0.69942391093473555},null,null,6121,null,"Budovy, haly a stavby",null,null,14496843.266709998,20430646.11538,15080848.35348,0.73814838103075353,12460666.112709999,17705773.303460002,13150085.94049,{"$f":"BV199/BU199","v":0.74270045793030992},2036177.1539999999,2724872.8119199998,1930762.4129900006,0.70856973747319485]
[{"$f":"IF(COUNTBLANK(C200:IV200)=254,\"odstr\",IF(AND($A$1=\"TISK\",SUM(J157:U157)=0),\"odstr\",\"OK\"))","v":{"$error":"#REF!"}},"OK",null,null,6452,null,"Investiční půjčené prostředky vysokým školám",null,null,0,5000,5000,1,0,5000,5000,1,0,0,0,"x ",null,null,6122,null,"Stroje, přístroje a zařízení",null,null,426116.39974000002,1228191.62319,971526.52104999998,{"$f":"AE200/AD200","v":0.79102194047427232},210996.39973999999,652459.38104999997,564634.68435,{"$f":"AI200/AH200","v":0.86539438430839311},215120,575732.24213999999,406891.83669999999,{"$f":"AM200/AL200","v":0.70673797108805425},null,null,null,6122,null,"Stroje, přístroje a zařízení",null,null,218519.52799,1034222.11335,898051.65583000006,{"$f":"AY200/AX200","v":0.86833538389647902},214419.52799,770769.84120000002,654826.17356000002,{"$f":"BC200/BB200","v":0.8495742030338278},4100,263452.27214999998,243225.48227000007,{"$f":"BG200/BF200","v":0.92322408262061406},null,null,6122,null,"Stroje, přístroje a zařízení",null,null,305511.30813999998,772952.24011000001,683400.41801000002,0.88414313659631061,248511.30813999998,651883.44652,580493.54894000001,{"$f":"BV200/BU200","v":0.89048671513119992},57000,121068.79359,102906.86906999999,0.84998673909723221]
[{"$f":"IF(COUNTBLANK(C201:IV201)=254,\"odstr\",IF(AND($A$1=\"TISK\",SUM(J158:U158)=0),\"odstr\",\"OK\"))","v":{"$error":"#REF!"}},"OK",null,null,64,null,"Investiční půjčené prostředky",null,null,208213,248143.94198000003,138101.51850999999,0.55653794087437658,0,6708.2,6708.1489999999994,0.99999239736441958,208213,241435.74198000002,131393.36950999999,0.54421672794777964,null,null,6123,null,"Dopravní prostředky",null,null,6203,52837.855230000001,51031.294869999998,{"$f":"AE201/AD201","v":0.96580935482456365},1650,2566.944,2513.4960500000002,{"$f":"AI201/AH201","v":0.9791783731939615},4553,50270.911229999998,48517.798820000004,{"$f":"AM201/AL201","v":0.96512670315484961},null,null,null,6123,null,"Dopravní prostředky",null,null,780,13111.139990000001,10547.330480000001,{"$f":"AY201/AX201","v":0.80445563757572225},780,2815.5,2684.252,{"$f":"BC201/BB201","v":0.95338376842479133},0,10295.639990000001,7863.0784800000001,{"$f":"BG201/BF201","v":0.76372896562402037},null,null,6123,null,"Dopravní prostředky",null,null,515.79999999999995,1819.67166,2321.8535899999997,1.2759739248782935,515.79999999999995,192.8,997.51549,{"$f":"BV201/BU201","v":5.1738355290456433},0,1626.87166,1324.3380999999999,0.81403968890822032]
[{"$f":"IF(COUNTBLANK(C202:IV202)=254,\"odstr\",IF(AND($A$1=\"TISK\",SUM(J159:U159)=0),\"odstr\",\"OK\"))","v":{"$error":"#REF!"}},"OK",null,null,6901,null,"Rezervy kapitálových výdajů",null,null,277526.41599999997,94835.10514,0,0,203160.416,23716.345829999998,0,0,74366,71118.759310000009,0,0,null,null,6124,null,"Pěstitelské celky trvalých porostů",null,null,0,0,0,"x",0,0,0,"x",0,0,0,"x",null,null,null,6124,null,"Pěstitelské celky trvalých porostů",null,null,null,null,null,null,null,null,null,null,null,null,null,"x",null,null,6124,null,"Pěstitelské celky trvalých porostů",null,null,0,1323.075,1323.075,1,0,0,0,0,0,1323.075,1323.075,1]
[{"$f":"IF(COUNTBLANK(C203:IV203)=254,\"odstr\",IF(AND($A$1=\"TISK\",SUM(J160:U160)=0),\"odstr\",\"OK\"))","v":{"$error":"#REF!"}},"OK",null,null,6909,null,"Ostatní kapitálové výdaje jinde nezařazené",null,null,70487,0,0,"x ",0,0,0,"x ",70487,0,0,"x ",null,null,6125,null,"Výpočetní technika",null,null,23729,147578.37450999999,109201.08215,{"$f":"AE203/AD203","v":0.7399531436267478},5189,98652.931620000003,84122.471890000001,{"$f":"AI203/AH203","v":0.85271132351170564},18540,48925.442889999998,25078.610260000001,{"$f":"AM203/AL203","v":0.5125883135362661},null,null,null,6125,null,"Výpočetní technika",null,null,{"$f":"BA203+BE203","v":75136.429999999993},183650.96710000004,125133.28265000002,{"$f":"AY203/AX203","v":0.68136468119911142},75076.429999999993,161601.58520000003,103231.87935000002,{"$f":"BC203/BB203","v":0.63880486829531424},60,22049.381899999997,21901.403300000005,{"$f":"BG203/BF203","v":0.99328876425329682},null,null,6125,null,"Výpočetní technika",null,null,46283.415000000001,172233.83578000002,101184.66106999999,0.58748422231765485,43983.415000000001,166819.35080000001,96476.829369999992,{"$f":"BV203/BU203","v":0.57833116426442766},2300,5414.4849800000011,4707.8317000000006,0.86948836637090454]
[{"$f":"IF(COUNTBLANK(C204:IV204)=254,\"odstr\",IF(AND($A$1=\"TISK\",SUM(J163:U163)=0),\"odstr\",\"OK\"))","v":{"$error":"#REF!"}},"OK",null,null,69,null,"Ostatní kapitálové výdaje",null,null,348013.41599999997,94835.10514,0,0,203160.416,23716.345829999998,0,0,144853,71118.759310000009,0,0,null,null,6127,null,"Umělecká díla a předměty",null,null,100,54,53.978999999999999,0.99961111111111112,100,54,53.978999999999999,0.99961111111111112,0,0,0,"x",null,null,null,6127,null,"Umělecká díla a předměty",null,null,0,163,163,1,0,163,163,{"$f":"BC204/BB204","v":1},null,null,null,"x",null,null,6127,null,"Umělecká díla a předměty",null,null,0,52,51,0.98076923076923073,0,52,51,0.98076923076923073,0,0,0,0]
[{"$f":"IF(COUNTBLANK(C205:IV205)=254,\"odstr\",IF(AND($A$1=\"TISK\",SUM(J164:U164)=0),\"odstr\",\"OK\"))","v":{"$error":"#REF!"}},"OK",null,null,6,null,"Kapitálové výdaje",null,null,10731261.462609999,17221219.520059995,11445159.953419998,0.66459636845626402,8830185.8825499993,13821132.587879995,9391150.8631399982,0.67947766244390639,1901075.5800600001,3400086.9321800005,2054009.0902800001,0.60410487474302643,null,null,6129,null,"Nákup dlouhodobého hmotného majetku jinde nezařazený",null,null,5857,21946.595890000001,18756.997859999999,0.8546654776901712,4960,21877.381890000001,18756.997859999999,0.85736940344647428,897,69.213999999999999,0,"x",null,null,null,6129,null,"Nákup dlouhodobého hmotného majetku jinde nezařazený",null,null,15005,32328.099000000002,35095.93058,1.0856168987851713,15005,32328.099000000002,35095.93058,{"$f":"BC205/BB205","v":1.0856168987851713},null,null,null,"x",null,null,6129,null,"Nákup dlouhodobého hmotného majetku jinde nezařazený",null,null,2450,18355.87413,16056.548940000001,0.87473627386439268,2450,18355.87413,16056.548940000001,0.87473627386439268,0,0,0,0]
[null,null,null,null,"Výdaje kapitoly 700-Obce a DSO; KÚ (část: vzdělávání) celkem",null,null,null,null,79101036.827019989,147279632.54367995,140246463.74780998,0.95224615464881679,34550364.375960007,46582644.490569986,41301069.084769994,0.8866192449235214,44550672.45105999,100696988.05310996,98945394.663039982,0.98260530504501142,null,null,613,null,"Pozemky",null,null,{"$f":"SUM(AC207:AC209)","v":53384.4},{"$f":"AD207","v":79932.123999999996},{"$f":"SUM(AE207:AE209)","v":118522.6588},1.482791309286364,{"$f":"AG207","v":38947.4},{"$f":"SUM(AH207:AH209)","v":99117.784},{"$f":"SUM(AI207:AI209)","v":96961.366800000003},0.97824389213544161,{"$f":"AK207","v":14437},{"$f":"SUM(AL207:AL209)","v":26694.34},{"$f":"SUM(AM207:AM209)","v":21561.292000000001},{"$f":"AM206/AL206","v":0.80771024868942265},null,null,null,613,"Pozemky",null,null,null,5898.2,68778.572,64280.168100000003,0.93459585203368289,{"$f":"BA207","v":3898.2},{"$f":"BB207","v":60269.222000000002},{"$f":"BC207","v":60266.888100000004},{"$f":"BC206/BB206","v":0.99996127542512503},{"$f":"SUM(BE207)","v":2000},{"$f":"SUM(BF207)","v":8509.35},{"$f":"SUM(BG207)","v":4013.28},{"$f":"BG206/BF206","v":0.47163179326270516},null,null,613,"Pozemky",null,null,null,17800,42227.499339999995,28007.217000000004,0.66324592831075291,{"$f":"BT207","v":17800},{"$f":"BU207","v":33353.704339999997},{"$f":"BV207","v":25181.422000000002},0.75498126814660149,{"$f":"BX207","v":0},{"$f":"BY207","v":8873.7950000000001},{"$f":"BZ207","v":2825.7950000000001},{"$f":"BZ206/BY206","v":0.31844267306152552}]
[{"$f":"IF(COUNTBLANK(C207:IV207)=254,\"odstr\",IF(AND($A$1=\"TISK\",SUM(J165:U165)=0),\"odstr\",\"OK\"))","v":{"$error":"#REF!"}},"OK",null,"Komentáře:",null,null,null,null,null,null,null,null,null,null,null,null,null,null,null,null,"Zdroj: Závěrečný účet – kapitola 700-Obce a DSO; KÚ (část: vzdělávání)",null,null,6130,null,"Pozemky",null,null,53384.4,79932.123999999996,72642.658800000005,0.90880431001683393,38947.4,54237.784,52081.366800000003,0.96024142136780521,14437,25694.34,20561.292000000001,{"$f":"AM207/AL207","v":0.80022650902883674},null,null,null,6130,null,"Pozemky",null,null,5898.2,68778.572,64280.168100000003,0.93459585203368289,3898.2,60269.222000000002,60266.888100000004,{"$f":"BC207/BB207","v":0.99996127542512503},2000,8509.35,4013.28,{"$f":"BG207/BF207","v":0.47163179326270516},null,null,6130,null,"Pozemky",null,null,17800,42227.499339999995,28007.217000000004,0.66324592831075291,17800,33353.704339999997,25181.422000000002,0.75498126814660149,0,8873.7950000000001,2825.7950000000001,{"$f":"BZ207/BY207","v":0.31844267306152552}]
[{"$f":"IF(COUNTBLANK(C208:IV208)=254,\"odstr\",IF(AND($A$1=\"TISK\",SUM(J166:U166)=0),\"odstr\",\"OK\"))","v":{"$error":"#REF!"}},"OK",null,"1)","Tabulka neobsahuje z daných tříd následující položky: 5321, 5323, 5329, 5344, 5345, 5349, 5366, 5367, 5641, 5642, 5649, 6341, 6342, 6349, 6441, 6442, 6449.",null,null,null,null,null,null,null,null,null,null,null,null,null,null,null,null,null,null,62,"Nákup akcií a majetkových podílů a vklady do fundací a ústavů","Nákup akcií a majetkových podílů  a vklady do fundací a ústavů",null,null,{"$f":"AC210","v":0},{"$f":"AD209+AD210","v":23440},{"$f":"AE209+AE210","v":23440},1,{"$f":"AG209+AG210","v":0},{"$f":"AH209+AH210","v":22440},{"$f":"AI209+AI210","v":22440},1,{"$f":"AK209+AK210","v":0},{"$f":"AL209+AL210","v":1000},{"$f":"AM209+AM212","v":1000},{"$f":"AM208/AL208","v":1},null,null,null,62,"Nákup akcií a majetkových podílů a vklady do fundací a ústavů","Nákup akcií a majetkových podílů  a vklady do fundací a ústavů",null,null,0,1000,1000,1,0,0,0,"x",{"$f":"SUM(BE210+BE209)","v":0},{"$f":"BF210","v":1000},{"$f":"BG210","v":1000},{"$f":"BG208/BF208","v":1},null,null,62,"Nákup akcií a majetkových podílů a vklady do fundací a ústavů","Nákup akcií a majetkových podílů  a vklady do fundací a ústavů",null,null,1003,1003,1000,0.99700897308075775,{"$f":"SUM(BT209,BT210)","v":3},{"$f":"SUM(BU209,BU210)","v":3},{"$f":"SUM(BV209,BV210)","v":0},0,{"$f":"SUM(BX209,BX210)","v":1000},{"$f":"SUM(BY209,BY210)","v":1000},{"$f":"SUM(BZ209,BZ210)","v":1000},{"$f":"BZ208/BY208","v":1}]
[{"$f":"IF(COUNTBLANK(C209:IV209)=254,\"odstr\",IF(AND($A$1=\"TISK\",SUM(J167:U167)=0),\"odstr\",\"OK\"))","v":{"$error":"#REF!"}},"OK",null,null,null,null,null,null,null,null,null,null,null,null,null,null,null,null,null,null,null,null,null,6202,null,"Nákup majetkových podílů",null,null,0,22440,22440,1,0,22440,22440,1,0,0,0,"x",null,null,null,6202,null,"Nákup majetkových podílů",null,null,null,null,null,null,null,null,null,null,null,null,null,"x",null,null,6202,null,"Nákup majetkových podílů",null,null,0,0,0,0,0,0,0,0,0,0,0,0]
[null,null,null,null,null,null,null,null,null,null,null,null,null,null,null,null,null,null,null,null,null,null,null,621,null,"Vklady do fundací a ústavů",null,null,{"$f":"AC212","v":0},{"$f":"AD212","v":1000},1000,1,0,0,0,"x",0,{"$f":"AL212","v":1000},{"$f":"AM212","v":1000},{"$f":"AM210/AL210","v":1},null,null,null,621,"Vklady do fundací a ústavů",null,null,null,{"$f":"BA210+BE210","v":0},1000,1000,{"$f":"AY210/AX210","v":1},null,null,null,null,0,{"$f":"BF212","v":1000},{"$f":"BG212","v":1000},{"$f":"BG210/BF210","v":1},null,null,621,"Vklady do fundací a ústavů",null,null,null,{"$f":"SUM(BT210,BX210)","v":1003},{"$f":"SUM(BU210,BY210)","v":1003},1000,{"$f":"BR210/BQ210","v":0.99700897308075775},{"$f":"SUM(BT211:BT212)","v":3},{"$f":"SUM(BU211:BU212)","v":3},{"$f":"SUM(BV211:BV212)","v":0},{"$f":"BV210/BU210","v":0},{"$f":"SUM(BX211:BX212)","v":1000},{"$f":"SUM(BY211:BY212)","v":1000},{"$f":"SUM(BZ211:BZ212)","v":1000},{"$f":"BZ210/BY210","v":1}]
[null,null,null,null,null,null,null,null,null,null,null,null,null,null,null,null,null,null,null,null,null,null,null,null,null,null,null,null,null,null,null,null,null,null,null,null,null,null,null,null,null,null,null,null,null,null,null,null,null,null,null,null,null,null,null,null,null,null,null,null,null,null,6211,null,"Vklady do nadací",null,null,3,3,0,0,3,3,0,{"$f":"BV211/BU211","v":0},0,0,0,0]
[null,null,null,null,null,null,null,null,null,null,null,null,null,null,null,null,null,null,null,null,null,null,null,6212,null,"Vklady do nadačních fondů",null,null,0,1000,1000,1,0,0,0,"x",0,1000,1000,1,null,null,null,6212,null,"Vklady do nadačních fondů",null,null,0,1000,1000,{"$f":"AY212/AX212","v":1},null,null,null,null,0,1000,1000,{"$f":"BG212/BF212","v":1},null,null,6212,null,"Vklady do nadačních fondů",null,null,1000,1000,1000,1,0,0,0,0,1000,1000,1000,{"$f":"BZ212/BY212","v":1}]
[{"$f":"IF(COUNTBLANK(C213:IV213)=254,\"odstr\",IF(AND($A$1=\"TISK\",SUM(J168:U168)=0),\"odstr\",\"OK\"))","v":{"$error":"#REF!"}},"OK",null,null,null,null,null,null,null,null,null,null,null,null,null,null,null,null,null,null,null,null,null,63,"Investiční transfery",null,null,null,{"$f":"AC214+AC218+AC223+AC231","v":1482944.0520000001},{"$f":"AD214+AD218+AD223+AD231","v":3527425.4672499998},{"$f":"AE214+AE218+AE223+AE231","v":3328231.8624400003},0.94353003156001714,{"$f":"AG214+AG218+AG223+AG231","v":637651.10200000007},{"$f":"AH214+AH218+AH223+AH231","v":1432062.0684400003},{"$f":"AI214+AI218+AI223+AI231","v":1340881.1803799998},{"$f":"AI213/AH213","v":0.93632895523912085},{"$f":"AK214+AK218+AK223+AK231","v":845292.95},{"$f":"AL214+AL218+AL223+AL231","v":2095363.3988099999},{"$f":"AM214+AM218+AM223+AM231","v":1987350.6820600003},0.94845155889840282,null,null,null,63,"Investiční transfery",null,null,null,1555880.66469,5403603.8628700003,4842055.5449900003,{"$f":"AY213/AX213","v":0.89607892581863935},{"$f":"BA214+BA218+BA223+BA227+BA231+BA238+BA240+BA242","v":578840.47468999994},{"$f":"BB214+BB218+BB223+BB227+BB231+BB238+BB240+BB242","v":1841675.3482500003},{"$f":"BC214+BC218+BC223+BC227+BC231+BC238+BC240+BC242","v":1605977.2114500003},{"$f":"BC213/BB213","v":0.87201971453656835},{"$f":"BE214+BE218+BE223+BE227+BE231+BE240+BE242","v":977040.19},{"$f":"BF214+BF218+BF223+BF227+BF231+BF240+BF242","v":3561928.51462},{"$f":"BG214+BG218+BG223+BG227+BG231+BG240+BG242","v":3236078.33354},{"$f":"BG213/BF213","v":0.9085186073379794},null,null,63,"Investiční transfery",null,null,null,1431468.1541800001,3942008.2243500003,3631131.6476800004,0.92113751190327353,{"$f":"SUM(BT214,BT218,BT223,BT227,BT231,BT238,BT240,BT242)","v":514244.93518000003},{"$f":"SUM(BU214,BU218,BU223,BU227,BU231,BU238,BU240,BU242)","v":1827708.8530000001},{"$f":"SUM(BV214,BV218,BV223,BV227,BV231,BV238,BV240,BV242)","v":1671189.4841700003},null,{"$f":"SUM(BX214,BX218,BX223,BX227,BX231,BX238,BX240,BX242)","v":917223.21900000004},{"$f":"SUM(BY214,BY218,BY223,BY227,BY231,BY238,BY240,BY242)","v":2114299.3713500001},{"$f":"SUM(BZ214,BZ218,BZ223,BZ227,BZ231,BZ238,BZ240,BZ242)","v":1959942.1635100003},{"$f":"BZ213/BY213","v":0.92699368408673311}]
[null,null,null,null,null,null,null,null,null,null,null,null,null,null,null,null,null,null,null,null,null,null,null,631,null,"Investiční transfery podnikatelským subjektům ",null,null,{"$f":"SUM(AC215:AC217)","v":0},{"$f":"SUM(AD215:AD217)","v":10682.22},7410.7024000000001,0.6937417877557287,0,{"$f":"AH216","v":7298},{"$f":"AI216","v":4026.5014000000001},{"$f":"AI214/AH214","v":0.55172669224445059},0,{"$f":"SUM(AL215:AL217)","v":3384.22},{"$f":"SUM(AM215:AM217)","v":3384.201},0.99999438570778498,null,null,null,631,"Investiční transfery podnikatelským subjektům ",null,null,null,0,27192.024999999998,19974.16689,{"$f":"AY214/AX214","v":0.73455974279223424},0,{"$f":"SUM(BB215:BB217)","v":26421.599999999999},{"$f":"SUM(BC215:BC217)","v":19203.741890000001},{"$f":"BC214/BB214","v":0.72681979478911207},0,{"$f":"SUM(BF215:BF217)","v":770.42499999999995},{"$f":"SUM(BG215:BG217)","v":770.42499999999995},{"$f":"BG214/BF214","v":1},null,null,631,"Investiční transfery podnikatelským subjektům ",null,null,null,0,7275,3638.9396499999998,0.50019789003436421,{"$f":"SUM(BT215:BT217)","v":0},{"$f":"SUM(BU215:BU217)","v":7015},{"$f":"SUM(BV215:BV217)","v":3378.9396499999998},null,{"$f":"SUM(BX215:BX217)","v":0},{"$f":"SUM(BY215:BY217)","v":260},{"$f":"SUM(BZ215:BZ217)","v":260},{"$f":"BZ214/BY214","v":1}]
[{"$f":"IF(COUNTBLANK(C215:IV215)=254,\"odstr\",IF(AND($A$1=\"TISK\",SUM(J169:U169)=0),\"odstr\",\"OK\"))","v":{"$error":"#REF!"}},"OK",null,null,null,null,null,null,null,null,null,null,null,null,null,null,null,null,null,null,null,null,null,6312,null,"Investiční transfery nefinančním podnikatelským subjektům-fyzickým osobám",null,null,0,210,210,1,0,0,0,"x",0,210,210,1,null,null,null,6312,null,"Investiční transfery nefinančním podnikatelským subjektům-fyzickým osobám",null,null,null,null,null,null,null,null,null,null,null,null,null,"x",null,null,6312,null,"Investiční transfery nefinančním podnikatelským subjektům-fyzickým osobám",null,null,0,140,140,1,0,0,0,null,0,140,140,{"$f":"BZ215/BY215","v":1}]
[{"$f":"IF(COUNTBLANK(C216:IV216)=254,\"odstr\",IF(AND($A$1=\"TISK\",SUM(J170:U170)=0),\"odstr\",\"OK\"))","v":{"$error":"#REF!"}},"OK",null,null,null,null,null,null,null,null,null,null,null,null,null,null,null,null,null,null,null,null,null,6313,null,"Investiční dotace nefinančním podnikatelským subjektům – právnickým osobám",null,null,0,10472.219999999999,7200.7024000000001,0.68760037508761285,0,7298,4026.5014000000001,{"$f":"AI216/AH216","v":0.55172669224445059},0,3174.22,3174.201,0.99999401427752332,null,null,null,6313,null,"Investiční dotace nefinančním podnikatelským subjektům – právnickým osobám",null,null,{"$f":"BA216+BE216","v":0},{"$f":"BB216+BF216","v":27192.024999999998},{"$f":"BC216+BG216","v":19974.16689},{"$f":"AY216/AX216","v":0.73455974279223424},0,26421.599999999999,19203.741890000001,{"$f":"BC216/BB216","v":0.72681979478911207},0,770.42499999999995,770.42499999999995,{"$f":"BG216/BF216","v":1},null,null,6313,null,"Investiční dotace nefinančním podnikatelským subjektům – právnickým osobám",null,null,0,7135,3498.9396499999998,0.4903909810791871,0,7015,3378.9396499999998,null,0,120,120,{"$f":"BZ216/BY216","v":1}]
[{"$f":"IF(COUNTBLANK(C217:IV217)=254,\"odstr\",IF(AND($A$1=\"TISK\",SUM(J171:U171)=0),\"odstr\",\"OK\"))","v":{"$error":"#REF!"}},"OK",null,null,null,null,null,null,null,null,null,null,null,null,null,null,null,null,null,null,null,null,null,6314,null,"Investiční transfery finančním a podobným institucím ve vlastnictví státu",null,null,0,0,0,"x",0,0,0,"x",0,null,0,"x",null,null,null,6314,null,"Investiční transfery finančním a podobným institucím ve vlastnictví státu",null,null,null,null,null,null,null,null,null,null,null,null,null,"x",null,null,6314,null,"Investiční transfery finančním a podobným institucím ve vlastnictví státu",null,null,0,0,0,0,0,0,0,null,0,0,0,0]
[null,null,null,null,null,null,null,null,null,null,null,null,null,null,null,null,null,null,null,null,null,null,null,632,null,"Investiční transfery neziskovým a podobným organizacím ",null,null,{"$f":"SUM(AC219:AC222)","v":6649},{"$f":"SUM(AD219:AD222)","v":43851.235189999992},42748.6348,{"$f":"AE218/AD218","v":0.97485588752009811},{"$f":"SUM(AG219:AG222)","v":5649},{"$f":"SUM(AH219:AH222)","v":16464.044000000002},{"$f":"SUM(AI219:AI222)","v":16389.734},{"$f":"AI218/AH218","v":0.99548652809722804},{"$f":"SUM(AK219:AK222)","v":1000},{"$f":"SUM(AL219:AL222)","v":27387.191190000001},{"$f":"SUM(AM219:AM222)","v":26358.900800000003},{"$f":"AM218/AL218","v":0.9624536016539198},null,null,null,632,"Investiční transfery neziskovým a podobným organizacím ",null,null,null,{"$f":"BA218+BE218","v":8761},34040.355150000003,33829.355150000003,{"$f":"AY218/AX218","v":0.99380147477691638},{"$f":"SUM(BA219:BA222)","v":1261},{"$f":"SUM(BB219:BB222)","v":5162},{"$f":"SUM(BC219:BC222)","v":5051},{"$f":"BC218/BB218","v":0.9784967067028284},{"$f":"SUM(BE219:BE222)","v":7500},{"$f":"SUM(BF219:BF222)","v":28878.355149999999},{"$f":"SUM(BG219:BG222)","v":28778.355149999999},{"$f":"BG218/BF218","v":0.99653719889929393},null,null,632,"Investiční transfery neziskovým a podobným organizacím ",null,null,null,5005,29401.625380000001,26899.340170000003,{"$f":"BR218/BQ218","v":0.91489296330868364},{"$f":"SUM(BT219:BT222)","v":5005},{"$f":"SUM(BU219:BU222)","v":9443.1959999999999},{"$f":"SUM(BV219:BV222)","v":7170.8107999999993},null,{"$f":"SUM(BX219:BX222)","v":0},{"$f":"SUM(BY219:BY222)","v":19958.429380000001},{"$f":"SUM(BZ219:BZ222)","v":19728.529370000004},{"$f":"BZ218/BY218","v":0.98848105701992883}]
[{"$f":"IF(COUNTBLANK(C219:IV219)=254,\"odstr\",IF(AND($A$1=\"TISK\",SUM(J173:U173)=0),\"odstr\",\"OK\"))","v":{"$error":"#REF!"}},"OK",null,null,null,null,null,null,null,null,null,null,null,null,null,null,null,null,null,null,null,null,null,6321,null,"Investiční transfery obecně prospěšným organizacím",null,null,300,3978,3976.2530000000002,0.99956083459024636,300,3228,3228,1,0,750,748.25300000000004,{"$f":"AM219/AL219","v":0.99767066666666671},null,null,null,6321,null,"Investiční transfery obecně prospěšným organizacím",null,null,1060,8250.6666800000003,8180.6666800000003,0.99151583711778302,1060,4076,4106,{"$f":"BC219/BB219","v":1.007360157016683},0,4174.6666800000003,4074.6666799999998,{"$f":"BG219/BF219","v":0.97604599177244966},null,null,6321,null,"Investiční transfery obecně prospěšným organizacím",null,null,1005,5178.5933199999999,3582.4681199999995,0.69178402292458829,1005,4370.26,2774.1347999999998,null,0,808.33331999999996,808.33331999999996,{"$f":"BZ219/BY219","v":1}]
[{"$f":"IF(COUNTBLANK(C220:IV220)=254,\"odstr\",IF(AND($A$1=\"TISK\",SUM(J174:U174)=0),\"odstr\",\"OK\"))","v":{"$error":"#REF!"}},"OK",null,null,null,null,null,null,null,null,null,null,null,null,null,null,null,null,null,null,null,null,null,6322,null,"Investiční transfery občanským sdružením",null,null,4354,21479.901849999998,20567.381799999999,0.95751749442933332,4354,11106.044,11061.734,0.99601028052833218,0,10373.85785,9505.6478000000006,{"$f":"AM220/AL220","v":0.91630789022234393},null,null,null,6322,null,"Investiční transfery občanským sdružením",null,null,1,9623.3296000000009,9622.3296000000009,0.99989608586200773,1,846,845,{"$f":"BC220/BB220","v":0.99881796690307334},0,8777.3296000000009,8777.3296000000009,{"$f":"BG220/BF220","v":1},null,null,6322,null,"Investiční transfery občanským sdružením",null,null,4000,23250.09606,23020.196050000002,0.990111868380814,4000,4100,4100,null,0,19150.09606,18920.196050000002,{"$f":"BZ220/BY220","v":0.98799483776584263}]
[{"$f":"IF(COUNTBLANK(C221:IV221)=254,\"odstr\",IF(AND($A$1=\"TISK\",SUM(J175:U175)=0),\"odstr\",\"OK\"))","v":{"$error":"#REF!"}},"OK",null,null,null,null,null,null,null,null,null,null,null,null,null,null,null,null,null,null,null,null,null,6323,null,"Investiční transfery církvím a náboženským společnostem",null,null,0,9080,9080,1,0,1000,1000,1,0,8080,8080,{"$f":"AM221/AL221","v":1},null,null,null,6323,null,"Investiční transfery církvím a náboženským společnostem",null,null,7600,7977,7977,1,100,0,0,"x",7500,7977,7977,{"$f":"BG221/BF221","v":1},null,null,6323,null,"Investiční transfery církvím a náboženským společnostem",null,null,0,182.93600000000001,182.93600000000001,1,0,182.93600000000001,182.93600000000001,null,0,0,0,0]
[{"$f":"IF(COUNTBLANK(C222:IV222)=254,\"odstr\",IF(AND($A$1=\"TISK\",SUM(J176:U176)=0),\"odstr\",\"OK\"))","v":{"$error":"#REF!"}},"OK",null,null,null,null,null,null,null,null,null,null,null,null,null,null,null,null,null,null,null,null,null,6329,null,"Ostatní investiční transfery neziskovým a podobným organizacím",null,null,1995,9313.3333399999992,9125,0.97977809521848391,995,1130,1100,0.97345132743362828,1000,8183.3333400000001,8025,{"$f":"AM222/AL222","v":0.98065173036199449},null,null,null,6329,null,"Ostatní investiční transfery neziskovým a podobným organizacím",null,null,100,8189.35887,8049.35887,0.9829046446464984,100,240,100,{"$f":"BC222/BB222","v":0.41666666666666669},0,7949.35887,7949.35887,{"$f":"BG222/BF222","v":1},null,null,6329,null,"Ostatní investiční transfery neziskovým a podobným organizacím",null,null,0,790,113.74,0.14397468354430379,0,790,113.74,null,0,0,0,0]
[null,null,null,null,null,null,null,null,null,null,null,null,null,null,null,null,null,null,null,null,null,null,633,633,null,"Investiční transfery veřwejným rozpočtům ústřední úrovně",null,null,{"$f":"SUM(AC224:AC226)","v":110},{"$f":"SUM(AD224:AD226)","v":179.685},179.685,1,{"$f":"SUM(AG224:AG226)","v":110},{"$f":"AH224","v":179.685},{"$f":"AI224","v":179.685},1,0,{"$f":"SUM(AL224:AL226)","v":0},{"$f":"SUM(AM224:AM226)","v":0},"x",null,null,null,633,"Investiční transfery veřwejným rozpočtům ústřední úrovně",null,null,null,150,250,462.24299999999999,1.8489720000000001,{"$f":"SUM(BA224:BA226)","v":150},{"$f":"SUM(BB224:BB226)","v":250},{"$f":"SUM(BC224:BC226)","v":462.24299999999999},{"$f":"BC223/BB223","v":1.8489720000000001},0,0,0,"x",null,null,633,"Investiční transfery veřwejným rozpočtům ústřední úrovně",null,null,null,50,750,700,0.93333333333333335,{"$f":"SUM(BT224:BT226)","v":50},{"$f":"SUM(BU224:BU226)","v":750},{"$f":"SUM(BV224:BV226)","v":700},null,{"$f":"SUM(BX224:BX226)","v":0},{"$f":"SUM(BY224:BY226)","v":0},{"$f":"SUM(BZ224:BZ226)","v":0},0]
[{"$f":"IF(COUNTBLANK(C224:IV224)=254,\"odstr\",IF(AND($A$1=\"TISK\",SUM(J177:U177)=0),\"odstr\",\"OK\"))","v":{"$error":"#REF!"}},"OK",null,null,null,null,null,null,null,null,null,null,null,null,null,null,null,null,null,null,null,null,null,6331,null,"Investiční transfery státnímu rozpočtu",null,null,50,179.685,179.685,1,50,179.685,179.685,1,0,0,0,"x",null,null,null,6331,null,"Investiční transfery státnímu rozpočtu",null,null,100,250,462.24299999999999,1.8489720000000001,100,250,462.24299999999999,{"$f":"BC224/BB224","v":1.8489720000000001},null,null,null,"x",null,null,6331,null,"Investiční transfery státnímu rozpočtu",null,null,0,700,700,1,0,700,700,null,0,0,0,0]
[{"$f":"IF(COUNTBLANK(C225:IV225)=254,\"odstr\",IF(AND($A$1=\"TISK\",SUM(J178:U178)=0),\"odstr\",\"OK\"))","v":{"$error":"#REF!"}},"OK",null,null,null,null,null,null,null,null,null,null,null,null,null,null,null,null,null,null,null,null,null,6335,null,"Investiční transfery státním finančním aktivům",null,null,null,0,0,"x",0,0,0,"x",0,0,0,"x",null,null,null,6335,null,"Investiční transfery státním finančním aktivům",null,null,null,null,null,null,null,null,null,null,null,null,null,"x",null,null,6335,null,"Investiční transfery státním finančním aktivům",null,null,0,0,0,0,0,0,0,null,0,0,0,0]
[{"$f":"IF(COUNTBLANK(C226:IV226)=254,\"odstr\",IF(AND($A$1=\"TISK\",SUM(J179:U179)=0),\"odstr\",\"OK\"))","v":{"$error":"#REF!"}},"OK",null,null,null,null,null,null,null,null,null,null,null,null,null,null,null,null,null,null,null,null,null,6339,null,"Ostatní investiční transfery jiným veřejným rozpočtům",null,null,60,0,0,"x",60,0,0,"x",0,0,0,"x",null,null,null,6339,null,"Ostatní investiční transfery jiným veřejným rozpočtům",null,null,{"$f":"BA226+BE226","v":50},{"$f":"BB226+BF226","v":0},{"$f":"BC226+BG226","v":0},"x",50,0,0,"x",null,null,null,"x",null,null,6339,null,"Ostatní investiční transfery jiným veřejným rozpočtům",null,null,50,{"$f":"SUM(BU226,BY226)","v":50},0,{"$f":"BR226/BQ226","v":0},50,50,0,null,0,0,0,0]
[{"$f":"IF(COUNTBLANK(C221:IV221)=254,\"odstr\",IF(AND($A$1=\"TISK\",SUM(J170:U170)=0),\"odstr\",\"OK\"))","v":{"$error":"#REF!"}},"OK",null,null,null,null,null,null,null,null,null,null,null,null,null,null,null,null,null,null,null,null,null,null,null,null,null,null,null,null,null,null,null,null,null,null,null,null,null,null,null,null,null,634,"Investiční transfery veřejným rozpočtům územní úrovně",null,null,null,171067.45500000002,347991.75759999995,228830.54743000004,{"$f":"AY227/AX227","v":0.65757461903172409},{"$f":"SUM(BA228:BA230)","v":61067.455000000002},{"$f":"SUM(BB228:BB230)","v":85242.837350000002},{"$f":"SUM(BC228:BC230)","v":81492.471780000007},{"$f":"BC227/BB227","v":0.95600374545721301},{"$f":"SUM(BE228:BE230)","v":110000},{"$f":"SUM(BF228:BF230)","v":262748.92024999997},{"$f":"SUM(BG228:BG230)","v":147338.07565000001},{"$f":"BG227/BF227","v":0.56075616032907383},null,null,634,"Investiční transfery veřejným rozpočtům územní úrovně",null,null,null,0,0,0,0,{"$f":"SUM(BT228:BT230)","v":0},{"$f":"SUM(BU228:BU230)","v":0},{"$f":"SUM(BV228:BV230)","v":0},null,{"$f":"SUM(BX228:BX230)","v":0},{"$f":"SUM(BY228:BY230)","v":0},{"$f":"SUM(BZ228:BZ230)","v":0},0]
[{"$f":"IF(COUNTBLANK(C222:IV222)=254,\"odstr\",IF(AND($A$1=\"TISK\",SUM(J171:U171)=0),\"odstr\",\"OK\"))","v":{"$error":"#REF!"}},null,null,null,null,null,null,null,null,null,null,null,null,null,null,null,null,null,null,null,null,null,null,null,null,null,null,null,null,null,null,null,null,null,null,null,null,null,null,null,null,null,null,6341,null,"Investiční transfery obcím",null,null,148504.45500000002,308163.46059999999,189575.74443000002,0.61517917815724332,38504.455000000002,45655.540349999996,42478.66878,0.93041651581285034,110000,262507.92024999997,147097.07565000001,0.56035290481868816,null,null,6341,null,"Investiční transfery obcím",null,null,0,0,0,0,0,0,0,null,0,0,0,0]
[null,null,null,null,null,null,null,null,null,null,null,null,null,null,null,null,null,null,null,null,null,null,null,null,null,null,null,null,null,null,null,null,null,null,null,null,null,null,null,null,null,null,null,6342,null,"Investiční transfery krajům",null,null,1000,26000,26000,1,1000,26000,26000,1,null,null,null,null,null,null,6342,null,"Investiční transfery krajům",null,null,0,0,0,0,0,0,0,null,0,0,0,0]
[null,null,null,null,null,null,null,null,null,null,null,null,null,null,null,null,null,null,null,null,null,null,null,null,null,null,null,null,null,null,null,null,null,null,null,null,null,null,null,null,null,null,null,6349,null,"Ostatní investiční transfery veřejným rozpočtům územní úrovně",null,null,21563,13828.297,13254.803,0.95852750342287263,21563,13587.297,13013.803,0.95779189930123698,0,241,241,1,null,null,6349,null,"Ostatní investiční transfery veřejným rozpočtům územní úrovně",null,null,0,0,0,0,0,0,0,null,0,0,0,0]
[null,634,null,null,null,null,null,null,null,null,null,null,null,null,null,null,null,null,null,null,null,null,null,635,null,"Investiční transfery příspěvkovým a podobným organizacím ",null,null,{"$f":"SUM(AC232:AC237)","v":1476185.0520000001},{"$f":"SUM(AD232:AD237)","v":3472712.3270599996},{"$f":"SUM(AE232:AE237)","v":3277892.8402400003},{"$f":"AE231/AD231","v":0.94389990633490406},{"$f":"SUM(AG232:AG237)","v":631892.10200000007},{"$f":"SUM(AH232:AH237)","v":1408120.3394400002},{"$f":"SUM(AI232:AI237)","v":1320285.2599799999},{"$f":"AI231/AH231","v":0.93762246237070068},{"$f":"SUM(AK232:AK237)","v":844292.95},{"$f":"SUM(AL232:AL237)","v":2064591.98762},{"$f":"SUM(AM232:AM237)","v":1957607.5802600002},{"$f":"AM231/AL231","v":0.94818133171032581},null,null,null,635,"Investiční transfery příspěvkovým a podobným organizacím ",null,null,null,1375802.2096899999,4994129.7251200005,4558959.2325200001,0.91286359855429189,{"$f":"SUM(BA232:BA237)","v":516262.01968999999},{"$f":"SUM(BB232:BB237)","v":1724598.9109000002},{"$f":"SUM(BC232:BC237)","v":1499767.7547800003},0.86963278551378109,{"$f":"SUM(BE232:BE237)","v":859540.19},{"$f":"SUM(BF232:BF237)","v":3269530.8142200001},{"$f":"SUM(BG232:BG237)","v":3059191.47774},0.93566681324268852,null,null,635,"Investiční transfery příspěvkovým a podobným organizacím ",null,null,null,1426413.1541800001,3904365.6139700003,3599677.3828600002,{"$f":"BR231/BQ231","v":0.92196216716492652},{"$f":"SUM(BT232:BT237)","v":509189.93518000003},{"$f":"SUM(BU232:BU237)","v":1810284.672},{"$f":"SUM(BV232:BV237)","v":1659723.7487200003},null,{"$f":"SUM(BX232:BX237)","v":917223.21900000004},{"$f":"SUM(BY232:BY237)","v":2094080.94197},{"$f":"SUM(BZ232:BZ237)","v":1939953.6341400002},{"$f":"BZ231/BY231","v":0.92639859102819344}]
[null,6341,null,"Investiční transfery obcím",null,null,null,null,null,null,null,null,null,null,null,null,null,null,null,null,null,null,null,6351,null,"Investiční dotace zřízeným příspěvkovým a podobným organizacím",null,null,1431754.9180000001,2874192.9439900001,2734536.20707,0.9514101037607704,594783.228,1111382.70603,1074382.5268999999,0.9667079765329718,836971.69,1762810.2379600001,1660153.6801700001,{"$f":"AM232/AL232","v":0.94176539506101431},null,null,null,6351,null,"Investiční dotace zřízeným příspěvkovým a podobným organizacím",null,null,1340546.237,3215379.2252500001,2837581.38919,0.8825028683729752,482406.04699999996,1275070.1610600001,1106572.9667400003,0.86785260963214483,858140.19,1940309.0641900001,1731008.4224499997,0.89213025615206576,null,null,6351,null,"Investiční dotace zřízeným příspěvkovým a podobným organizacím",null,null,1375841.34118,3032823.0028400002,2818758.1381100006,0.92941729058057632,459118.12218000001,1305369.1939700001,1225375.1849600002,null,916723.21900000004,1727453.8088700003,1593382.9531500002,{"$f":"BZ232/BY232","v":0.92238816746845376}]
[null,6349,null,"Ostatní investiční transfery veřejným rozpočtům územní úrovně",null,null,null,null,null,null,null,null,null,null,null,null,null,null,null,null,null,null,null,6352,null,"Investiční dotace vysokým školám",null,null,0,42876,39809.399640000003,0.92847746151693267,0,30900,30200.642639999998,0.97736707572815529,0,11976,9608.7569999999996,{"$f":"AM233/AL233","v":0.80233441883767531},null,null,null,6352,null,"Investiční dotace vysokým školám",null,null,1400,5534.46,5250.0798099999993,0.94861645219226431,0,1,0,0,1400,5533.46,5250.0798099999993,0.94878788497612687,null,null,6352,null,"Investiční dotace vysokým školám",null,null,500,8358.380000000001,4821.8130000000001,0.5768836784161524,0,3000,3000,null,500,5358.38,1821.8130000000001,{"$f":"BZ233/BY233","v":0.33999324422679988}]
[null,634,null,null,null,null,null,null,null,null,null,null,null,null,null,null,null,null,null,null,null,null,null,6353,null,"Investiční transfery školským právnickým osobám zřízeným státem, kraji a obcemi",null,null,2442.4,11025.358899999999,9934.7543000000005,0.90108216794647844,2442.4,11025.358899999999,9934.7543000000005,0.90108216794647844,0,0,0,"x",null,null,null,6353,null,"Investiční transfery školským právnickým osobám zřízeným státem, kraji a obcemi",null,null,10046.619999999999,4181.6990599999999,4003.0787099999998,0.95728522128514903,10046.619999999999,4181.6990599999999,4003.0787099999998,0.95728522128514903,null,null,null,"x",null,null,6353,null,"Investiční transfery školským právnickým osobám zřízeným státem, kraji a obcemi",null,null,350,4743.1587200000004,4743.1016399999999,0.99998796582544036,350,4743.1587200000004,4743.1016399999999,null,null,null,null,0]
[null,6341,null,"Investiční transfery obcím",null,null,null,null,null,null,null,null,null,null,null,null,null,null,null,null,null,null,null,6354,null,"Investiční transfery veřejným výzkumným institucím",null,null,0,3210.3,3050.8391099999999,0.95032835249042136,0,3210.3,3050.8391099999999,0.95032835249042136,0,0,0,"x",null,null,null,6354,null,"Investiční transfery veřejným výzkumným institucím",null,null,0,5381.8,4453.2698899999996,0.82746848452190702,0,5381.8,4453.2698899999996,0.82746848452190702,null,null,null,"x",null,null,6354,null,"Investiční transfery veřejným výzkumným institucím",null,null,0,1177.6134099999999,1177.63861,1.0000213992128368,0,1177.6134099999999,1177.63861,null,null,null,null,0]
[null,6349,null,"Ostatní investiční transfery veřejným rozpočtům územní úrovně",null,null,null,null,null,null,null,null,null,null,null,null,null,null,null,null,null,null,null,6356,null,"Jiné investiční transfery zřízeným příspěvkovým organizacím",null,null,41096.06,530202.02816999995,479457.54771999997,0.9042921796713127,33774.800000000003,240396.27851,191612.40463,0.79706893059090889,7321.26,289805.74965999997,287845.14309000003,{"$f":"AM236/AL236","v":0.99323475613475531},null,null,null,6356,null,"Jiné investiční transfery zřízeným příspěvkovým organizacím",null,null,23183.85269,1758936.34081,1702960.2849200002,0.96817619001252631,23183.85269,435248.05078000005,380027.30943999998,0.87312811340328811,0,1323688.29003,1322932.9754800003,{"$f":"BG236/BF236","v":0.99942938639278689},null,null,6356,null,"Jiné investiční transfery zřízeným příspěvkovým organizacím",null,null,49224.413,854802.15899999999,767243.65171999997,0.89756868725924688,49224.413,493533.40589999995,422494.78372999991,null,0,361268.75309999997,344748.86799,{"$f":"BZ236/BY236","v":0.95427258801586079}]
[null,null,null,null,null,null,null,null,null,null,null,null,null,null,null,null,null,null,null,null,null,null,null,6359,null,"Investiční dotace ostatním příspěvkovým organizacím",null,null,891.67399999999998,11205.696,11104.0924,0.99093286128768798,891.67399999999998,11205.696,11104.0924,0.99093286128768798,0,0,0,"x",null,null,null,6359,null,"Investiční dotace ostatním příspěvkovým organizacím",null,null,625.5,4716.2,4711.13,0.9989249819770154,625.5,4716.2,4711.13,0.9989249819770154,null,null,null,"x",null,null,6359,null,"Investiční dotace ostatním příspěvkovým organizacím",null,null,497.4,2461.3000000000002,2933.0397800000001,1.1916628529638809,497.4,2461.3000000000002,2933.0397800000001,null,null,null,null,0]
[null,null,null,null,null,null,null,null,null,null,null,null,null,null,null,null,null,null,null,null,null,null,null,null,null,null,null,null,null,null,null,null,null,null,null,null,null,null,null,null,null,null,null,636,null,"Investiční převody vlastním fondům",null,null,100,0,0,"x",{"$f":"SUM(BA239)","v":100},{"$f":"BB239","v":0},{"$f":"BC239","v":0},"x",null,null,null,null,null,null,636,"Investiční převody vlastním fondům",null,null,null,0,0,0,0,{"$f":"BT239","v":0},{"$f":"BU239","v":0},{"$f":"BV239","v":0},0,{"$f":"BX239","v":0},{"$f":"BY239","v":0},{"$f":"BZ239","v":0},0]
[null,null,null,null,null,null,null,null,null,null,null,null,null,null,null,null,null,null,null,null,null,null,null,null,null,null,null,null,null,null,null,null,null,null,null,null,null,null,null,null,null,null,null,6361,null,"Investiční převody do rezervního fondu organizačních složek státu",null,null,100,0,0,"x",100,0,0,"x",null,null,null,null,null,null,6361,null,"Investiční převody do rezervního fondu organizačních složek státu",null,null,0,0,0,0,0,0,0,0,0,0,0,0]
[{"$f":"IF(COUNTBLANK(C232:IV232)=254,\"odstr\",IF(AND($A$1=\"TISK\",SUM(J180:U180)=0),\"odstr\",\"OK\"))","v":{"$error":"#REF!"}},"OK",null,null,null,null,null,null,null,null,null,null,null,null,null,null,null,null,null,null,null,null,null,637,null,"Investiční transfery obyvatelstvu",null,null,"x","x","x","x","x","x","x","x","x","x","x","x",null,null,null,637,"Investiční transfery obyvatelstvu",null,null,null,0,0,0,"x",0,0,0,"x",0,0,0,"x",null,null,637,"Investiční transfery obyvatelstvu",null,null,null,0,0,0,0,{"$f":"BT241","v":0},{"$f":"BU241","v":0},{"$f":"BV241","v":0},0,{"$f":"BX241","v":0},{"$f":"BY241","v":0},{"$f":"BZ241","v":0},0]
[{"$f":"IF(COUNTBLANK(C233:IV233)=254,\"odstr\",IF(AND($A$1=\"TISK\",SUM(J181:U181)=0),\"odstr\",\"OK\"))","v":{"$error":"#REF!"}},"OK",null,null,null,null,null,null,null,null,null,null,null,null,null,null,null,null,null,null,null,null,null,6371,null,"Účelové investiční transfery nepodnikajícím fyzickým osobám",null,null,"x","x","x","x","x","x","x","x","x","x","x","x",null,null,null,6371,null,"Účelové investiční transfery nepodnikajícím fyzickým osobám",null,null,null,null,null,null,null,null,null,null,null,null,null,"x",null,null,6371,null,"Účelové investiční transfery nepodnikajícím fyzickým osobám",null,null,0,0,0,0,null,null,null,0,0,0,0,0]
[{"$f":"IF(COUNTBLANK(C234:IV234)=254,\"odstr\",IF(AND($A$1=\"TISK\",SUM(J185:U185)=0),\"odstr\",\"OK\"))","v":{"$error":"#REF!"}},null,null,null,null,null,null,null,null,null,null,null,null,null,null,null,null,null,null,null,null,null,null,638,null,"Investiční transfery do zahraničí",null,null,"x","x","x","x","x","x","x","x","x","x","x","x",null,null,null,638,"Investiční transfery do zahraničí",null,null,null,{"$f":"BA242+BE242","v":0},{"$f":"BB242+BF242","v":0},{"$f":"BC242+BG242","v":0},"x",0,0,0,"x",0,0,0,"x",null,null,638,"Investiční transfery do zahraničí",null,null,null,{"$f":"SUM(BT242,BX242)","v":0},{"$f":"SUM(BU242,BY242)","v":215.98500000000001},215.98500000000001,{"$f":"BR242/BQ242","v":1},{"$f":"BT243","v":0},{"$f":"BU243","v":215.98500000000001},{"$f":"BV243","v":215.98500000000001},{"$f":"BV242/BU242","v":1},{"$f":"BX243","v":0},{"$f":"BY243","v":0},{"$f":"BZ243","v":0},0]
[{"$f":"IF(COUNTBLANK(C235:IV235)=254,\"odstr\",IF(AND($A$1=\"TISK\",SUM(J186:U186)=0),\"odstr\",\"OK\"))","v":{"$error":"#REF!"}},"OK",null,null,null,null,null,null,null,null,null,null,null,null,null,null,null,null,null,null,null,null,null,6380,null,"Investiční transfery do zahraničí",null,null,"x","x","x","x","x","x","x","x","x","x","x","x",null,null,null,6380,null,"Investiční transfery do zahraničí",null,null,null,null,null,null,null,null,null,null,null,null,null,"x",null,null,6380,null,"Investiční transfery do zahraničí",null,null,0,215.98500000000001,215.98500000000001,{"$f":"BR243/BQ243","v":1},0,215.98500000000001,215.98500000000001,{"$f":"BV243/BU243","v":1},null,null,null,0]
[{"$f":"IF(COUNTBLANK(C241:IV241)=254,\"odstr\",IF(AND($A$1=\"TISK\",SUM(J190:U190)=0),\"odstr\",\"OK\"))","v":{"$error":"#REF!"}},"OK",null,null,null,null,null,null,null,null,null,null,null,null,null,null,null,null,null,null,null,null,null,64,"Investiční půjčené prostředky","Investiční půjčené prostředky",null,null,{"$f":"AC248+AC256","v":714454.255},{"$f":"AD245+AD248+AD256","v":1517241.5876499999},{"$f":"AE245+AE248+AE256","v":1384611.02293},{"$f":"AE244/AD244","v":0.9125844125289061},{"$f":"AG245+AG248+AG256","v":55056.254999999997},{"$f":"AH245+AH248+AH256","v":201619.65065},{"$f":"AI245+AI248+AI256","v":178970.67176},{"$f":"AI244/AH244","v":0.88766482425208981},{"$f":"AK245+AK248+AK256","v":659398},{"$f":"AL245+AL248+AL256","v":1315621.9369999999},"x","x",null,null,null,64,"Investiční půjčené prostředky","Investiční půjčené prostředky",null,null,{"$f":"BA244+BE244","v":172025.05599999998},788431.86309000012,684439.63888999994,{"$f":"AY244/AX244","v":0.86810245873062919},{"$f":"BA245+BA248+BA256","v":129842.056},{"$f":"BB245+BB248+BB254+BB256","v":271220.40096},{"$f":"BC245+BC248+BC254+BC256","v":244027.02206999998},{"$f":"BC244/BB244","v":0.89973697113584561},{"$f":"BE245+BE248+BE256","v":42183},{"$f":"BF245+BF248+BF256","v":517211.46213000006},{"$f":"BG245+BG248+BG256","v":440412.61682},{"$f":"BG244/BF244","v":0.85151364396735507},null,null,64,"Investiční půjčené prostředky","Investiční půjčené prostředky",null,null,156944.00339999999,624029.53267999995,541761.82541999989,{"$f":"BR244/BQ244","v":0.86816696494044521},{"$f":"SUM(BT245,BT248,BT252,BT254,BT256)","v":105691.0034},{"$f":"SUM(BU245,BU248,BU252,BU254,BU256)","v":183431.80327999999},{"$f":"SUM(BV245,BV248,BV252,BV254,BV256)","v":166460.46604999999},{"$f":"BV244/BU244","v":0.90747876362478941},{"$f":"SUM(BX245,BX248,BX252,BX254,BX256)","v":51253},{"$f":"SUM(BY245,BY248,BY252,BY254,BY256)","v":440597.72939999995},{"$f":"SUM(BZ245,BZ248,BZ252,BZ254,BZ256)","v":375301.35936999996},{"$f":"BZ244/BY244","v":0.8518004844942807}]
[null,null,null,null,null,null,null,null,null,null,null,null,null,null,null,null,null,null,null,null,null,null,null,641,null,"Investiční půjčené prostředky podnikatelským subjektům",null,null,"x",{"$f":"AD247","v":1500},{"$f":"AE247","v":1500},{"$f":"AE245/AD245","v":1},0,{"$f":"AH247","v":1500},{"$f":"AI247","v":1500},{"$f":"AI245/AH245","v":1},0,0,null,"x",null,null,null,641,"Investiční půjčené prostředky podnikatelským subjektům",null,null,null,0,0,0,"x",0,0,0,"x",0,0,0,"x",null,null,641,"Investiční půjčené prostředky podnikatelským subjektům",null,null,null,0,0,0,0,{"$f":"SUM(BT246:BT247)","v":0},{"$f":"SUM(BU246:BU247)","v":0},{"$f":"SUM(BV246:BV247)","v":0},0,{"$f":"SUM(BX246:BX247)","v":0},{"$f":"SUM(BY246:BY247)","v":0},{"$f":"SUM(BZ246:BZ247)","v":0},0]
[null,null,null,null,null,null,null,null,null,null,null,null,null,null,null,null,null,null,null,null,null,null,null,6412,null,"Investiční půjčené prostředky nefinančním podnikatelským subjektům – fyzickým osobám",null,null,"x","x","x","x","x","x","x","x","x","x","x","x",null,null,null,6412,null,"Investiční půjčené prostředky nefinančním podnikatelským subjektům – fyzickým osobám",null,null,null,null,null,null,null,null,null,null,null,null,null,"x",null,null,6412,null,"Investiční půjčené prostředky nefinančním podnikatelským subjektům – fyzickým osobám",null,null,0,0,0,0,null,null,null,0,null,null,null,0]
[null,null,null,null,null,null,null,null,null,null,null,null,null,null,null,null,null,null,null,null,null,null,null,6413,null,"Investiční půjčené prostředky nefinančním podnikatelským subjektům – právnickým osobám",null,null,0,1500,1500,{"$f":"AE247/AD247","v":1},0,1500,1500,{"$f":"AI247/AH247","v":1},0,"x",0,"x",null,null,null,6413,null,"Investiční půjčené prostředky nefinančním podnikatelským subjektům – právnickým osobám",null,null,null,null,null,null,null,null,null,null,null,null,null,"x",null,null,6413,null,"Investiční půjčené prostředky nefinančním podnikatelským subjektům – právnickým osobám",null,null,0,0,0,0,null,null,null,0,null,null,null,0]
[null,null,null,null,null,null,null,null,null,null,null,null,null,null,null,null,null,null,null,null,null,null,null,642,null,"Investiční půjčené prostředky neziskovým a podobným organizacím",null,null,{"$f":"SUM(AC249:AC251)","v":3000},{"$f":"SUM(AD249:AD251)","v":8570.0313700000006},3725,{"$f":"AE248/AD248","v":0.43465418493561475},{"$f":"AG249","v":3000},{"$f":"AH249","v":3250},{"$f":"AI249","v":3250},{"$f":"AI248/AH248","v":1},0,{"$f":"SUM(AL249:AL251)","v":5320.0313699999997},{"$f":"SUM(AM249:AM251)","v":475},{"$f":"AM248/AL248","v":8.9285187805198979E-2},null,null,null,642,"Investiční půjčené prostředky neziskovým a podobným organizacím",null,null,null,{"$f":"BA248+BE248","v":0},12317.059440000001,12317.059440000001,{"$f":"AY248/AX248","v":1},0,{"$f":"SUM(BB249:BB251)","v":1950},{"$f":"SUM(BC249:BC251)","v":1950},{"$f":"BC248/BB248","v":1},0,{"$f":"SUM(BF249:BF251)","v":10367.059440000001},{"$f":"SUM(BG249:BG251)","v":10367.059440000001},{"$f":"BG248/BF248","v":1},null,null,642,"Investiční půjčené prostředky neziskovým a podobným organizacím",null,null,null,10000,3788.6,3788.6,{"$f":"BR248/BQ248","v":1},{"$f":"SUM(BT249:BT251)","v":0},{"$f":"SUM(BU249:BU251)","v":0},{"$f":"SUM(BV249:BV251)","v":0},0,{"$f":"SUM(BX249:BX251)","v":10000},{"$f":"SUM(BY249:BY251)","v":3788.6},{"$f":"SUM(BZ249:BZ251)","v":3788.6},{"$f":"BZ248/BY248","v":1}]
[null,null,null,null,null,null,null,null,null,null,null,null,null,null,null,null,null,null,null,null,null,null,null,6421,null,"Investiční půjčené prostředky obecně prospěšným organizacím",null,null,3000,3250,3250,{"$f":"AE249/AD249","v":1},3000,3250,3250,{"$f":"AI249/AH249","v":1},0,0,0,"x",null,null,null,6421,null,"Investiční půjčené prostředky obecně prospěšným organizacím",null,null,0,300,300,1,0,300,300,{"$f":"BC249/BB249","v":1},null,null,null,"x",null,null,6421,null,"Investiční půjčené prostředky obecně prospěšným organizacím",null,null,0,0,0,0,0,0,0,0,null,null,null,0]
[{"$f":"IF(COUNTBLANK(C244:IV244)=254,\"odstr\",IF(AND($A$1=\"TISK\",SUM(J192:U192)=0),\"odstr\",\"OK\"))","v":{"$error":"#REF!"}},"OK",null,null,null,null,null,null,null,null,null,null,null,null,null,null,null,null,null,null,null,null,null,6422,null,"Investiční půjčené prostředky občanským sdružením",null,null,0,4845.0313699999997,0,"x",0,0,null,"x",0,4845.0313699999997,0,"x",null,null,null,6422,null,"Investiční půjčené prostředky občanským sdružením",null,null,0,3867.05944,3867.05944,1,null,null,null,null,0,3867.05944,3867.05944,{"$f":"BG250/BF250","v":1},null,null,6422,null,"Investiční půjčené prostředky občanským sdružením",null,null,0,1788.6,1788.6,{"$f":"BR250/BQ250","v":1},0,0,0,0,0,1788.6,1788.6,{"$f":"BZ250/BY250","v":1}]
[null,null,null,null,null,null,null,null,null,null,null,null,null,null,null,null,null,null,null,null,null,null,null,6429,null,"Ostatní investiční půjčené prostředky neziskovým a podobným organizacím",null,null,0,475,475,{"$f":"AE251/AD251","v":1},0,0,null,"x",0,475,475,{"$f":"AM251/AL251","v":1},null,null,null,6429,null,"Ostatní investiční půjčené prostředky neziskovým a podobným organizacím",null,null,0,8150,8150,1,0,1650,1650,{"$f":"BC251/BB251","v":1},0,6500,6500,{"$f":"BG251/BF251","v":1},null,null,6429,null,"Ostatní investiční půjčené prostředky neziskovým a podobným organizacím",null,null,10000,2000,2000,{"$f":"BR251/BQ251","v":1},0,0,0,0,10000,2000,2000,{"$f":"BZ251/BY251","v":1}]
[null,null,null,null,null,null,null,null,null,null,null,null,null,null,null,null,null,null,null,null,null,null,null,null,null,null,null,null,null,null,null,null,null,null,null,null,null,null,null,null,null,null,null,null,null,null,null,null,null,null,null,null,null,null,null,null,null,null,null,null,null,null,643,"Investiční půjčené prostředky veřejným rozpočtům ústřední úrovně",null,null,null,0,1192.78583,0,{"$f":"BR252/BQ252","v":0},{"$f":"BT253","v":0},{"$f":"BU253","v":1192.78583},0,{"$f":"BV252/BU252","v":0},{"$f":"BX253","v":0},{"$f":"BY253","v":0},{"$f":"BZ253","v":0},0]
[null,null,null,null,null,null,null,null,null,null,null,null,null,null,null,null,null,null,null,null,null,null,null,null,null,null,null,null,null,null,null,null,null,null,null,null,null,null,null,null,null,null,null,null,null,null,null,null,null,null,null,null,null,null,null,null,null,null,null,null,null,null,6431,null,"Investiční půjčené prostředky státnímu rozpočtu",null,null,0,1192.78583,1192.78583,{"$f":"BR253/BQ253","v":1},0,1192.78583,1192.78583,{"$f":"BV253/BU253","v":1},0,0,0,0]
[null,null,null,null,null,null,null,null,null,null,null,null,null,null,null,null,null,null,null,null,null,null,null,null,null,null,null,null,null,null,null,null,null,null,null,null,null,null,null,null,null,null,null,644,"Investiční půjčené prostředky veřejným rozpočtům územní úrovně",null,null,null,0,3900,3900,1,null,{"$f":"SUM(BB255)","v":3900},{"$f":"BC255","v":3900},{"$f":"BC254/BB254","v":1},null,null,null,null,null,null,644,"Investiční půjčené prostředky veřejným rozpočtům územní úrovně",null,null,null,0,0,0,0,{"$f":"BT255","v":0},{"$f":"BU255","v":0},{"$f":"BV255","v":0},0,{"$f":"BX255","v":0},{"$f":"BY255","v":0},{"$f":"BZ255","v":0},0]
[null,null,null,null,null,null,null,null,null,null,null,null,null,null,null,null,null,null,null,null,null,null,null,null,null,null,null,null,null,null,null,null,null,null,null,null,null,null,null,null,null,null,null,6441,null,"Investiční půjčené prostředky obcím",null,null,0,3900,3900,1,null,3900,3900,{"$f":"BC255/BB255","v":1},null,null,null,null,null,null,6441,null,"Investiční půjčené prostředky obcím",null,null,0,0,0,0,0,0,0,0,0,0,0,0]
[{"$f":"IF(COUNTBLANK(C246:IV246)=254,\"odstr\",IF(AND($A$1=\"TISK\",SUM(J193:U193)=0),\"odstr\",\"OK\"))","v":{"$error":"#REF!"}},"OK",null,null,null,null,null,null,null,null,null,null,null,null,null,null,null,null,null,null,null,null,null,645,null,"Investiční půjčené prostředky příspěvkovým a podobným organizacím ",null,null,{"$f":"SUM(AC257:AC259)","v":711454.255},{"$f":"SUM(AD257:AD259)","v":1507171.5562799999},1379386.02293,{"$f":"AE256/AD256","v":0.91521500467710515},{"$f":"AG257+AG258","v":52056.254999999997},{"$f":"SUM(AH257:AH259)","v":196869.65065},{"$f":"SUM(AI257:AI259)","v":174220.67176},{"$f":"AI256/AH256","v":0.88495444160529368},{"$f":"SUM(AK257:AK259)","v":659398},{"$f":"SUM(AL257:AL259)","v":1310301.9056299999},{"$f":"SUM(AM257:AM259)","v":1205165.3511699999},{"$f":"AM256/AL256","v":0.91976158013030607},null,null,null,645,"Investiční půjčené prostředky příspěvkovým a podobným organizacím ",null,null,null,172025.05599999998,772214.80365000013,668222.57944999996,0.86533251666704158,{"$f":"SUM(BA257:BA259)","v":129842.056},{"$f":"SUM(BB257:BB259)","v":265370.40096},{"$f":"SUM(BC257:BC259)","v":238177.02206999998},{"$f":"BC256/BB256","v":0.89752670685341829},{"$f":"SUM(BE257:BE259)","v":42183},{"$f":"SUM(BF257:BF259)","v":506844.40269000008},{"$f":"SUM(BG257:BG259)","v":430045.55738000001},{"$f":"BG256/BF256","v":0.84847648528344832},null,null,645,"Investiční půjčené prostředky příspěvkovým a podobným organizacím ",null,null,null,146944.00339999999,619048.1468499999,537973.22542000003,{"$f":"BR256/BQ256","v":0.86903293089148859},{"$f":"SUM(BT257:BT259)","v":105691.0034},{"$f":"SUM(BU257:BU259)","v":182239.01744999998},{"$f":"SUM(BV257:BV259)","v":166460.46604999999},{"$f":"BV256/BU256","v":0.91341836879509586},{"$f":"SUM(BX257:BX259)","v":41253},{"$f":"SUM(BY257:BY259)","v":436809.12939999998},{"$f":"SUM(BZ257:BZ259)","v":371512.75936999999},{"$f":"BZ256/BY256","v":0.85051509770482381}]
[{"$f":"IF(COUNTBLANK(C247:IV247)=254,\"odstr\",IF(AND($A$1=\"TISK\",SUM(J194:U194)=0),\"odstr\",\"OK\"))","v":{"$error":"#REF!"}},"OK",null,null,null,null,null,null,null,null,null,null,null,null,null,null,null,null,null,null,null,null,null,6451,null,"Investiční půjčené prostředky zřízeným příspěvkovým organizacím",null,null,706454.255,1498949.5562799999,1371164.02293,{"$f":"AE257/AD257","v":0.91474994417615352},47056.254999999997,188647.65065,165998.67176,{"$f":"AI257/AH257","v":0.87994030770083165},659398,1310301.9056299999,1205165.3511699999,{"$f":"AM257/AL257","v":0.91976158013030607},null,null,null,6451,null,"Investiční půjčené prostředky zřízeným příspěvkovým organizacím",null,null,172025.05599999998,772214.80365000013,668222.57944999996,0.86533251666704158,129842.056,265370.40096,238177.02206999998,{"$f":"BC257/BB257","v":0.89752670685341829},42183,506844.40269000008,430045.55738000001,{"$f":"BG257/BF257","v":0.84847648528344832},null,null,6451,null,"Investiční půjčené prostředky zřízeným příspěvkovým organizacím",null,null,146944.00339999999,619048.1468499999,537973.22542000003,{"$f":"BR257/BQ257","v":0.86903293089148859},105691.0034,182239.01744999998,166460.46604999999,{"$f":"BV257/BU257","v":0.91341836879509586},41253,436809.12939999998,371512.75936999999,{"$f":"BZ257/BY257","v":0.85051509770482381}]
[null,null,null,null,null,null,null,null,null,null,null,null,null,null,null,null,null,null,null,null,null,null,null,6452,null,"Investiční půjčené prostředky vysokým školám",null,null,5000,5000,5000,{"$f":"AE258/AD258","v":1},5000,5000,5000,{"$f":"AI258/AH258","v":1},0,0,0,"x",null,null,null,6452,null,"Investiční půjčené prostředky vysokým školám",null,null,null,null,null,null,null,null,null,null,null,null,null,"x",null,null,6452,null,"Investiční půjčené prostředky vysokým školám",null,null,0,{"$f":"SUM(BU258,BY258)","v":0},0,0,0,0,0,0,0,0,0,0]
[{"$f":"IF(COUNTBLANK(C249:IV249)=254,\"odstr\",IF(AND($A$1=\"TISK\",SUM(J195:U195)=0),\"odstr\",\"OK\"))","v":{"$error":"#REF!"}},"OK",null,null,null,null,null,null,null,null,null,null,null,null,null,null,null,null,null,null,null,null,null,6459,null,"Investiční půjčené prostředky ostatním příspěvkovým organizacím ",null,null,0,3222,3222,{"$f":"AE259/AD259","v":1},0,3222,3222,{"$f":"AI259/AH259","v":1},0,0,0,"x",null,null,null,6459,null,"Investiční půjčené prostředky ostatním příspěvkovým organizacím ",null,null,null,null,null,null,null,null,null,null,null,null,null,"x",null,null,6459,null,"Investiční půjčené prostředky ostatním příspěvkovým organizacím ",null,null,0,0,0,0,0,0,0,0,0,0,0,0]
[{"$f":"IF(COUNTBLANK(C250:IV250)=254,\"odstr\",IF(AND($A$1=\"TISK\",SUM(J196:U196)=0),\"odstr\",\"OK\"))","v":{"$error":"#REF!"}},"OK",null,null,null,null,null,null,null,null,null,null,null,null,null,null,null,null,null,null,null,null,null,69,"Ostatní kapitálové výdaje","Ostatní kapitálové výdaje",null,null,{"$f":"AC261","v":834778.73},{"$f":"AD261","v":164131.44509000002},{"$f":"AE261","v":0},"x",{"$f":"AG261","v":302608},{"$f":"AH261","v":85738.311959999992},0,"x",{"$f":"AK261","v":532170.73},{"$f":"AL261","v":78393.133130000002},{"$f":"SUM(AM261:AM263)","v":0},"x",null,null,null,69,"Ostatní kapitálové výdaje","Ostatní kapitálové výdaje",null,null,{"$f":"BA260+BE260","v":740042.1},106186.84684000001,0,{"$f":"AY260/AX260","v":0},{"$f":"BA261","v":431004},{"$f":"BB261","v":76302.081930000015},{"$f":"BC261","v":0},{"$f":"BC260/BB260","v":0},{"$f":"BE261","v":309038.09999999998},{"$f":"BF261","v":29884.764909999998},{"$f":"BG261","v":0},{"$f":"BG260/BF260","v":0},null,null,69,"Ostatní kapitálové výdaje","Ostatní kapitálové výdaje",null,null,818427.91800000006,403166.35823999997,0,{"$f":"BR260/BQ260","v":0},{"$f":"BT261","v":422016.80700000003},{"$f":"BU261","v":354932.18930999999},{"$f":"BV261","v":0},{"$f":"BV260/BU260","v":0},{"$f":"BX261","v":396411.11100000003},{"$f":"BY261","v":48234.168929999993},{"$f":"BZ261","v":0},{"$f":"BZ260/BY260","v":0}]
[{"$f":"IF(COUNTBLANK(C251:IV251)=254,\"odstr\",IF(AND($A$1=\"TISK\",SUM(J197:U197)=0),\"odstr\",\"OK\"))","v":{"$error":"#REF!"}},"OK",null,null,null,null,null,null,null,null,null,null,null,null,null,null,null,null,null,null,null,null,null,690,null,"Ostatní kapitálové výdaje",null,null,{"$f":"SUM(AC262:AC263)","v":834778.73},{"$f":"SUM(AD262:AD263)","v":164131.44509000002},0,"x",{"$f":"AG262","v":302608},{"$f":"SUM(AH262:AH263)","v":85738.311959999992},{"$f":"AI262+AI263","v":0},"x",{"$f":"SUM(AK262:AK263)","v":532170.73},{"$f":"SUM(AL262:AL263)","v":78393.133130000002},0,"x",null,null,null,690,"Ostatní kapitálové výdaje",null,null,null,740042.1,106186.84684000001,0,{"$f":"AY261/AX261","v":0},{"$f":"SUM(BA262:BA263)","v":431004},{"$f":"SUM(BB262:BB263)","v":76302.081930000015},{"$f":"SUM(BC262:BC263)","v":0},{"$f":"BC261/BB261","v":0},{"$f":"SUM(BE262:BE263)","v":309038.09999999998},{"$f":"SUM(BF262:BF263)","v":29884.764909999998},{"$f":"SUM(BG262:BG263)","v":0},{"$f":"BG261/BF261","v":0},null,null,690,"Ostatní kapitálové výdaje",null,null,null,818427.91800000006,403166.35823999997,0,{"$f":"BR261/BQ261","v":0},{"$f":"SUM(BT262:BT263)","v":422016.80700000003},{"$f":"SUM(BU262:BU263)","v":354932.18930999999},{"$f":"SUM(BV262:BV263)","v":0},{"$f":"BV261/BU261","v":0},{"$f":"SUM(BX262:BX263)","v":396411.11100000003},{"$f":"SUM(BY262:BY263)","v":48234.168929999993},{"$f":"SUM(BZ262:BZ263)","v":0},{"$f":"BZ261/BY261","v":0}]
[null,null,null,null,null,null,null,null,null,null,null,null,null,null,null,null,null,null,null,null,null,null,null,6901,null,"Rezervy kapitálových výdajů",null,null,476876.83,148324.74509000001,0,"x",302608,72931.611959999995,0,"x",174268.83,75393.133130000002,0,"x",null,null,null,6901,null,"Rezervy kapitálových výdajů",null,null,619298.19999999995,87268.488819999999,0,{"$f":"AY262/AX262","v":0},429504,65996.930900000007,0,{"$f":"BC262/BB262","v":0},189794.2,21271.557919999999,0,{"$f":"BG262/BF262","v":0},null,null,6901,null,"Rezervy kapitálových výdajů",null,null,642207.91800000006,373840.00290999998,0,{"$f":"BR262/BQ262","v":0},422016.80700000003,327662.68930999999,0,{"$f":"BV262/BU262","v":0},220191.111,46177.313599999994,0,{"$f":"BZ262/BY262","v":0}]
[{"$f":"IF(COUNTBLANK(C257:IV257)=254,\"odstr\",IF(AND($A$1=\"TISK\",SUM(J198:U198)=0),\"odstr\",\"OK\"))","v":{"$error":"#REF!"}},"OK",null,null,null,null,null,null,null,null,null,null,null,null,null,null,null,null,null,null,null,null,null,6909,null,"Ostatní kapitálové výdaje jinde nezařazené",null,null,357901.9,15806.7,0,"x",0,12806.7,0,"x",357901.9,3000,0,"x",null,null,null,6909,null,"Ostatní kapitálové výdaje jinde nezařazené",null,null,120743.9,18918.35802,0,{"$f":"AY263/AX263","v":0},1500,10305.151030000001,0,{"$f":"BC263/BB263","v":0},119243.9,8613.2069900000006,0,{"$f":"BG263/BF263","v":0},null,null,6909,null,"Ostatní kapitálové výdaje jinde nezařazené",null,null,176220,29326.355329999999,0,{"$f":"BR263/BQ263","v":0},0,27269.5,0,{"$f":"BV263/BU263","v":0},176220,2056.8553299999999,0,{"$f":"BZ263/BY263","v":0}]
[{"$f":"IF(COUNTBLANK(C258:IV258)=254,\"odstr\",IF(AND($A$1=\"TISK\",SUM(J199:U199)=0),\"odstr\",\"OK\"))","v":{"$error":"#REF!"}},"OK",null,null,null,null,null,null,null,null,null,null,null,null,null,null,null,null,null,null,null,null,null,"Výdaje kapitoly 700-Obce a DSO; KÚ (část: vzdělávání) celkem",null,null,null,null,{"$f":"AC14+AC191","v":94879180.29508999},{"$f":"AD14+AD191","v":177349502.28656003},{"$f":"AE14+AE191","v":167192182.84990999},{"$f":"AE264/AD264","v":0.94272710492168221},{"$f":"AG14+AG191","v":42713174.71909},{"$f":"AH14+AH191","v":59228771.017800011},{"$f":"AI14+AI191","v":52346147.075219996},{"$f":"AI264/AH264","v":0.88379593524722},{"$f":"AK14+AK191","v":52166005.575999998},{"$f":"AL14+AL191","v":118174700.47956},{"$f":"AM14+AM191","v":115025006.44645},{"$f":"AM264/AL264","v":0.97334713758250824},null,null,"Výdaje kapitoly 700-Obce a DSO; KÚ (část: vzdělávání) celkem",null,null,null,null,null,102499775.11601999,200525107.33769995,192387691.77906001,{"$f":"AY264/AX264","v":0.95941946788271304},{"$f":"BA14+BA191","v":45582172.868020006},{"$f":"BB14+BB191","v":64801987.533010006},{"$f":"BC14+BC191","v":58479543.847120002},{"$f":"BC264/BB264","v":0.90243441711306516},{"$f":"BE14+BE191","v":56917602.247999996},{"$f":"BF14+BF191","v":135723119.80468994},{"$f":"BG14+BG191","v":133908147.93194},{"$f":"BG264/BF264","v":0.98662739350995066},null,"Výdaje kapitoly 700-Obce a DSO; KÚ (část: vzdělávání) celkem",null,null,null,null,null,114087491.61570999,215329119.63151005,206657692.35187003,{"$f":"BR264/BQ264","v":0.95972942584598253},{"$f":"SUM(BT14,BT191)","v":48213773.785709992},{"$f":"SUM(BU14,BU191)","v":63474651.543850005},{"$f":"SUM(BV14,BV191)","v":56480346.039160006},{"$f":"BV264/BU264","v":0.88980946985021026},{"$f":"SUM(BX14,BX191)","v":65873717.830000006},{"$f":"SUM(BY14,BY191)","v":151854468.08766004},{"$f":"SUM(BZ14,BZ191)","v":150177346.31271002},{"$f":"BZ264/BY264","v":0.98895572981111179}]
[null,null,null,null,null,null,null,null,null,null,null,null,null,null,null,null,null,null,null,null,null,null,"Komentáře:",null,null,null,null,null,null,null,null,null,null,null,null,null,null,null,null,"Zdroj: Závěrečný účet – kapitola 700-Obce a DSO; KÚ (část: vzdělávání); monitor.statnipokladna.cz",null,null,"Komentáře:",null,null,null,null,null,null,null,null,null,null,null,null,null,null,null,null,"Zdroj: Závěrečný účet – kapitola 700-Obce a DSO; KÚ (část: vzdělávání); monitor.statnipokladna.cz",null,"Komentáře:",null,null,null,null,null,null,null,null,null,null,null,null,null,null,null,null,"Zdroj: Závěrečný účet – kapitola 700-Obce a DSO; KÚ (část: vzdělávání); monitor.statnipokladna.cz"]
[{"$f":"IF(COUNTBLANK(C260:IV260)=254,\"odstr\",IF(AND($A$1=\"TISK\",SUM(J200:U200)=0),\"odstr\",\"OK\"))","v":{"$error":"#REF!"}},"OK",null,null,null,null,null,null,null,null,null,null,null,null,null,null,null,null,null,null,null,null,"1)","Tabulka neobsahuje z daných tříd následující položky: 5321, 5323, 5329, 5344, 5345, 5349, 5366, 5367, 5641, 5642, 5649, 6341, 6342, 6349, 6441, 6442, 6449.",null,null,null,null,null,null,null,null,null,null,null,null,null,null,null,null,null,null,"1)","Tabulka neobsahuje z daných tříd následující položky: 5321, 5323, 5329, 5344, 5345, 5349, 5366, 5367, 5641, 5642, 5649, 6341, 6342, 6349, 6441, 6442, 6449.",null,null,null,null,null,null,null,null,null,null,null,null,null,null,null,null,null,"1)","Tabulka neobsahuje z daných tříd následující položky: 5321, 5323, 5329, 5344, 5345, 5349, 5366, 5367, 5641, 5642, 5649, 6341, 6342, 6349, 6441, 6442, 6449."]
[]
[{"$f":"IF(COUNTBLANK(C262:IV262)=254,\"odstr\",IF(AND($A$1=\"TISK\",SUM(J201:U201)=0),\"odstr\",\"OK\"))","v":{"$error":"#REF!"}},"OK"]
[]
[]
[{"$f":"IF(COUNTBLANK(C265:IV265)=254,\"odstr\",IF(AND($A$1=\"TISK\",SUM(J204:U204)=0),\"odstr\",\"OK\"))","v":{"$error":"#REF!"}},"OK"]
[{"$f":"IF(COUNTBLANK(C266:IV266)=254,\"odstr\",IF(AND($A$1=\"TISK\",SUM(J205:U205)=0),\"odstr\",\"OK\"))","v":{"$error":"#REF!"}},"OK"]
[{"$f":"IF(COUNTBLANK(C267:IV267)=254,\"odstr\",IF(AND($A$1=\"TISK\",SUM(J206:U206)=0),\"odstr\",\"OK\"))","v":"odstr"},"OK"]
["konst","stop"]
[{"$f":"IF(COUNTBLANK(D208:E208)=2,\"odstr\",\"OK\")","v":"OK"}]
[{"$f":"IF(COUNTBLANK(D209:E209)=2,\"odstr\",\"OK\")","v":"odstr"}]
["stop"]

{"sheet":"B8","index":8,"n_rows":93,"n_cols":33,"rows_kept":93,"cut":false,"hidden":false,"merged":[[73,27,73,28],[75,27,75,28],[90,25,90,32],[8,24,12,25],[8,27,12,28],[8,30,12,30],[8,31,12,31],[8,32,12,32],[73,16,73,17],[75,16,75,17],[90,14,90,21],[8,13,12,14],[8,16,12,17],[8,19,12,19],[8,20,12,20],[8,21,12,21],[76,4,76,11],[8,11,12,11],[8,6,12,7],[8,3,12,4],[8,9,12,9],[8,10,12,10],[62,6,62,7],[60,6,60,7]]}
[{"$error":"#REF!"},0,{"$error":"#REF!"},{"$error":"#REF!"},{"$error":"#REF!"},8]
["konst"]
["konst","57x3",null,"Tab. B8:",null,null,null,"Běžné a kapitálové výdaje kapitoly 333-MŠMT – podle paragrafů",null,null,null,null,null,"Tab. B8:",null,null,null,"Běžné a kapitálové výdaje kapitoly 333-MŠMT – podle paragrafů",null,null,null,null,null,null,"Tab. B8:",null,null,null,"Běžné a kapitálové výdaje kapitoly 333-MŠMT – podle paragrafů"]
["konst",169,null,{"$error":"#REF!"},null,null,null,"Běžné a kapitálové výdaje kapitoly 333-MŠMT – podle paragrafů",null,null,null,null,null,{"$error":"#REF!"},null,null,null,"Běžné a kapitálové výdaje kapitoly 333-MŠMT – podle paragrafů",null,null,null,null,null,null,{"$error":"#REF!"},null,null,null,"Běžné a kapitálové výdaje kapitoly 333-MŠMT – podle paragrafů"]
["odstr",0]
["odstr","Řádky pro"]
["odstr","ročenku PaM"]
["konst",null,null,"(podle stavu k: 31. 12. 2017)",null,null,null,null,null,null,null,"v tis. Kč",null,"(podle stavu k: 31. 12. 2019)",null,null,null,null,null,null,null,"v tis. Kč",null,null,"(podle stavu k: 31. 12. 2020)",null,null,null,null,null,null,null,"v tis. Kč"]
["konst",null,null,"Paragraf",null,null,"Název",null,null,"Běžné výdaje","Kapitálové výdaje","Výdaje celkem",null,"Paragraf",null,null,"Název",null,null,"Běžné výdaje","Kapitálové výdaje","Výdaje celkem",null,null,"Paragraf",null,null,"Název",null,null,"Běžné výdaje","Kapitálové výdaje","Výdaje celkem"]
["konst"]
["konst"]
["konst"]
["konst"]
[{"$error":"#REF!"},"OK",null,null,"SKUPINA 3 – služby pro obyvatelstvo",null,null,null,null,151737564.10931998,5632649.0073900009,157370213.11671004,null,null,"SKUPINA 3 – služby pro obyvatelstvo",null,null,null,null,199377184.40000001,11009947.6,{"$f":"SUM(T14:U14)","v":210387132},null,null,null,"SKUPINA 3 – služby pro obyvatelstvo",null,null,null,null,{"$f":"SUM(AE15,AE61,AE64,AE70,AE73)","v":218155650.58472002},9101075,{"$f":"SUM(AE14:AF14)","v":227256725.58472002}]
[{"$error":"#REF!"},"OK",null,null,null,null,"31–32 – vzdělávání ",null,null,142356162.19747001,3428037.6649400005,145784199.86241001,null,null,null,null,"31 a 32 – vzdělávání a školské služby",null,null,188633837.19999999,8094799.7000000002,{"$f":"SUM(T15:U15)","v":196728636.89999998},null,null,null,null,null,"31 a 32 – vzdělávání a školské služby",null,null,{"$f":"SUM(AE16,AE21,AE28,AE33,AE41,AE43,AE46,AE48,AE51,AE55)","v":207751713.97672004},{"$f":"SUM(AF16,AF21,AF28,AF33,AF41,AF43,AF46,AF48,AF51,AF55)","v":5627470.4100000001},{"$f":"SUM(AE15:AF15)","v":213379184.38672003}]
[null,null,null,null,3111,null," Mateřské školy",null,null,632221.16760000004,0,632221.16760000004,null,null,311,null,"Předškolní a základní vzdělávání",null,null,{"$f":"SUM(T17:T20)","v":5586213.4260099996},{"$f":"SUM(U17:U20)","v":14582.756080000001},{"$f":"SUM(V17:V20)","v":5600796.1820899993},null,null,null,311,null,"Předškolní a základní vzdělávání",null,null,{"$f":"SUM(AE17:AE20)","v":2306498.4410800003},1584.25,{"$f":"SUM(AE16:AF16)","v":2308082.6910800003}]
[{"$error":"#REF!"},"OK",null,null,3112,null," Mateřské školy pro děti se speciálními vzdělávacími  potřebami",null,null,36864.961000000003,0,36864.961000000003,null,null,3111,null," Mateřské školy",null,null,931008.3203299999,382.7,931391.02032999985,null,null,null,3111,null," Mateřské školy",null,null,410134.36,339.3,{"$f":"SUM(AE17:AF17)","v":410473.66}]
[{"$error":"#REF!"},"OK",null,null,3113,null," Základní školy",null,null,2086843.0524300002,400,2087243.0524300002,null,null,3112,null," Mateřské školy pro děti se speciálními vzdělávacími  potřebami",null,null,55087.668999999994,0,55087.668999999994,null,null,null,3112,null," Mateřské školy pro děti se speciálními vzdělávacími  potřebami",null,null,56787.231,0,{"$f":"SUM(AE18:AF18)","v":56787.231}]
[{"$error":"#REF!"},"OK",null,null,3114,null," Základní školy pro žáky se speciálními vzdělávacími potřebami",null,null,484834.18449000001,2767.5210000000002,487601.70549000002,null,null,3113,null," Základní školy",null,null,3884368.3904999993,1028,3885396.3904999993,null,null,null,3113,null," Základní školy",null,null,1147351.34519,"1 137,95",1148489.25]
[{"$error":"#REF!"},"OK",null,null,3121,null," Gymnázia",null,null,514381.04879999999,212,514593.04879999999,null,null,3114,null," Základní školy pro žáky se speciálními vzdělávacími potřebami",null,null,715749.04618000006,13172.05608,728921.10226000007,null,null,null,3114,null," Základní školy pro žáky se speciálními vzdělávacími potřebami",null,null,692225.50488999998,107,{"$f":"SUM(AE20:AF20)","v":692332.50488999998}]
[null,null,null,null,3122,null," Střední odborné školy",null,null,331534.96978999994,3800,335334.96978999994,null,null,312,null,null,"Střední vzdělávání a vzdělávání v konzervatořích",null,{"$f":"SUM(T22:T27)","v":1826266.7060099998},{"$f":"SUM(U22:U27)","v":6597.8686199999993},{"$f":"SUM(V22:V27)","v":1832864.5746300002},null,null,null,312,null,null,"Střední vzdělávání a vzdělávání v konzervatořích",null,{"$f":"SUM(AE22:AE27)","v":1758178.42931},{"$f":"SUM(AF22:AF27)","v":7373.9699999999993},1765552.39931]
[{"$error":"#REF!"},"OK",null,null,3123,null," Střední školy poskytující střední vzdělání s výučním listem",null,null,114334.54172999998,149,114483.54172999998,null,null,3121,null," Gymnázia",null,null,669853.12252000009,0,669853.12252000009,null,null,null,3121,null," Gymnázia",null,null,684979.29847000004,419.05,685398.34847000008]
[{"$error":"#REF!"},"OK",null,null,3124,null," Střední školy a konzervatoře pro žáky se speciálními  vzdělávacími potřebami",null,null,291067.79423,18695.463949999998,309763.25818,null,null,3122,null," Střední odborné školy",null,null,485216.97141,2112.172,487329.14341000002,null,null,null,3122,null," Střední odborné školy",null,null,458915.15573,237.27,459152.42573000002]
[{"$error":"#REF!"},"OK",null,null,3126,null," Konzervatoře",null,null,37237.4666,0,37237.4666,null,null,3123,null," Střední školy poskytující střední vzdělání s výučním listem",null,null,145916.94505000001,0,145916.94505000001,null,null,null,3123,null," Střední školy poskytující střední vzdělání s výučním listem",null,null,157739.53291000001,720,158459.53291000001]
[{"$error":"#REF!"},"OK",null,null,3128,null," Sportovní školy - gymnázia",null,null,82999.92,0,82999.92,null,null,3124,null," Střední školy a konzervatoře pro žáky se speciálními  vzdělávacími potřebami",null,null,363554.92920000001,4485.6966199999997,368040.62582000002,null,null,null,3124,null," Střední školy a konzervatoře pro žáky se speciálními  vzdělávacími potřebami",null,null,395814.81219999999,5997.65,401812.46220000001]
[{"$error":"#REF!"},"OK",null,null,3131,null," Výchovné ústavy a dětské domovy se školou",null,null,879998.95919999992,10554.384460000001,890553.3436599999,null,null,3126,null," Konzervatoře",null,null,51680.137830000007,0,51680.137830000007,null,null,null,3126,null," Konzervatoře",null,null,58692.364999999998,0,58692.364999999998]
[{"$error":"#REF!"},"OK",null,null,3132,null," Diagnostické ústavy",null,null,325747.43360000005,5927.8786,331675.31220000004,null,null,3128,null," Sportovní školy - gymnázia",null,null,110044.6,0,110044.6,null,null,null,3128,null," Sportovní školy - gymnázia",null,null,2037.2650000000001,0,2037.2650000000001]
[null,null,null,null,3133,null," Dětské domovy",null,null,32072.404999999999,0,32072.404999999999,null,null,313,null,null,"Školská zařízení pro výkon ústavní a ochranné výchovy",null,{"$f":"SUM(T29:T32)","v":1652462.9466300001},{"$f":"SUM(U29:U32)","v":35055.748530000004},{"$f":"SUM(V29:V32)","v":1687518.6951600001},null,null,null,313,null,null,"Školská zařízení pro výkon ústavní a ochranné výchovy",null,{"$f":"SUM(AE29:AE32)","v":1790100.7629999998},14006.32,1804107.0829999999]
[{"$error":"#REF!"},"OK",null,null,3139,null," Ostatní školská zařízení pro výkon ústavní a ochranné výchovy",null,null,127843.736,0,127843.736,null,null,3131,null," Výchovné ústavy a dětské domovy se školou",null,null,1086441.2166300002,27260.653690000003,1113701.8703200002,null,null,null,3131,null," Výchovné ústavy a dětské domovy se školou",null,null,1188783.1510000001,"12 220,38",1201003.58]
[{"$error":"#REF!"},"OK",null,null,3141,null," Školní stravování ",null,null,199275.97099999999,0,199275.97099999999,null,null,3132,null," Diagnostické ústavy",null,null,382575.07900000003,7795.0948399999997,390370.17384,null,null,null,3132,null," Diagnostické ústavy",null,null,399817.95699999999,"1 785,94",401603.94]
[{"$error":"#REF!"},"OK",null,null,3142,null,"Ostatní školní stravování",null,null,null,null,0,null,null,3133,null," Dětské domovy",null,null,23763.906000000003,0,23763.906000000003,null,null,null,3133,null," Dětské domovy",null,null,26914.856,0,{"$f":"SUM(AE31:AF31)","v":26914.856}]
[{"$error":"#REF!"},"OK",null,null,3143,null," Školní družiny a kluby",null,null,108720.727,0,108720.727,null,null,3139,null," Ostatní školská zařízení pro výkon ústavní a ochranné výchovy",null,null,159682.745,0,159682.745,null,null,null,3139,null," Ostatní školská zařízení pro výkon ústavní a ochranné výchovy",null,null,174584.799,0,174584.799]
[null,null,null,null,3145,null," Internáty",null,null,66352.792000000001,0,66352.792000000001,null,null,314,null,"Ostatní zařízení související s výchovou a vzděláváním mládeže",null,null,{"$f":"SUM(T34:T40)","v":917364.35972000007},{"$f":"SUM(U34:U40)","v":372.8},{"$f":"SUM(V34:V40)","v":917737.15972},null,null,null,314,null,"Ostatní zařízení související s výchovou a vzděláváním mládeže",null,null,{"$f":"SUM(AE34:AE40)","v":994446.24004000006},{"$f":"SUM(AF34:AF40)","v":46},994492.24004000006]
[{"$error":"#REF!"},"OK",null,null,3146,null," Zařízení výchovného poradenství ",null,null,50637.398999999998,0,50637.398999999998,null,null,3141,null," Školní stravování ",null,null,238566.56200000001,0,238566.56200000001,null,null,null,3141,null," Školní stravování ",null,null,265371.49,0,265371.49]
[{"$error":"#REF!"},"OK",null,null,3147,null," Domovy mládeže",null,null,48663.65,0,48663.65,null,null,3143,null," Školní družiny a kluby",null,null,142285.60700000002,0,142285.60700000002,null,null,null,3143,null," Školní družiny a kluby",null,null,152791.701,0,152791.701]
[{"$error":"#REF!"},"OK",null,null,3148,null," Střediska výchovné péče",null,null,249092.18700000001,0,249092.18700000001,null,null,3145,null," Internáty",null,null,82125.649999999994,0,82125.649999999994,null,null,null,3145,null," Internáty",null,null,80353.31,0,80353.31]
[{"$error":"#REF!"},"OK",null,null,3150,null," Vyšší odborné školy",null,null,105887.0906,0,105887.0906,null,null,3146,null," Zařízení výchovného poradenství ",null,null,76438.219169999997,0,76438.219169999997,null,null,null,3146,null," Zařízení výchovného poradenství ",null,null,79695.530989999999,0,79695.530989999999]
[{"$error":"#REF!"},"odstr",null,null,3211,null," Vysoké školy",null,null,20353220.980069999,2272569.3785600001,22625790.358629998,null,null,3147,null," Domovy mládeže",null,null,65577.228670000011,0,65577.228670000011,null,null,null,3147,null," Domovy mládeže",null,null,78113.876999999993,0,78113.876999999993]
[{"$error":"#REF!"},"OK",null,null,3212,null," Výzkum, vývoj a inovace na vysokých školách",null,null,9173672.3795800004,678645.57242999994,9852317.9520100001,null,null,3148,null," Střediska výchovné péče",null,null,305516.14899999998,0,305516.14899999998,null,null,null,3148,null," Střediska výchovné péče",null,null,330817.05800000002,0,330817.05800000002]
[null,null,null,null,3221,null," Vysokoškolské koleje a menzy",null,null,129947,0,129947,null,null,3149,null," Ostatní zařízení související s výchovou a vzděláváním mládeže",null,null,6854.9438799999998,372.8,7227.74388,null,null,null,3149,null," Ostatní zařízení související s výchovou a vzděláváním mládeže",null,null,7303.2730499999998,46,7349.2730499999998]
[null,null,null,null,3231,null," Základní umělecké školy",null,null,18015.726999999999,0,18015.726999999999,null,null,315,null,null,"Vyšší odborné vzdělávání",null,{"$f":"SUM(T42)","v":187710.5368},{"$f":"SUM(U42)","v":0},{"$f":"SUM(V42)","v":187710.5368},null,null,null,315,null,null,"Vyšší odborné vzdělávání",null,{"$f":"AE42","v":186479.87023999999},{"$f":"AF42","v":0},186479.87023999999]
[{"$error":"#REF!"},"OK",null,null,3233,null," Střediska volného času",null,null,106034.5122,0,106034.5122,null,null,3150,null," Vyšší odborné školy",null,null,187710.5368,0,187710.5368,null,null,null,3150,null," Vyšší odborné školy",null,null,186479.87023999999,0,186479.87023999999]
[null,null,null,null,3261,null," Činnost ústředního orgánu státní správy ve vzdělávání",null,null,460364.35218999995,11461.976110000001,471826.32829999994,null,null,321,null," Vysokoškolské vzdělávání",null,null,{"$f":"SUM(T44:T45)","v":37250752.283920005},{"$f":"SUM(U44:U45)","v":7516778.2710600002},{"$f":"SUM(V44:V45)","v":44767530.554980002},null,null,null,321,null," Vysokoškolské vzdělávání",null,null,{"$f":"SUM(AE44:AE45)","v":38561131.981759995},5193353.33,43754485.311759993]
[{"$error":"#REF!"},"OK",null,null,3262,null," Činnost ostatních orgánů státní správy ve vzdělávání",null,null,367025.71273999999,11248.5843,378274.29703999998,null,null,3211,null," Vysoké školy",null,null,25273685.568950001,5617507.2670100005,30891192.835960001,null,null,null,3211,null," Vysoké školy",null,null,25599880.44946,"3 413 259,53",29013139.93]
[{"$error":"#REF!"},"OK",null,null,3269,null," Ostatní správa ve vzdělávání jinde nezařazená",null,null,null,null,0,null,null,3212,null," Výzkum, vývoj a inovace na vysokých školách",null,null,11977066.71497,1899271.0040499999,13876337.71902,null,null,null,3212,null," Výzkum, vývoj a inovace na vysokých školách",null,null,12961251.532299999,1780093.8,14741345.300000001]
[null,null,null,null,3291,null," Mezinárodní spolupráce ve vzdělávání",null,null,17503.67021,0,17503.67021,null,null,322,null,"Zařízení související s vysokoškolským vzděláváním",null,null,{"$f":"SUM(T47)","v":113311},{"$f":"SUM(U47)","v":0},{"$f":"SUM(V47)","v":113311},null,null,null,322,null,"Zařízení související s vysokoškolským vzděláváním",null,null,{"$f":"AE47","v":107145.55971},{"$f":"AF47","v":0},{"$f":"SUM(AE46:AF46)","v":107145.55971}]
[{"$error":"#REF!"},"OK",null,null,3292,null," Vzdělávání národnostních menšin a multikulturní výchova",null,null,10200.973,0,10200.973,null,null,3221,null," Vysokoškolské koleje a menzy",null,null,113311,0,113311,null,null,null,3221,null," Vysokoškolské koleje a menzy",null,null,107145.55971,0,107145.55971]
[null,null,null,null,3293,null," Vzdělávací akce k integraci Romů",null,null,14328.255999999999,0,14328.255999999999,null,null,323,null,"Základní umělecké, jazykové a zájmové vzdělávání",null,null,{"$f":"SUM(T49:T50)","v":426863.14900000003},{"$f":"SUM(U49:U50)","v":0},{"$f":"SUM(V49:V50)","v":426863.14900000003},null,null,null,323,null,"Základní umělecké, jazykové a zájmové vzdělávání",null,null,{"$f":"SUM(AE49:AE50)","v":198379.7175},{"$f":"SUM(AF49:AF50)","v":0},198379.7175]
[{"$error":"#REF!"},"OK",null,null,3294,null," Zařízení pro další vzdělávání pedagogických pracovníků",null,null,181720.49931000001,0,181720.49931000001,null,null,3231,null," Základní umělecké školy",null,null,243866.42300000001,0,243866.42300000001,null,null,null,3231,null," Základní umělecké školy",null,null,32439.282999999999,0,32439.282999999999]
[{"$error":"#REF!"},"OK",null,null,3299,null," Ostatní záležitosti vzdělávání",null,null,104717516.6781,411605.90553000005,105129122.58363001,null,null,3233,null," Střediska volného času",null,null,182996.72600000002,0,182996.72600000002,null,null,null,3233,null," Střediska volného času",null,null,165940.4345,0,165940.4345]
[null,null,null,null,null,null,"33 – kultura, církve a sdělovací prostředky",null,null,195991.37335000001,5687.5557100000005,201678.92905999999,null,null,326,null,null,"Správa ve vzdělávání",null,{"$f":"SUM(T52:T54)","v":968395.22251999984},{"$f":"SUM(U52:U54)","v":17101.684680000002},{"$f":"SUM(V52:V54)","v":985496.90720000002},null,null,null,326,null,null,"Správa ve vzdělávání",null,{"$f":"SUM(AE52:AE54)","v":975504.89614000008},51872.959999999999,1027377.85614]
[{"$error":"#REF!"},"OK",null,null,3314,null,"činnosti knihovnické",null,null,157368.82399999999,1693,159061.82399999999,null,null,3261,null," Činnost ústředního orgánu státní správy ve vzdělávání",null,null,519346.83982999995,16035.674680000002,535382.51451000001,null,null,null,3261,null," Činnost ústředního orgánu státní správy ve vzdělávání",null,null,502462.47518000001,48113.59,550576.06518000003]
[{"$error":"#REF!"},"OK",null,null,3315,null,"činnosti muzeí a galerií",null,null,38622.549350000001,3994.5557100000001,42617.105060000002,null,null,3262,null," Činnost ostatních orgánů státní správy ve vzdělávání",null,null,449048.38268999994,1066.01,450114.39268999995,null,null,null,3262,null," Činnost ostatních orgánů státní správy ve vzdělávání",null,null,473042.42096000002,"3 759,36",476801.76]
[{"$error":"#REF!"},"OK",null,null,null,null,"34 – tělovýchova a zájmová činnost",null,null,4424350.2016500002,109580.87097000002,4533931.0726199998,null,null,3269,null," Ostatní správa ve vzdělávání jinde nezařazená",null,null,0,0,0,null,null,null,3269,null," Ostatní správa ve vzdělávání jinde nezařazená",null,null,0,0,0]
[null,null,null,null,3411,null,"státní sportovní reprezentace",null,null,1342321.3203099999,179.80351999999999,1342501.1238299999,null,null,329,null,null,"Ostatní činnost a nespecifikované výdaje",null,{"$f":"SUM(T56:T60)","v":139704497.73987001},{"$f":"SUM(U56:U60)","v":504310.51304000005},{"$f":"SUM(V56:V60)","v":140208808.25291002},null,null,null,329,null,null,"Ostatní činnost a nespecifikované výdaje",null,{"$f":"SUM(AE56:AE60)","v":160873848.07794002},{"$f":"SUM(AF56:AF60)","v":359233.58},{"$f":"SUM(AE55:AF55)","v":161233081.65794003}]
[{"$error":"#REF!"},"OK",null,null,3419,null,"ostatní tělovýchovná činnost",null,null,2824409.5679000001,86397.865780000007,2910807.4336800002,null,null,3291,null," Mezinárodní spolupráce ve vzdělávání",null,null,21548.947139999997,0,21548.947139999997,null,null,null,3291,null," Mezinárodní spolupráce ve vzdělávání",null,null,12639.51678,0,12639.51678]
[null,null,null,null,3421,null,"využití volného času dětí a mládeže",null,null,257619.31344,23003.201670000002,280622.51510999998,null,null,3292,null," Vzdělávání národnostních menšin a multikulturní výchova",null,null,12376.866,0,12376.866,null,null,null,3292,null," Vzdělávání národnostních menšin a multikulturní výchova",null,null,9312.6730000000007,0,9312.6730000000007]
[null,null,null,null,null,null,"35 – zdravotnictví",null,null,12058.397999999999,0,12058.397999999999,null,null,3293,null," Vzdělávací akce k integraci Romů",null,null,13466.121000000001,0,13466.121000000001,null,null,null,3293,null," Vzdělávací akce k integraci Romů",null,null,13469.814,0,13469.814]
[null,null,null,null,3541,null,"prevence před drogami, alkoholem, nikotinem a jinými návykovými látkami",null,null,12058.397999999999,0,12058.397999999999,null,null,3294,null," Zařízení pro další vzdělávání pedagogických pracovníků",null,null,265539.95399999997,0,265539.95399999997,null,null,null,3294,null," Zařízení pro další vzdělávání pedagogických pracovníků",null,null,377406.38799000002,0,377406.38799000002]
[null,null,null,null,null,null,"38 – ostatní výzkum a vývoj",null,null,4749001.9388499996,2089342.9157700001,6838344.8546199994,null,null,3299,null," Ostatní záležitosti vzdělávání",null,null,139391565.85173002,504310.51304000005,139895876.36477003,null,null,null,3299,null," Ostatní záležitosti vzdělávání",null,null,160461019.68617001,359233.58,160820253.26617002]
[{"$error":"#REF!"},"OK",null,null,3809,null,"ostatní  výzkum a vývoj odvětvově nespecifikovaný",{"$error":"#N/A"},null,4749001.9388499996,2089342.9157700001,6838344.8546199994,null,null,null,null,"33 – kultura, církve a sdělovací prostředky",null,null,{"$f":"SUM(T62:T63)","v":216014.133},{"$f":"SUM(U62:U63)","v":0},{"$f":"SUM(V62:V63)","v":216014.133},null,null,null,null,null,"33 – kultura, církve a sdělovací prostředky",null,null,{"$f":"SUM(AE62:AE63)","v":237952.20799999998},{"$f":"SUM(AF62:AF63)","v":0},237952.20799999998]
[{"$error":"#REF!"},"OK",null,null,"SKUPINA 4 – sociální věci a politika zaměstnanosti",null,null,null,null,0,0,0,null,null,3314,null,"Činnosti knihovnické",null,null,173983.24400000001,0,173983.24400000001,null,null,null,3314,null,"Činnosti knihovnické",null,null,194968.58799999999,0,194968.58799999999]
[{"$error":"#REF!"},"OK",null,null,null,null,"43 – sociální služby a společné činnosti v sociálním zabezpečení a politice zaměstnanosti",null,null,0,0,0,null,null,3315,null,"Činnosti muzeí a galerií",null,null,42030.889000000003,0,42030.889000000003,null,null,null,3315,null,"Činnosti muzeí a galerií",null,null,42983.62,0,42983.62]
[{"$error":"#REF!"},"OK",null,null,4322,null,"ústavy péče pro mládež",null,null,0,0,0,null,null,null,null,"34 – tělovýchova a zájmová činnost",null,null,5345871.9000000004,1462819.5,6808691.2999999998,null,null,null,null,null,"34 – tělovýchova a zájmová činnost",null,null,{"$f":"SUM(AE65,AE68)","v":5091031.42},2081624.49,7172655.9100000001]
[null,null,null,null,"SKUPINA 5 – bezpečnost státu a právní ochrana",null,null,null,null,17728.292009999997,0,17728.292009999997,null,null,341,null,"Tělovýchova",null,null,{"$f":"SUM(T66:T67)","v":4919847.3511699997},{"$f":"SUM(U66:U67)","v":1444036.3962699999},{"$f":"SUM(V66:V67)","v":6363883.7474400001},null,null,null,341,null,"Tělovýchova",null,null,{"$f":"SUM(AE66:AE67)","v":4860710.88},{"$f":"SUM(AF66:AF67)","v":2057462.5899999999},6918173.4699999997]
[{"$error":"#REF!"},"OK",null,null,null,null,"52 – civilní připravenost na krizové stavy",null,null,52.42501,0,52.42501,null,null,3411,null,"Státní sportovní reprezentace",null,null,2021341.9570800001,165314.34294999999,2186656.30003,null,null,null,3411,null,"Státní sportovní reprezentace",null,null,1933673.41,195575.61,2129249.02]
[{"$error":"#REF!"},"OK",null,null,5299,null,"ostatní záležitosti civilní připravenosti na krizové stavy",null,null,52.42501,0,52.42501,null,null,3419,null,"Ostatní tělovýchovná činnost",null,null,2898505.3940900001,1278722.0533199999,4177227.44741,null,null,null,3419,null,"Ostatní tělovýchovná činnost",null,null,2927037.47,1861886.98,4788924.45]
[null,null,null,null,null,null,"53 – bezpečnost a veřejný pořádek",null,null,17675.866999999998,0,17675.866999999998,null,null,342,null,"Zájmová činnost a rekreace",null,null,{"$f":"SUM(T69)","v":426024.46560000005},{"$f":"SUM(U69)","v":18783.112850000001},{"$f":"SUM(V69)","v":444807.57845000003},null,null,null,342,null,"Zájmová činnost a rekreace",null,null,{"$f":"AE69","v":230320.54},{"$f":"AF69","v":24161.89},254482.43]
[{"$error":"#REF!"},"OK",null,null,5399,null,"ostatní záležitosti bezpečnosti, veřejného pořádku",null,null,17675.866999999998,0,17675.866999999998,null,null,3421,null,"Využití volného času dětí a mládeže",null,null,426024.46560000005,18783.112850000001,444807.57845000003,null,null,null,3421,null,"Využití volného času dětí a mládeže",null,null,230320.54,24161.89,254482.43]
[{"$error":"#REF!"},"OK",null,null,"SKUPINA 6 – všeobecná veřejná správa a služby",null,null,null,null,123498.61540000001,0,123498.61540000001,null,null,null,null,"35 – zdravotnictví",null,null,{"$f":"SUM(T71)","v":19011.695},0,19011.695,null,null,null,null,null,"35 – zdravotnictví",null,null,{"$f":"AE71","v":3542.2},{"$f":"AF71","v":0},3542.2]
[null,null,null,null,null,null,"62 – jiné veřejné služby a činnosti",null,null,123498.61540000001,0,123498.61540000001,null,null,354,null,"Zdravotnické programy",null,null,19011.695,0,19011.695,null,null,null,354,null,"Zdravotnické programy",null,null,{"$f":"AE72","v":3542.2},{"$f":"AF72","v":0},3542.2]
[{"$error":"#REF!"},"OK",null,null,6221,null,"humanitární zahraniční pomoc",null,null,7431.1220000000003,0,7431.1220000000003,null,null,3541,null,"Prevence před drogami, alkoholem, nikotinem a jinými závislostmi",null,null,19011.695,0,19011.695,null,null,null,3541,null,"Prevence před drogami, alkoholem, nikotinem a jinými závislostmi",null,null,3542.2,0,3542.2]
[{"$error":"#REF!"},"OK",null,null,6222,null,"rozvojová zahraniční pomoc",null,null,115277.51640000001,0,115277.51640000001,null,null,null,null,"38 – ostatní výzkum a vývoj",null,null,{"$f":"SUM(T74)","v":5162449.5106100002},{"$f":"SUM(U74)","v":1452328.43897},{"$f":"SUM(V74)","v":6614777.9495800007},null,null,null,null,null,"38 – ostatní výzkum a vývoj",null,null,{"$f":"AE74","v":5071410.78},{"$f":"AF74","v":1391980.08},6463390.8600000003]
[{"$error":"#REF!"},"OK",null,null,6229,null,"ostatní zahraniční pomoc",null,null,789.97699999999998,0,789.97699999999998,null,null,3809,null,"Ostatní  výzkum a vývoj odvětvově nespecifikovaný",{"$error":"#N/A"},null,5162449.5106100002,1452328.43897,6614777.9495800007,null,null,null,3809,null,"Ostatní  výzkum a vývoj odvětvově nespecifikovaný",{"$error":"#N/A"},null,5071410.78,1391980.08,6463390.8600000003]
[{"$error":"#REF!"},"OK",null,null,"Celkem kapitola 333-MŠMT",null,null,null,null,151878791.01672998,5632649.0073900009,157511440.02412003,null,null,"SKUPINA 4 – sociální věci a politika zaměstnanosti",null,null,null,null,"x","x","x",null,null,null,"SKUPINA 4 – sociální věci a politika zaměstnanosti",null,null,null,null,"x","x","x"]
[{"$error":"#REF!"},"OK",null,"",null,null,null,null,null,null,null,"Zdroj: Závěrečný účet – kapitola 333-MŠMT",null,null,null,null,"43 – sociální služby a společné činnosti v sociálním zabezpečení a politice zaměstnanosti",null,null,"x","x","x",null,null,null,null,null,"43 – sociální služby a společné činnosti v sociálním zabezpečení a politice zaměstnanosti",null,null,"x","x","x"]
[{"$error":"#REF!"},"OK",null,null,null,null,null,null,null,null,null,null,null,null,4322,null,"zrušen",null,null,"x","x","x",null,null,null,4322,null,"zrušen",null,null,"x","x","x"]
[{"$error":"#REF!"},"OK",null,null,null,null,null,null,null,null,null,null,null,null,"SKUPINA 5 – bezpečnost státu a právní ochrana",null,null,null,null,{"$f":"SUM(T82)","v":7771.7150000000001},0,{"$f":"SUM(V82)","v":7771.7150000000001},null,null,null,"SKUPINA 5 – bezpečnost státu a právní ochrana",null,null,null,null,{"$f":"SUM(AE79,AE82)","v":11068.91},{"$f":"SUM(AF79,AF82)","v":1273.81},{"$f":"SUM(AE78:AF78)","v":12342.72}]
[{"$error":"#REF!"},"OK",null,null,null,null,null,null,null,null,null,null,null,null,null,null,"52 – civilní připravenost na krizové stavy",null,null,{"$f":"SUM(T81)","v":0},{"$f":"SUM(U81)","v":0},{"$f":"SUM(V81)","v":0},null,null,null,null,null,"52 – civilní připravenost na krizové stavy",null,null,{"$f":"SUM(AE80:AE81)","v":2075.9699999999998},{"$f":"SUM(AF80:AF81)","v":1273.81},3349.7799999999997]
[null,null,null,null,null,null,null,null,null,null,null,null,null,null,null,null,null,null,null,null,null,null,null,null,null,5273,null,"Ostatní správa v oblasti krizového řízení",null,null,2075.9699999999998,1273.81,3349.7799999999997]
[{"$error":"#REF!"},"odstr",null,null,null,null,null,null,null,null,null,null,null,null,5299,null,"Ostatní záležitosti civilní připravenosti na krizové stavy",null,null,0,0,0,null,null,null,5299,null,"Ostatní záležitosti civilní připravenosti na krizové stavy",null,null,0,0,0]
[{"$error":"#REF!"},"odstr",null,null,null,null,null,null,null,null,null,null,null,null,null,null,"53 – bezpečnost a veřejný pořádek",null,null,{"$f":"SUM(T83)","v":7771.7150000000001},{"$f":"SUM(U83)","v":0},{"$f":"SUM(V83)","v":7771.7150000000001},null,null,null,null,null,"53 – bezpečnost a veřejný pořádek",null,null,{"$f":"AE83","v":8992.94},{"$f":"AF83","v":0},8992.94]
[{"$error":"#REF!"},"OK",null,null,null,null,null,null,null,null,null,null,null,null,5399,null,"Ostatní záležitosti bezpečnosti, veřejného pořádku",null,null,7771.7150000000001,0,7771.7150000000001,null,null,null,5399,null,"Ostatní záležitosti bezpečnosti, veřejného pořádku",null,null,8992.94,0,8992.94]
[{"$error":"#REF!"},"OK",null,null,null,null,null,null,null,null,null,null,null,null,"SKUPINA 6 – všeobecná veřejná správa a služby",null,null,null,null,{"$f":"SUM(T85)","v":136746.81579999998},{"$f":"SUM(U85)","v":0},{"$f":"SUM(V85)","v":136746.81579999998},null,null,null,"SKUPINA 6 – všeobecná veřejná správa a služby",null,null,null,null,{"$f":"AE85","v":103637.93},{"$f":"AF85","v":0},103637.93]
[{"$error":"#REF!"},"OK",null,null,null,null,null,null,null,null,null,null,null,null,null,null,"62 – jiné veřejné služby a činnosti",null,null,{"$f":"SUM(T86:T88)","v":136746.81579999998},{"$f":"SUM(U86:U88)","v":0},{"$f":"SUM(V86:V88)","v":136746.81579999998},null,null,null,null,null,"62 – jiné veřejné služby a činnosti",null,null,{"$f":"SUM(AE86:AE88)","v":103637.93},{"$f":"SUM(AF86:AF88)","v":0},103637.93]
[{"$error":"#REF!"},"OK",null,null,null,null,null,null,null,null,null,null,null,null,6221,null,"Humanitární zahraniční pomoc přímá",null,null,14695.254999999999,0,14695.254999999999,null,null,null,6221,null,"Humanitární zahraniční pomoc přímá",null,null,0,0,0]
[{"$error":"#REF!"},"OK",null,null,null,null,null,null,null,null,null,null,null,null,6222,null,"Rozvojová zahraniční pomoc",null,null,122051.56079999999,0,122051.56079999999,null,null,null,6222,null,"Rozvojová zahraniční pomoc",null,null,103637.93,0,103637.93]
[{"$error":"#REF!"},"OK",null,null,null,null,null,null,null,null,null,null,null,null,6229,null,"Ostatní zahraniční pomoc",null,null,0,0,0,null,null,null,6229,null,"Ostatní zahraniční pomoc",null,null,0,0,0]
[{"$error":"#REF!"},"OK",null,null,null,null,null,null,null,null,null,null,null,null,"Celkem kapitola 333-MŠMT",null,null,null,null,199521702.90000001,11009947.6,210531650.5,null,null,null,"Celkem kapitola 333-MŠMT",null,null,null,null,{"$f":"SUM(AE14,AE78,AE84)","v":218270357.42472002},9102348.8000000007,{"$f":"SUM(AE89:AF89)","v":227372706.22472003}]
["konst","stop",null,null,null,null,null,null,null,null,null,null,null,"",null,null,null,null,null,null,null,"Zdroj: Závěrečný účet – kapitola 333-MŠMT; monitor.statnipokladny.cz",null,null,"",null,null,null,null,null,null,null,"Zdroj: Závěrečný účet – kapitola 333-MŠMT; monitor.statnipokladny.cz"]
["odstr"]
["odstr"]
["stop"]

{"sheet":"B9","index":9,"n_rows":81,"n_cols":47,"rows_kept":81,"cut":false,"hidden":false,"merged":[[14,34,14,38],[78,35,78,46],[79,35,79,46],[8,34,12,35],[8,37,12,38],[8,40,9,42],[8,43,9,45],[8,46,12,46],[10,40,12,40],[10,41,12,41],[10,42,12,42],[10,43,12,43],[10,44,12,44],[10,45,12,45],[8,3,12,4],[8,6,12,7],[8,9,9,11],[10,9,12,9],[8,17,12,18],[10,14,12,14],[8,15,12,15],[8,12,9,14],[10,10,12,10],[10,11,12,11],[10,12,12,12],[10,13,12,13],[8,20,12,21],[8,23,9,25],[8,26,9,28],[8,29,12,29],[10,23,12,23],[10,24,12,24],[10,25,12,25],[10,26,12,26],[10,27,12,27],[10,28,12,28],[78,18,78,29],[79,18,79,29],[14,17,14,21],[69,4,69,15],[68,4,68,15]]}
[{"$f":"IF(#REF!=\"\",\"ŠABLONA\",IF(#REF!=\"T\",\"TISK\",\"ELEKTRO\"))","v":{"$error":"#REF!"}},0,{"$f":"CONCATENATE(D1,F1,IF(G1<>\"\",\".\",\"\"),G1,IF(H1<>\"\",\".\",\"\"),H1,IF(I1<>\"\",\".\",\"\"),I1,\"\")","v":{"$error":"#REF!"}},{"$f":"IF(#REF!=\"\",\" ?\",#REF!)","v":{"$error":"#REF!"}},{"$f":"CONCATENATE(C1,P1)","v":{"$error":"#REF!"}},9]
["konst"]
["konst","45x6",null,"Tab. B9:",null,null,null,"Běžné a kapitálové výdaje kapitoly 700-Obce a DSO; KÚ (část: 31–32–vzdělávání) – podle paragrafů",null,null,null,null,null,null,null,null,null,"Tab. B9:",null,null,null,"Běžné a kapitálové výdaje kapitoly 700-Obce a DSO; KÚ (část: 31–32–vzdělávání) – podle paragrafů",null,null,null,null,null,null,null,null,null,null,null,null,"Tab. B9:",null,null,"Běžné a kapitálové výdaje kapitoly 700-Obce a DSO; KÚ (část: 31–32–vzdělávání) – podle paragrafů","Běžné a kapitálové výdaje kapitoly 700-Obce a DSO; KÚ (část: 31–32–vzdělávání) – podle paragrafů"]
["konst",{"$f":"COUNTA(Datova_oblast)","v":308},null,{"$f":"IF(D1=\" ?\",\"\",CONCATENATE(\"Tab. \",E1,\":\"))","v":{"$error":"#REF!"}},null,null,null,{"$f":"IF(H3=\"Zadejte název tabulky\",\"\",H3)","v":"Běžné a kapitálové výdaje kapitoly 700-Obce a DSO; KÚ (část: 31–32–vzdělávání) – podle paragrafů"},null,null,null,null,null,null,null,null,null,{"$f":"IF(R1=\" ?\",\"\",CONCATENATE(\"Tab. \",S1,\":\"))","v":"Tab. :"},null,null,null,{"$f":"IF(V3=\"Zadejte název tabulky\",\"\",V3)","v":"Běžné a kapitálové výdaje kapitoly 700-Obce a DSO; KÚ (část: 31–32–vzdělávání) – podle paragrafů"},null,null,null,null,null,null,null,null,null,null,null,null,{"$f":"IF(AI1=\" ?\",\"\",CONCATENATE(\"Tab. \",AJ1,\":\"))","v":"Tab. :"},null,null,null,{"$f":"IF(AM3=\"Zadejte název tabulky\",\"\",AM3)","v":"Běžné a kapitálové výdaje kapitoly 700-Obce a DSO; KÚ (část: 31–32–vzdělávání) – podle paragrafů"}]
[{"$f":"IF(D5=\"\",\"odstr\",\"OK\")","v":"odstr"},0]
[{"$f":"IF(COUNTBLANK(C6:IV6)=254,\"odstr\",\"OK\")","v":"odstr"},"Řádky pro"]
[{"$f":"IF(COUNTBLANK(C7:IV7)=254,\"odstr\",\"OK\")","v":"odstr"},"ročenku PaM"]
["konst",null,null,"(podle stavu k: 31. 12. 2017)",null,null,null,null,null,null,null,null,null,null,null,"v tis. Kč",null,"(podle stavu k: 31. 12. 2019)",null,null,null,null,null,null,null,null,null,null,null,"v tis. Kč",null,null,null,null,"(podle stavu k: 31. 12. 2020)",null,null,null,null,null,null,null,null,null,null,null,"v tis. Kč"]
["konst",null,null,"Paragraf",null,null,"Název",null,null,"Obce a DSO",null,null,"Krajské úřady",null,null,"Výdaje celkem kapitola-Obce a DSO; KÚ",null,"Paragraf",null,null,"Název",null,null,"Obce a DSO",null,null,"Krajské úřady",null,null,"Výdaje celkem kapitola-Obce a DSO; KÚ",null,null,null,null,"Paragraf",null,null,"Název",null,null,"Obce a DSO",null,null,"Krajské úřady",null,null,"Výdaje celkem kapitola-Obce a DSO; KÚ"]
["konst"]
["konst",null,null,null,null,null,null,null,null,"běžné výdaje","kapitálové výdaje","výdaje celkem","běžné výdaje","kapitálové výdaje","výdaje celkem",null,null,null,null,null,null,null,null,"běžné výdaje","kapitálové výdaje","výdaje celkem","běžné výdaje","kapitálové výdaje","výdaje celkem",null,null,null,null,null,null,null,null,null,null,null,"běžné výdaje","kapitálové výdaje","výdaje celkem","běžné výdaje","kapitálové výdaje","výdaje celkem"]
["konst"]
["konst"]
[{"$f":"IF(COUNTBLANK(C14:IV14)=254,\"odstr\",IF(AND($A$1=\"TISK\",SUM(J14:P14)=0),\"odstr\",\"OK\"))","v":{"$error":"#REF!"}},"OK",null,null,"SKUPINA 3 – služby pro obyvatelstvo",null,null,null,null,".",".",".",".",".",".",".",null,null,"SKUPINA 3 – služby pro obyvatelstvo",null,null,null,null,".",".",".",".",".",".",".",null,null,null,null,null,"SKUPINA 3 – služby pro obyvatelstvo",null,null,null,null,".",".",".",".",".",".","."]
[{"$error":"#REF!"},"OK",null,null,null,null,"31–32 – vzdělávání",null,null,31909918.221629996,9391150.86314,41301069.084769987,96891385.572760031,2054009.0902800004,98945394.663040042,140246463.74781004,null,"31–32 – vzdělávání a školské služby",null,null,null,null,null,41527227.899999999,16783579.5,58310807.399999999,127864158.5,5789337.5999999996,133653496.09999999,191964303.23971,null,null,null,null,"31–32 – vzdělávání a školské služby",null,null,null,null,null,{"$f":"SUM(AO16,AO25,AO35,AO40,AO50,AO52,AO57,AO60,AO65,AO69,AO71)","v":40760074.802430004},{"$f":"SUM(AP16,AP25,AP35,AP40,AP50,AP57,AP52,AP60,AP65,AP69,AP71)","v":15763895.647230003},{"$f":"SUM(AQ16,AQ25,AQ35,AQ40,AQ50,AQ52,AQ57,AQ60,AQ65,AQ69,AQ71)","v":56523970.449660003},{"$f":"SUM(AR16,AR25,AR35,AR40,AR50,AR52,AR57,AR60,AR65,AR69,AR71)","v":145721709.54393998},{"$f":"SUM(AS16,AS25,AS35,AS40,AS50,AS52,AS57,AS60,AS65,AS69,AS71)","v":4419792.2698600003},{"$f":"SUM(AT16,AT25,AT35,AT40,AT50,AT52,AT57,AT60,AT65,AT69,AT71)","v":150141501.81379995},{"$f":"SUM(AU16,AU25,AU35,AU40,AU50,AU52,AU57,AU60,AU65,AU69,AU71)","v":206665472.26345998}]
[null,null,null,null,null,null,null,null,null,null,null,null,null,null,null,null,null,null,311,null,"Předškolní a základní vzdělávání",null,null,{"$f":"SUM(X17:X24)","v":32063653.203450002},15585052.438260002,47648705.641709998,77162556.627619997,263800.70069000003,77426357.328309998,125075062.97072999,null,null,null,null,null,311,null,"Předškolní a základní vzdělávání",null,null,{"$f":"SUM(AO17:AO24)","v":30553863.271229997},14323513.886450004,44877377.157679997,89746749.993349984,375666.15473999997,90122416.14808999,134999793.30577001]
[{"$f":"IF(COUNTBLANK(C17:IV17)=254,\"odstr\",IF(AND($A$1=\"TISK\",SUM(J17:P17)=0),\"odstr\",\"OK\"))","v":{"$error":"#REF!"}},"OK",null,null,3111,null," Mateřské školy",null,null,5969406.5809999984,2168605.65637,8138012.2373699984,12823283.04064,239.51650000000001,12823522.55714,20961534.794509999,null,null,3111,null," Mateřské školy",null,null,7281568.1600000001,2756562.6830000002,{"$f":"SUM(X17:Y17)","v":10038130.843},17233365.258730002,98,{"$f":"SUM(AA17:AB17)","v":17233463.258730002},27271594.10193,null,null,null,null,null,3111,null," Mateřské školy",null,null,7159975.9733999986,3124723.1587699996,{"$f":"SUM(AO17:AP17)","v":10284699.132169999},19355599.355519999,38445.4228,{"$f":"SUM(AR17:AS17)","v":19394044.77832},{"$f":"SUM(AQ17,AT17)","v":29678743.910489999}]
[{"$error":"#REF!"},"OK",null,null,3112,null," Mateřské školy pro děti se speciálními vzdělávacími  potřebami",null,null,84581.06180999997,0,84581.06180999997,311322.08869,1474.40085,312796.48953999998,397377.55134999997,null,null,3112,null," Mateřské školy pro děti se speciálními vzdělávacími  potřebami",null,null,102689.09781000001,2553.8870000000002,105242.98481000001,437007.31797999999,659.90169000000003,437667.21967000002,542910.20447999996,null,null,null,null,null,3112,null," Mateřské školy pro děti se speciálními vzdělávacími  potřebami",null,null,92306.152999999991,525.25,92831.402999999991,424439.35745000001,3683.4944,428122.85185000004,520954.25485000003]
[{"$error":"#REF!"},"OK",null,null,3113,null," Základní školy",null,null,16593273.387679989,5617199.8225100003,22210473.210189991,35373541.47257001,876.96169999999995,35374418.434270009,57584891.64446,null,null,3113,null," Základní školy",null,null,22335732.194540001,12188146.29431,34523878.488849998,48024890.45459,25485.411629999999,48050375.866219997,82574254.355580002,null,null,null,null,null,3113,null," Základní školy",null,null,21040933.375810001,10384351.270490004,31425284.646300003,56866736.118789993,10276.863429999999,56877012.982219994,88302297.628519997]
[{"$error":"#REF!"},"OK",null,null,3114,null," Základní školy pro žáky se speciálními vzdělávacími potřebami",null,null,705615.1104999996,67437.56091,773052.6714099996,3741802.48025,102104.95336000001,3843907.4336100002,4616960.1050199997,null,null,3114,null," Základní školy pro žáky se speciálními vzdělávacími potřebami",null,null,885108.27037000004,63526.779119999999,948635.04949,4846021.4085799996,237557.38737000001,5083578.7959499992,6032213.8454400003,null,null,null,null,null,3114,null," Základní školy pro žáky se speciálními vzdělávacími potřebami",null,null,954151.0895,73281.352960000004,1027432.44246,5459360.3837499991,323260.37410999998,5782620.7578599993,6810053.2003199998]
[{"$error":"#REF!"},null,null,null,3115,null," Ostatní záležitosti předškolního vzdělávání",null,null,17089.455170000001,3867.0244500000003,20956.479620000002,0,0,0,20956.479620000002,null,null,3115,null," Ostatní záležitosti předškolního vzdělávání",null,null,49484.373870000003,11911.054400000001,61395.428270000004,70,0,70,61465.428269999997,null,null,null,null,null,3115,null," Ostatní záležitosti předškolního vzdělávání",null,null,37413.656969999996,2844.4112500000001,40258.068219999994,40,0,40,40298.068219999994]
[{"$error":"#REF!"},"OK",null,null,3117,null," První stupeň základních škol",null,null,633339.02795000013,214941.55275,848280.58070000017,4940079.8431700002,0,4940079.8431700002,5788360.4238700001,null,null,3117,null," První stupeň základních škol",null,null,856597.64882,366392.07627999998,1222989.7250999999,6600942.8137400001,0,6600942.8137400001,7823932.5388399996,null,null,null,null,null,3117,null," První stupeň základních škol",null,null,770280.81058999989,379171.82390000002,1149452.6344899999,7616870.0888400003,0,7616870.0888400003,8766322.7233300004]
[{"$error":"#REF!"},"OK",null,null,3118,null," Druhý stupeň základních škol",null,null,2173.8302899999999,4857.01746,7030.8477499999999,13335.083000000001,0,13335.083000000001,20365.93075,null,null,3118,null," Druhý stupeň základních škol",null,null,3281.7282,1714.2539999999999,4995.9822000000004,20259.374,0,20259.374,25255.356199999998,null,null,null,null,null,3118,null," Druhý stupeň základních škol",null,null,3672.8919000000005,23641.685120000002,27314.577020000004,23704.688999999998,0,23704.688999999998,51019.266020000003]
[{"$error":"#REF!"},"OK",null,null,3119,null," Ostatní záležitosti základního vzdělávání",null,null,453840.99132000026,103161.46597,557002.45729000028,617.83736999999996,255.02535999999998,872.86272999999994,557875.32002000033,null,null,3119,null," Ostatní záležitosti základního vzdělávání",null,null,549191.72984000004,194245.41015000001,743437.13999000005,0,0,0,743437.13999000005,null,null,null,null,null,3119,null," Ostatní záležitosti základního vzdělávání",null,null,495129.32005999994,334974.93395999999,830104.25401999988,0,0,0,830104.25401999988]
[null,null,null,null,3121,null," Gymnázia",null,null,1617327.2122200003,110316.52265,1727643.7348700003,5832253.5382299991,368001.98515000002,6200255.5233799992,7927899.25825,null,null,312,null,"Střední vzdělávání a vzdělávání v konzervatořích",null,null,{"$f":"SUM(X26:X34)","v":6565642.0467799995},509499.97842999996,7075142.0252099987,33397867.273790006,4963644.5648499997,38361511.838640004,45436653.863640003,null,null,null,null,null,312,null,"Střední vzdělávání a vzdělávání v konzervatořích",null,null,{"$f":"SUM(AO26:AO34)","v":7194165.3573500002},838137.01916999987,8032302.3765199995,36742323.742569998,3658526.8992500002,40400850.641819999,48433153.018339999]
[{"$f":"IF(COUNTBLANK(C26:IV26)=254,\"odstr\",IF(AND($A$1=\"TISK\",SUM(J25:P25)=0),\"odstr\",\"OK\"))","v":{"$error":"#REF!"}},"OK",null,null,3122,null," Střední odborné školy",null,null,1657041.0639899999,224180.83916,1881221.9031499999,9740850.9531200025,582493.79818999988,10323344.751310002,12204566.654460002,null,null,3121,null," Gymnázia",null,null,2022624.9682400001,97638.865040000004,{"$f":"SUM(X26:Y26)","v":2120263.8332799999},7449670.9226200003,839428.83874000004,{"$f":"SUM(AA26:AB26)","v":8289099.7613600008},10409363.59464,null,null,null,null,null,3121,null," Gymnázia",null,null,2250974.3029999998,136627.03782,{"$f":"SUM(AO26:AP26)","v":2387601.34082},7828551.2808499997,457845.57906000002,{"$f":"SUM(AR26:AS26)","v":8286396.8599100001},{"$f":"SUM(AQ26,AT26)","v":10673998.20073}]
[{"$error":"#REF!"},"OK",null,null,3123,null," Střední školy poskytující střední vzdělání s výučním listem",null,null,1179793.38078,165092.09859000001,1344885.4793700001,6258468.6522300001,382414.09069000004,6640882.7429200001,7985768.2222899999,null,null,3122,null," Střední odborné školy",null,null,2128468.5729999999,227956.39468999999,2356424.9676899998,12408109.483929999,1983931.1041999999,14392040.588129999,16748465.555609999,null,null,null,null,null,3122,null," Střední odborné školy",null,null,2330455.8844400002,274793.19099999999,2605249.0754400003,10929144.49722,1172866.4757300001,12102010.97295,14707260.048390001]
[{"$error":"#REF!"},"OK",null,null,3124,null," Střední školy a konzervatoře pro žáky se speciálními  vzdělávacími potřebami",null,null,191653.3112,10404.81675,202058.12794999999,899753.05716000008,10125.12708,909878.18424000009,1111936.31219,null,null,3123,null," Střední školy poskytující střední vzdělání s výučním listem",null,null,1483963.7960399999,132374.99791000001,1616338.7939499998,7768732.7099900004,1225368.13687,8994100.8468600009,10610439.64081,null,null,null,null,null,3123,null," Střední školy poskytující střední vzdělání s výučním listem",null,null,1566347.53672,310945.01320999995,1877292.54993,5464093.0815000003,988489.04203000013,6452582.1235300004,8329874.6734600002]
[{"$error":"#REF!"},"OK",null,null,3125,null," Střediska praktického vyučování a školní hospodářství",null,null,13763.224,0,13763.224,53803.694920000002,22161.750700000001,75965.445619999999,89728.669620000001,null,null,3124,null," Střední školy a konzervatoře pro žáky se speciálními  vzdělávacími potřebami",null,null,252873.625,13765.40891,266639.03391,1016011.5784,25930.447840000001,1041942.02624,1308581.06015,null,null,null,null,null,3124,null," Střední školy a konzervatoře pro žáky se speciálními  vzdělávacími potřebami",null,null,278044.10880000005,13646.974099999999,291691.08290000004,863713.68001000001,29825.668140000002,893539.34814999998,1185230.43105]
[{"$error":"#REF!"},"OK",null,null,3126,null," Konzervatoře",null,null,352859.28100000002,6873.7219999999998,359733.00300000003,326233.18721,21388.361820000002,347621.54902999999,707354.55203000002,null,null,3125,null," Střediska praktického vyučování a školní hospodářství",null,null,15216.028,0,15216.028,67699.807839999994,104782.33375999999,172482.14159999997,187698.16959999999,null,null,null,null,null,3125,null," Střediska praktického vyučování a školní hospodářství",null,null,16933.764999999999,0,16933.764999999999,80324.591490000006,71036.719939999995,151361.31143,168295.07643000002]
[{"$error":"#REF!"},"OK",null,null,3127,null," Střední školy",null,null,183308.8475,0,183308.8475,3361523.6609199997,348253.50127000001,3709777.1621899996,3893086.0096899997,null,null,3126,null," Konzervatoře",null,null,430591.32750000001,37764.311880000001,468355.63938000001,440625.4607,99746.972569999998,540372.43327000004,1008728.07265,null,null,null,null,null,3126,null," Konzervatoře",null,null,474387.28839,77124.803039999999,551512.09143000003,482437.18920000002,133301.23207,615738.42127000005,1167250.5127000001]
[{"$error":"#REF!"},null,null,null,3128,null," Sportovní školy - gymnázia",null,null,0,0,0,97692.549939999997,279.78699999999998,97972.336939999994,97972.336939999994,null,null,3127,null," Střední školy",null,null,231808.22899999999,0,231808.22899999999,4120802.6493099998,680892.88986999996,4801695.5391799994,5033503.7681799997,null,null,null,null,null,3127,null," Střední školy",null,null,276989.97100000002,0,276989.97100000002,10999664.701299999,777904.78210000007,11777569.483399998,12054559.454399999]
[{"$error":"#REF!"},"OK",null,null,3129,null," Ostatní zařízení středního vzdělávání",null,null,82,0,82,0.26910000000000001,0,0.26910000000000001,82.269099999999995,null,null,3128,null," Sportovní školy - gymnázia",null,null,0,0,0,125653.61599999999,3563.8409999999999,129217.45699999999,129217.45699999999,null,null,null,null,null,3128,null," Sportovní školy - gymnázia",null,null,0,25000,25000,93844.133000000002,27257.400180000001,121101.53318,146101.53318]
[{"$error":"#REF!"},"OK",null,null,3131,null," Výchovné ústavy a dětské domovy se školou",null,null,62.672599999999996,0,62.672599999999996,0,0,0,62.672599999999996,null,null,3129,null," Ostatní zařízení středního vzdělávání",null,null,95.5,0,{"$f":"SUM(X34:Y34)","v":95.5},561.04499999999996,0,561.04499999999996,656.54499999999996,null,null,null,null,null,3129,null," Ostatní zařízení středního vzdělávání",null,null,32.5,0,32.5,550.58800000000008,0,550.58800000000008,583.08800000000008]
[null,null,null,null,3132,null," Diagnostické ústavy",null,null,0,0,0,0,0,0,0,null,null,313,null,"Školská zařízení pro výkon ústavní a ochranné výchovy",null,null,{"$f":"SUM(X36:X39)","v":94372.17313000001},5718.5,100090.67313000001,2165507.4736600001,104750.69018000001,2270258.1638400001,2370348.8369699996,null,null,null,null,null,313,null,"Školská zařízení pro výkon ústavní a ochranné výchovy",null,null,{"$f":"SUM(AO36:AO39)","v":107168.62516000001},0,107168.62516000001,2452426.5400900003,93533.912689999997,2545960.4527800004,2653129.0779400002]
[{"$f":"IF(COUNTBLANK(C36:IV36)=254,\"odstr\",IF(AND($A$1=\"TISK\",SUM(J34:P34)=0),\"odstr\",\"OK\"))","v":{"$error":"#REF!"}},"OK",null,null,3133,null," Dětské domovy",null,null,72448.359599999996,1939.3425,74387.702099999995,1741848.50517,18374.444670000001,1760222.9498400001,1834610.6519400002,null,null,3131,null," Výchovné ústavy a dětské domovy se školou",null,null,103.0966,0,{"$f":"SUM(X36:Y36)","v":103.0966},0,0,0,103.0966,null,null,null,null,null,3131,null," Výchovné ústavy a dětské domovy se školou",null,null,186.24516,0,{"$f":"SUM(AO36:AP36)","v":186.24516},0,0,{"$f":"SUM(AR36:AS36)","v":0},{"$f":"SUM(AQ36,AT36)","v":186.24516}]
[{"$f":"IF(COUNTBLANK(C37:IV37)=254,\"odstr\",IF(AND($A$1=\"TISK\",SUM(J35:P35)=0),\"odstr\",\"OK\"))","v":{"$error":"#REF!"}},"OK",null,null,3139,null," Ostatní školská zařízení pro výkon ústavní a ochranné výchovy",null,null,10,0,10,0,0,0,10,null,null,3132,null," Diagnostické ústavy",null,null,"x","x","x","x","x","x","x",null,null,null,null,null,3132,null," Diagnostické ústavy",null,null,0,0,{"$f":"SUM(AO37:AP37)","v":0},25,0,{"$f":"SUM(AR37:AS37)","v":25},25]
[{"$f":"IF(COUNTBLANK(C38:IV38)=254,\"odstr\",IF(AND($A$1=\"TISK\",SUM(J36:P36)=0),\"odstr\",\"OK\"))","v":{"$error":"#REF!"}},null,null,null,3141,null," Školní stravování ",null,null,595323.94073000003,98761.566700000025,694085.50743,2863427.5511999996,3974.7869999999998,2867402.3381999996,3561487.8456299994,null,null,3133,null," Dětské domovy",null,null,94249.076530000006,5718.5,{"$f":"SUM(X38:Y38)","v":99967.576530000006},2165507.4736600001,104750.69018000001,{"$f":"SUM(AA38:AB38)","v":2270258.1638400001},2370225.7403699998,null,null,null,null,null,3133,null," Dětské domovy",null,null,106972.38,0,{"$f":"SUM(AO38:AP38)","v":106972.38},2452401.5400900003,93533.912689999997,{"$f":"SUM(AR38:AS38)","v":2545935.4527800004},2652907.8327800003]
[{"$f":"IF(COUNTBLANK(C39:IV39)=254,\"odstr\",IF(AND($A$1=\"TISK\",SUM(J37:P37)=0),\"odstr\",\"OK\"))","v":{"$error":"#REF!"}},"OK",null,null,3142,null,"Ostatní školní stravování",null,null,null,null,0,null,null,0,0,null,null,3139,null," Ostatní školská zařízení pro výkon ústavní a ochranné výchovy",null,null,20,0,{"$f":"SUM(X39:Y39)","v":20},0,0,0,20,null,null,null,null,null,3139,null," Ostatní školská zařízení pro výkon ústavní a ochranné výchovy",null,null,10,0,{"$f":"SUM(AO39:AP39)","v":10},0,0,{"$f":"SUM(AR39:AS39)","v":0},10]
[null,null,null,null,3143,null," Školní družiny a kluby",null,null,33940.347650000003,417.71550000000002,34358.063150000002,1608936.537,0,1608936.537,1643294.6001500001,null,null,314,null,"Ostatní zařízení související s výchovou a vzděláváním mládeže",null,null,{"$f":"SUM(X41:X49)","v":1097136.5642200001},352696.70980000001,1449833.2740199999,7631706.7956799995,122372.38458,7754079.1802599998,9203912.4542500004,null,null,null,null,null,314,null,"Ostatní zařízení související s výchovou a vzděláváním mládeže",null,null,{"$f":"SUM(AO41:AO49)","v":1152093.5580900002},351397.62741999998,1503491.18551,8412608.9084600005,105154.43368999999,8517763.3421500009,10021254.527660001]
[{"$f":"IF(COUNTBLANK(C41:IV41)=254,\"odstr\",IF(AND($A$1=\"TISK\",SUM(J38:P38)=0),\"odstr\",\"OK\"))","v":{"$error":"#REF!"}},"OK",null,null,3144,null," Školy v přírodě",null,null,19011.332999999999,0,19011.332999999999,0,0,0,19011.332999999999,null,null,3141,null," Školní stravování ",null,null,702649.10230000003,215315.85999,{"$f":"SUM(X41:Y41)","v":917964.96229000005},3719679.1808799999,11967.239,{"$f":"SUM(AA41:AB41)","v":3731646.4198799999},4649611.3821400004,null,null,null,null,null,3141,null," Školní stravování ",null,null,732721.09597000002,188877.47951999999,{"$f":"SUM(AO41:AP41)","v":921598.57548999996},4133630.8790100003,20281.264439999999,{"$f":"SUM(AR41:AS41)","v":4153912.1434500003},5075510.71894]
[{"$error":"#REF!"},"OK",null,null,3145,null," Internáty",null,null,4.0540000000000003,0,4.0540000000000003,72199.713780000005,0,72199.713780000005,72203.767780000009,null,null,3142,null,"Ostatní školní stravování",null,null,"x","x","x","x","x","x","x",null,null,null,null,null,3142,null,"Ostatní školní stravování",null,null,"x","x","x","x","x","x","x"]
[{"$error":"#REF!"},"OK",null,null,3146,null," Zařízení výchovného poradenství ",null,null,112101.4054,580.4,112681.8054,732658.59973999998,10708.484899999999,743367.08464000002,856048.89003999997,null,null,3143,null," Školní družiny a kluby",null,null,51085.785640000002,979.56700000000001,{"$f":"SUM(X43:Y43)","v":52065.352640000005},2115769.2061399999,0,{"$f":"SUM(AA43:AB43)","v":2115769.2061399999},2167834.5587800001,null,null,null,null,null,3143,null," Školní družiny a kluby",null,null,62831.344829999995,4199.45993,{"$f":"SUM(AO43:AP43)","v":67030.804759999999},2382461.9329999997,0,{"$f":"SUM(AR43:AS43)","v":2382461.9329999997},{"$f":"SUM(AQ43,AT43)","v":2449492.7377599999}]
[{"$error":"#REF!"},"OK",null,null,3147,null," Domovy mládeže",null,null,81477.957999999999,9605.1350000000002,91083.092999999993,523627.70952999999,20266.191009999999,543893.90053999994,634976.99353999994,null,null,3144,null," Školy v přírodě",null,null,23579.174999999999,0,{"$f":"SUM(X44:Y44)","v":23579.174999999999},0,0,0,23579.174999999999,null,null,null,null,null,3144,null," Školy v přírodě",null,null,21623.574659999998,0,21623.574659999998,0,0,0,21623.574659999998]
[{"$error":"#REF!"},"OK",null,null,3148,null," Střediska výchovné péče",null,null,1157.49,0,1157.49,17688.595000000001,0,17688.595000000001,18846.085000000003,null,null,3145,null," Internáty",null,null,0,0,0,86783.512000000002,0,{"$f":"SUM(AA45:AB45)","v":86783.512000000002},86783.512000000002,null,null,null,null,null,3145,null," Internáty",null,null,0,0,0,88445.604999999996,0,88445.604999999996,88445.604999999996]
[{"$error":"#REF!"},"OK",null,null,3149,null," Ostatní zařízení související s výchovou a vzděláváním mládeže",null,{"$error":"#N/A"},116522.43781999999,375744.17858000001,492266.6164,82131.532830000011,37960.807529999998,120092.34036,612358.95675999997,null,null,3146,null," Zařízení výchovného poradenství ",null,null,144842.95125000001,15248.193289999999,{"$f":"SUM(X46:Y46)","v":160091.14454000001},950975.57157999999,16843.288809999998,{"$f":"SUM(AA46:AB46)","v":967818.86039000005},1127910.0049300001,null,null,null,null,null,3146,null," Zařízení výchovného poradenství ",null,null,155521.41417,5516.2533999999996,161037.66756999999,1015843.84484,25064.921119999999,1040908.76596,1201946.43353]
[{"$error":"#REF!"},"OK",null,null,3150,null," Vyšší odborné školy",null,null,102762.43356,0,102762.43356,308925.24978999997,3074,311999.24978999997,414761.68334999995,null,null,3147,null," Domovy mládeže",null,null,95930.183000000005,18517.9666,{"$f":"SUM(X47:Y47)","v":114448.1496},658039.402,86948.759359999996,{"$f":"SUM(AA47:AB47)","v":744988.16136000003},859436.31096000003,null,null,null,null,null,3147,null," Domovy mládeže",null,null,101228.016,6410.8,107638.81600000001,687020.84880999988,55979.137459999998,742999.98626999988,850638.80226999987]
[{"$error":"#REF!"},null,null,null,3211,null," Vysoké školy",null,null,4131.933,0,4131.933,2702.9,0,2702.9,6834.8330000000005,null,null,3148,null," Střediska výchovné péče",null,null,1030.9525699999999,0,{"$f":"SUM(X48:Y48)","v":1030.9525699999999},25354.565999999999,0,{"$f":"SUM(AA48:AB48)","v":25354.565999999999},26385.51857,null,null,null,null,null,3148,null," Střediska výchovné péče",null,null,498.86149999999998,96.8,595.66149999999993,41371.218000000001,0,41371.218000000001,41966.879500000003]
[{"$error":"#REF!"},"OK",null,null,3212,null," Výzkum, vývoj a inovace na vysokých školách",null,null,0,0,0,3920.7,0,3920.7,3920.7,null,null,3149,null," Ostatní zařízení související s výchovou a vzděláváním mládeže",null,{"$error":"#N/A"},78018.41446,102635.12291999999,{"$f":"SUM(X49:Y49)","v":180653.53737999999},75105.357080000002,6613.0974100000003,{"$f":"SUM(AA49:AB49)","v":81718.454490000004},262371.99187000003,null,null,null,null,null,3149,null," Ostatní zařízení související s výchovou a vzděláváním mládeže",null,null,77669.25095999999,146296.83457000001,223966.08552999998,63834.579799999992,3829.11067,67663.690469999987,291629.77599999995]
[null,null,null,null,3213,null," Bakalářské studium",null,null,104,0,104,500,0,500,604,null,null,315,null,"Vyšší odborné vzdělávání",null,null,{"$f":"SUM(X51)","v":116777.98600999999},0,116777.98600999999,352504.46856000001,114952.08372,467456.55228,584234.53829000005,null,null,null,null,null,315,null,"Vyšší odborné vzdělávání",null,null,{"$f":"AO51","v":122113.91051999999},0,122113.91051999999,393076.24674999999,2628.7960000000003,395705.04274999996,517818.95326999994]
[{"$f":"IF(COUNTBLANK(C51:IV51)=254,\"odstr\",IF(AND($A$1=\"TISK\",SUM(J47:P47)=0),\"odstr\",\"OK\"))","v":{"$error":"#REF!"}},"OK",null,null,3214,null," Magisterské a doktorské studium",null,null,50,0,50,0,0,0,50,null,null,3150,null," Vyšší odborné školy",null,null,116777.98600999999,0,{"$f":"SUM(X51:Y51)","v":116777.98600999999},352504.46856000001,114952.08372,{"$f":"SUM(AA51:AB51)","v":467456.55228},584234.53829000005,null,null,null,null,null,3150,null," Vyšší odborné školy",null,null,122113.91051999999,0,{"$f":"SUM(AO51:AP51)","v":122113.91051999999},393076.24674999999,2628.7960000000003,{"$f":"SUM(AR51:AS51)","v":395705.04274999996},517818.95326999994]
[null,null,null,null,3221,null," Vysokoškolské koleje a menzy",null,null,0,0,0,0,0,0,0,null,null,321,null,"Vysokoškolské vzdělávání",null,null,{"$f":"SUM(X53:X56)","v":6785.8530000000001},0,6785.8530000000001,5358.6990000000005,5030.0798100000002,10388.77881,17174.631809999999,null,null,null,null,null,321,null,"Vysokoškolské vzdělávání",null,null,{"$f":"SUM(AO53:AO56)","v":6300.8},0,6300.8,13382,746.81299999999999,14128.813,20429.613000000001]
[{"$f":"IF(COUNTBLANK(C53:IV53)=254,\"odstr\",IF(AND($A$1=\"TISK\",SUM(J48:P48)=0),\"odstr\",\"OK\"))","v":{"$error":"#REF!"}},"OK",null,null,3229,null," Ostatní zařízení související s vysokoškolským vzděláváním",null,null,2963,0,2963,64.980999999999995,0,64.980999999999995,3027.9809999999998,null,null,3211,null," Vysoké školy",null,null,6635.8530000000001,0,{"$f":"SUM(X53:Y53)","v":6635.8530000000001},5262.02,5030.0798100000002,{"$f":"SUM(AA53:AB53)","v":10292.09981},16927.952809999999,null,null,null,null,null,3211,null," Vysoké školy",null,null,6084.8,0,{"$f":"SUM(AO53:AP53)","v":6084.8},10382,746.81299999999999,{"$f":"SUM(AR53:AS53)","v":11128.813},17213.613000000001]
[{"$f":"IF(COUNTBLANK(C54:IV54)=254,\"odstr\",IF(AND($A$1=\"TISK\",SUM(J49:P49)=0),\"odstr\",\"OK\"))","v":{"$error":"#REF!"}},"OK",null,null,3231,null," Základní umělecké školy",null,null,664890.26646999968,160356.63191999999,825246.89838999964,4120014.6276500002,12470.271069999999,4132484.8987199999,4957731.7971099997,null,null,3212,null," Výzkum, vývoj a inovace na vysokých školách",null,null,0,0,0,96.679000000000002,0,{"$f":"SUM(AA54:AB54)","v":96.679000000000002},96.679000000000002,null,null,null,null,null,3212,null," Výzkum, vývoj a inovace na vysokých školách",null,null,0,0,{"$f":"SUM(AO54:AP54)","v":0},3000,0,{"$f":"SUM(AR54:AS54)","v":3000},3000]
[{"$f":"IF(COUNTBLANK(C55:IV55)=254,\"odstr\",IF(AND($A$1=\"TISK\",SUM(J50:P50)=0),\"odstr\",\"OK\"))","v":{"$error":"#REF!"}},"OK",null,null,3232,null," Jazykové školy s právem státní jazykové zkoušky",null,null,1062.9000000000001,0,1062.9000000000001,42,0,42,1104.9000000000001,null,null,3213,null," Bakalářské studium",null,null,94,0,{"$f":"SUM(X55:Y55)","v":94},"x","x","x",94,null,null,null,null,null,3213,null," Bakalářské studium",null,null,56,0,{"$f":"SUM(AO55:AP55)","v":56},"x","x","x",56]
[{"$f":"IF(COUNTBLANK(C56:IV56)=254,\"odstr\",IF(AND($A$1=\"TISK\",SUM(J51:P51)=0),\"odstr\",\"OK\"))","v":{"$error":"#REF!"}},"OK",null,null,3233,null," Střediska volného času",null,null,70525.357809999987,19441.593929999999,89966.95173999999,741196.62875000015,23295.667109999999,764492.29586000019,854459.24760000012,null,null,3214,null," Magisterské a doktorské studium",null,null,56,0,{"$f":"SUM(X56:Y56)","v":56},"x","x","x",56,null,null,null,null,null,3214,null," Magisterské a doktorské studium",null,null,160,0,{"$f":"SUM(AO56:AP56)","v":160},"x","x","x",160]
[null,null,null,null,3239,null," Záležitosti zájmového vzdělávání jinde nezařazené",null,null,3025.5068700000002,1837.7270000000001,4863.23387,0,0,0,4863.23387,null,null,322,null,"Zařízení související s vysokoškolským vzděláváním",null,null,{"$f":"SUM(X58:X59)","v":2551.2979999999998},60.5,2611.7979999999998,1340,0,1340,3951.7979999999998,null,null,null,null,null,322,null,"Zařízení související s vysokoškolským vzděláváním",null,null,{"$f":"SUM(AO58:AO59)","v":2442},0,2442,0,0,0,2442]
[{"$f":"IF(COUNTBLANK(C58:IV58)=254,\"odstr\",IF(AND($A$1=\"TISK\",SUM(J52:P52)=0),\"odstr\",\"OK\"))","v":{"$error":"#REF!"}},"OK",null,null,3261,null," Činnost ústředního orgánu státní správy ve vzdělávání",null,null,0,0,0,0,0,0,0,null,null,3221,null," Vysokoškolské koleje a menzy",null,null,16.007999999999999,60.5,{"$f":"SUM(X58:Y58)","v":76.507999999999996},"x","x","x",76.507999999999996,null,null,null,null,null,3221,null," Vysokoškolské koleje a menzy",null,null,10,"x",{"$f":"SUM(AO58:AP58)","v":10},"x","x","x",{"$f":"SUM(AQ58,AT58)","v":10}]
[{"$f":"IF(COUNTBLANK(C59:IV59)=254,\"odstr\",IF(AND($A$1=\"TISK\",SUM(J53:P53)=0),\"odstr\",\"OK\"))","v":{"$error":"#REF!"}},"OK",null,null,3262,null," Činnost ostatních orgánů státní správy ve vzdělávání",null,null,0,0,0,0,0,0,0,null,null,3229,null," Ostatní zařízení související s vysokoškolským vzděláváním",null,null,2535.29,0,{"$f":"SUM(X59:Y59)","v":2535.29},1340,0,{"$f":"SUM(AA59:AB59)","v":1340},3875.29,null,null,null,null,null,3229,null," Ostatní zařízení související s vysokoškolským vzděláváním",null,null,2432,"x",{"$f":"SUM(AO59:AP59)","v":2432},"x","x","x",{"$f":"SUM(AQ59,AT59)","v":2432}]
[null,null,null,null,3269,null," Ostatní správa ve vzdělávání jinde nezařazená",null,null,19.064,0,19.064,21425.574200000003,0,21425.574200000003,21444.638200000001,null,null,323,null,"Základní umělecké, jazykové a zájmové vzdělávání",null,null,{"$f":"SUM(X61:X64)","v":1098131.4061699999},300765.98768999998,1398897.39386,6450350.0030300003,141765.00575000001,6592115.0087800007,7991012.4026399991,null,null,null,null,null,323,null,"Základní umělecké, jazykové a zájmové vzdělávání",null,null,{"$f":"SUM(AO61:AO64)","v":1037266.0656300001},183362.32730999999,1220628.3929400002,7226690.5172799993,64625.018900000003,7291315.5361799998,8511943.9291200005]
[{"$f":"IF(COUNTBLANK(C61:IV61)=254,\"odstr\",IF(AND($A$1=\"TISK\",SUM(J54:P54)=0),\"odstr\",\"OK\"))","v":{"$error":"#REF!"}},"OK",null,null,3280,null," Výzkum školství a vzdělávání",null,null,834.69065999999987,0,834.69065999999987,0,0,0,834.69065999999987,null,null,3231,null," Základní umělecké školy",null,null,946754.96122000006,162549.03805999999,{"$f":"SUM(X61:Y61)","v":1109303.9992800001},5444773.3355200002,100246.66131,{"$f":"SUM(AA61:AB61)","v":5545019.9968300005},6654323.9961099997,null,null,null,null,null,3231,null," Základní umělecké školy",null,null,917784.91321000003,153344.89747,{"$f":"SUM(AO61:AP61)","v":1071129.8106800001},6196580.8931799997,26497.050900000002,{"$f":"SUM(AR61:AS61)","v":6223077.9440799998},{"$f":"SUM(AQ61,AT61)","v":7294207.7547599999}]
[null,null,null,null,3291,null," Mezinárodní spolupráce ve vzdělávání",null,null,2645.7649200000001,0,2645.7649200000001,860,0,860,3505.7649200000001,null,null,3232,null," Jazykové školy s právem státní jazykové zkoušky",null,null,6749.5749999999998,4989.54,{"$f":"SUM(X62:Y62)","v":11739.115},91.183999999999997,0,{"$f":"SUM(AA62:AB62)","v":91.183999999999997},11830.299000000001,null,null,null,null,null,3232,null," Jazykové školy s právem státní jazykové zkoušky",null,null,5601.4,19745.136060000001,{"$f":"SUM(AO62:AP62)","v":25346.536059999999},1288.5,0,{"$f":"SUM(AR62:AS62)","v":1288.5},{"$f":"SUM(AQ62,AT62)","v":26635.036059999999}]
[null,null,null,null,3292,null," Vzdělávání národnostních menšin a multikulturní výchova",null,null,4403.2180099999996,0,4403.2180099999996,1778.4845,0,1778.4845,6181.7025099999992,null,null,3233,null," Střediska volného času",null,null,138597.38433,55963.404029999998,{"$f":"SUM(X63:Y63)","v":194560.78836000001},1005235.48351,41518.344440000001,{"$f":"SUM(AA63:AB63)","v":1046753.8279500001},1241314.61631,null,null,null,null,null,3233,null," Střediska volného času",null,null,109050.77269000003,9687.8177799999994,{"$f":"SUM(AO63:AP63)","v":118738.59047000002},1028811.1241,38127.968000000001,{"$f":"SUM(AR63:AS63)","v":1066939.0921},{"$f":"SUM(AQ63,AT63)","v":1185677.6825699999}]
[{"$f":"IF(COUNTBLANK(C64:IV64)=254,\"odstr\",IF(AND($A$1=\"TISK\",SUM(J57:P57)=0),\"odstr\",\"OK\"))","v":{"$error":"#REF!"}},"OK",null,null,3293,null," Vzdělávací akce k integraci Romů",null,null,0,0,0,1086.8230000000001,0,1086.8230000000001,1086.8230000000001,null,null,3239,null," Záležitosti zájmového vzdělávání jinde nezařazené",null,null,6029.4856200000004,77264.005600000004,{"$f":"SUM(X64:Y64)","v":83293.491220000011},250,0,{"$f":"SUM(AA64:AB64)","v":250},83543.491219999996,null,null,null,null,null,3239,null," Záležitosti zájmového vzdělávání jinde nezařazené",null,null,4828.9797299999991,584.476,{"$f":"SUM(AO64:AP64)","v":5413.4557299999988},10,0,{"$f":"SUM(AR64:AS64)","v":10},{"$f":"SUM(AQ64,AT64)","v":5423.4557299999988}]
[null,null,null,null,3294,null," Zařízení pro další vzdělávání pedagogických pracovníků",null,null,50,0,50,35195.263740000002,0,35195.263740000002,35245.263740000002,null,null,326,null,"Správa ve vzdělávání",null,null,{"$f":"SUM(X68)","v":13.35689},0,13.35689,33830.958960000004,317.20488,34148.163840000001,34161.520729999997,null,null,null,null,null,326,null,"Správa ve vzdělávání",null,null,{"$f":"SUM(AO66:AO68)","v":132.005},0,132.005,52675.875209999991,10074.37213,62750.247339999987,{"$f":"SUM(AQ65,AT65)","v":62882.252339999985}]
[{"$f":"IF(COUNTBLANK(C66:IV66)=254,\"odstr\",IF(AND($A$1=\"TISK\",SUM(J58:P58)=0),\"odstr\",\"OK\"))","v":{"$error":"#REF!"}},"OK",null,null,3299,null," Ostatní záležitosti vzdělávání",null,null,365242.32111999998,25528.472440000001,390770.79355999996,236592.18735999995,83815.177319999988,320407.36467999994,711178.1582399999,null,null,3261,null," Činnost ústředního orgánu státní správy ve vzdělávání",null,null,"x","x","x","x","x","x","x",null,null,null,null,null,3261,null," Činnost ústředního orgánu státní správy ve vzdělávání",null,null,"x","x","x","x","x","x","x"]
[{"$f":"IF(COUNTBLANK(C67:IV67)=254,\"odstr\",IF(AND($A$1=\"TISK\",SUM(J59:P59)=0),\"odstr\",\"OK\"))","v":{"$error":"#REF!"}},"OK",null,null,"Celkem kapitola 700-Obce a DSO; KÚ (část vzdělávání)1)",null,null,null,null,31909918.221629996,9391150.86314,41301069.084769987,96891385.572760031,2054009.0902800004,98945394.663040042,140246463.74781004,null,null,3262,null," Činnost ostatních orgánů státní správy ve vzdělávání",null,null,"x","x","x","x","x","x","x",null,null,null,null,null,3262,null," Činnost ostatních orgánů státní správy ve vzdělávání",null,null,"x","x","x","x","x","x","x"]
[{"$f":"IF(COUNTBLANK(C68:IV68)=254,\"odstr\",IF(AND($A$1=\"TISK\",SUM(J60:P60)=0),\"odstr\",\"OK\"))","v":{"$error":"#REF!"}},"OK",null,"Komentáře:",null,null,null,null,null,null,null,null,null,null,null,"Zdroj: Závěrečný účet – kapitola 700-Obce a DSO; KÚ (část: vzdělávání)",null,null,3269,null," Ostatní správa ve vzdělávání jinde nezařazená",null,null,13.35689,0,{"$f":"SUM(X68:Y68)","v":13.35689},33830.958960000004,317.20488,{"$f":"SUM(AA68:AB68)","v":34148.163840000001},34161.520729999997,null,null,null,null,null,3269,null," Ostatní správa ve vzdělávání jinde nezařazená",null,null,132.005,0,{"$f":"SUM(AO68:AP68)","v":132.005},52675.875209999991,10074.37213,{"$f":"SUM(AR68:AS68)","v":62750.247339999987},{"$f":"SUM(AQ68,AT68)","v":62882.252339999985}]
[null,null,null,"1)","Tabulka neobsahuje z daných tříd následující položky: 5321, 5323, 5329, 5344, 5345, 5349, 5366, 5367, 5641, 5642, 5649, 6341, 6342, 6349, 6441, 6442, 6449.",null,null,null,null,null,null,null,null,null,null,null,null,null,328,null,"Výzkum školství a vzdělávání",null,null,{"$f":"SUM(X70)","v":1043.05279},0,1043.05279,1000,0,1000,2043.05279,null,null,null,null,null,328,null,"Výzkum školství a vzdělávání",null,null,{"$f":"AO70","v":912.82133999999985},0,912.82133999999985,1000,0,1000,1912.82134]
[{"$f":"IF(COUNTBLANK(C70:IV70)=254,\"odstr\",IF(AND($A$1=\"TISK\",SUM(J61:P61)=0),\"odstr\",\"OK\"))","v":{"$error":"#REF!"}},"OK",null,null,null,null,null,null,null,null,null,null,null,null,null,null,null,null,3280,null," Výzkum školství a vzdělávání",null,null,1043.05279,0,{"$f":"SUM(X70:Y70)","v":1043.05279},1000,0,{"$f":"SUM(AA70:AB70)","v":1000},2043.05279,null,null,null,null,null,3280,null," Výzkum školství a vzdělávání",null,null,912.82133999999985,0,{"$f":"SUM(AO70:AP70)","v":912.82133999999985},1000,0,{"$f":"SUM(AR70:AS70)","v":1000},{"$f":"SUM(AQ70,AT70)","v":1912.82134}]
[null,null,null,null,null,null,null,null,null,null,null,null,null,null,null,null,null,null,329,null,"Ostatní činnost a nespecifikované výdaje",null,null,{"$f":"SUM(X72:X76)","v":481120.84937000001},29785.431230000002,510906.28059999994,662136.06842000003,72704.820829999997,734840.88925000001,1245747.16986,null,null,null,null,null,329,null,"Ostatní činnost a nespecifikované výdaje",null,null,{"$f":"SUM(AO72:AO76)","v":583616.38810999994},67484.786880000014,651101.17498999997,680775.72022999986,108835.86946000002,789611.58968999982,1440712.7646799996]
[{"$f":"IF(COUNTBLANK(C72:IV72)=254,\"odstr\",IF(AND($A$1=\"TISK\",SUM(J62:P62)=0),\"odstr\",\"OK\"))","v":{"$error":"#REF!"}},"OK",null,null,null,null,null,null,null,null,null,null,null,null,null,null,null,null,3291,null," Mezinárodní spolupráce ve vzdělávání",null,null,5092.6954800000003,50.440750000000001,{"$f":"SUM(X72:Y72)","v":5143.1362300000001},1894.0477699999999,0,{"$f":"SUM(AA72:AB72)","v":1894.0477699999999},7037.1840000000002,null,null,null,null,null,3291,null," Mezinárodní spolupráce ve vzdělávání",null,null,1135.0675099999999,0,{"$f":"SUM(AO72:AP72)","v":1135.0675099999999},133.26150999999999,0,{"$f":"SUM(AR72:AS72)","v":133.26150999999999},{"$f":"SUM(AQ72,AT72)","v":1268.3290199999999}]
[{"$error":"#REF!"},"OK",null,null,null,null,null,null,null,null,null,null,null,null,null,null,null,null,3292,null," Vzdělávání národnostních menšin a multikulturní výchova",null,null,1637.27035,0,1637.27035,1878.0355,0,1878.0355,3515.3058500000002,null,null,null,null,null,3292,null," Vzdělávání národnostních menšin a multikulturní výchova",null,null,1473.3118000000002,0,{"$f":"SUM(AO73:AP73)","v":1473.3118000000002},3874.0881499999996,0,{"$f":"SUM(AR73:AS73)","v":3874.0881499999996},{"$f":"SUM(AQ73,AT73)","v":5347.39995}]
[{"$error":"#REF!"},"OK",null,null,null,null,null,null,null,null,null,null,null,null,null,null,null,null,3293,null," Vzdělávací akce k integraci Romů",null,null,48.4,0,48.4,897.22,0,897.22,945.62,null,null,null,null,null,3293,null," Vzdělávací akce k integraci Romů",null,null,3373.3633300000001,0,{"$f":"SUM(AO74:AP74)","v":3373.3633300000001},459.42500000000001,0,{"$f":"SUM(AR74:AS74)","v":459.42500000000001},{"$f":"SUM(AQ74,AT74)","v":3832.7883300000003}]
[{"$error":"#REF!"},null,null,null,null,null,null,null,null,null,null,null,null,null,null,null,null,null,3294,null," Zařízení pro další vzdělávání pedagogických pracovníků",null,null,50,0,50,46942.736380000002,554.29999999999995,47497.036380000005,47547.036379999998,null,null,null,null,null,3294,null," Zařízení pro další vzdělávání pedagogických pracovníků",null,null,50,0,{"$f":"SUM(AO75:AP75)","v":50},50245.097899999993,446,{"$f":"SUM(AR75:AS75)","v":50691.097899999993},{"$f":"SUM(AQ75,AT75)","v":50741.097899999993}]
[{"$error":"#REF!"},"OK",null,null,null,null,null,null,null,null,null,null,null,null,null,null,null,null,3299,null," Ostatní záležitosti vzdělávání",null,null,474292.48353999999,29734.99048,504027.47401999997,610524.02876999998,72150.520829999994,682674.54960000003,1186702.02363,null,null,null,null,null,3299,null," Ostatní záležitosti vzdělávání",null,null,577584.64546999999,67484.786880000014,{"$f":"SUM(AO76:AP76)","v":645069.43235000002},626063.84766999981,108389.86946000002,{"$f":"SUM(AR76:AS76)","v":734453.71712999977},{"$f":"SUM(AQ76,AT76)","v":1379523.1494799997}]
[{"$error":"#REF!"},"OK",null,null,null,null,null,null,null,null,null,null,null,null,null,null,null,null,"Celkem kapitola 700-Obce a DSO; KÚ (část vzdělávání)1)",null,null,null,null,41527227.899999999,16783579.5,58310807.399999999,127864158.5,5789337.5999999996,133653496.09999999,191964303.23971,null,null,null,null,null,"Celkem kapitola 700-Obce a DSO; KÚ (část vzdělávání)1)",null,null,null,null,40760074.802430004,15763895.647230003,56523970.449660003,145721709.54393998,4419792.2698600003,150141501.81379995,206665472.26345998]
["konst","stop",null,null,null,null,null,null,null,null,null,null,null,null,null,null,null,null,null,null,null,null,null,null,null,null,null,null,null,"Zdroj: Závěrečný účet – kapitola 700-Obce a DSO; KÚ (část: vzdělávání); monitor.statnipokladna.cz",null,null,null,null,null,null,null,null,null,null,null,null,null,null,null,null,"Zdroj: Závěrečný účet – kapitola 700-Obce a DSO; KÚ (část: vzdělávání); monitor.statnipokladna.cz"]
[{"$f":"IF(COUNTBLANK(D69:E69)=2,\"odstr\",\"OK\")","v":"OK"},null,null,null,null,null,null,null,null,null,null,null,null,null,null,null,null,"1)","Tabulka neobsahuje z daných tříd následující položky: 5321, 5323, 5329, 5344, 5345, 5349, 5366, 5367, 5641, 5642, 5649, 6341, 6342, 6349, 6441, 6442, 6449.",null,null,null,null,null,null,null,null,null,null,null,null,null,null,null,"1)","Tabulka neobsahuje z daných tříd následující položky: 5321, 5323, 5329, 5344, 5345, 5349, 5366, 5367, 5641, 5642, 5649, 6341, 6342, 6349, 6441, 6442, 6449."]
[{"$f":"IF(COUNTBLANK(D70:E70)=2,\"odstr\",\"OK\")","v":"odstr"}]
["stop"]

{"sheet":"B10","index":10,"n_rows":108,"n_cols":31,"rows_kept":108,"cut":false,"hidden":false,"merged":[[107,19,107,30],[8,18,12,19],[8,21,12,22],[8,23,11,24],[8,25,11,26],[8,27,11,28],[8,29,11,30],[89,21,89,22],[91,21,91,22],[105,21,105,30],[106,19,106,30],[84,21,84,22],[84,6,84,7],[107,4,107,16],[8,11,11,12],[8,13,11,14],[106,4,106,16],[8,3,12,4],[8,6,12,7],[8,9,11,10],[8,15,11,16],[91,6,91,7],[89,6,89,7]]}
[{"$f":"IF(#REF!=\"\",\"ŠABLONA\",IF(#REF!=\"T\",\"TISK\",\"ELEKTRO\"))","v":{"$error":"#REF!"}},0,{"$f":"CONCATENATE(D1,F1,IF(G1<>\"\",\".\",\"\"),G1,IF(H1<>\"\",\".\",\"\"),H1,IF(I1<>\"\",\".\",\"\"),I1,\"\")","v":{"$error":"#REF!"}},{"$f":"IF(#REF!=\"\",\" ?\",#REF!)","v":{"$error":"#REF!"}},{"$f":"CONCATENATE(C1,Q1)","v":{"$error":"#REF!"}},10]
["konst"]
["konst","70x8",null,"Tab. B10:",null,null,null,"Výdaje kapitol 333-MŠMT a 700-Obce a DSO; KÚ  (vzdělávání) – podle paragrafů",null,null,null,null,null,null,null,null,null,null,"Tab. B10:",null,null,"Výdaje kapitol 333-MŠMT a 700-Obce a DSO; KÚ (vzdělávání) - podle paragrafů"]
["konst",{"$f":"COUNTA(Datova_oblast)","v":588},null,{"$f":"IF(D1=\" ?\",\"\",CONCATENATE(\"Tab. \",E1,\":\"))","v":{"$error":"#REF!"}},null,null,null,{"$f":"IF(H3=\"Zadejte název tabulky\",\"\",H3)","v":"Výdaje kapitol 333-MŠMT a 700-Obce a DSO; KÚ  (vzdělávání) – podle paragrafů"},null,null,null,null,null,null,null,null,null,null,{"$f":"IF(S1=\" ?\",\"\",CONCATENATE(\"Tab. \",T1,\":\"))","v":"Tab. :"}]
[{"$f":"IF(D5=\"\",\"odstr\",\"OK\")","v":"odstr"},0]
[{"$f":"IF(COUNTBLANK(C6:IE6)=254,\"odstr\",\"OK\")","v":"OK"},"Řádky pro"]
[{"$f":"IF(COUNTBLANK(C7:IE7)=254,\"odstr\",\"OK\")","v":"OK"},"ročenku PaM"]
["konst",null,null,"(podle stavu k: 31. 12. 2017)",null,null,null,null,null,null,null,null,null,null,null,null,null,null,"(podle stavu k: 31. 12. 2020)"]
["konst",null,null,"Paragraf",null,null,"Název",null,null,"Kapitola 333-MŠMT",null,"Transfery z kapitoly\n333-MŠMT",null,"Kapitola 700-Obce a DSO; KÚ (vzdělávání)1),2)",null,"Celkem",null,null,"Paragraf",null,null,"Název",null,"Kapitola 333-MŠMT",null,"Transfery z kapitoly\n333-MŠMT",null,"Kapitola 700-Obce a DSO; KÚ (vzdělávání)1),2)",null,"Celkem"]
["konst"]
["konst"]
["konst"]
["konst","nebo odstr",null,null,null,null,null,null,null,"v tis. Kč","% z cel. výdajů","v tis. Kč","% z cel. výdajů","v tis. Kč","% z cel. výdajů","v tis. Kč","% z cel. výdajů",null,null,null,null,null,null,"v tis. Kč","% z cel. výdajů","v tis. Kč","% z cel. výdajů","v tis. Kč","% z cel. výdajů","v tis. Kč","% z cel. výdajů"]
[{"$f":"IF(COUNTBLANK(C14:IE14)=254,\"odstr\",IF(AND($A$1=\"TISK\",SUM(J14:Q14)=0),\"odstr\",\"OK\"))","v":{"$error":"#REF!"}},"OK",null,null,"SKUPINA 3 – služby pro obyvatelstvo",null,null,null,null,157370213.11671004,0.99910338634839246,-106424970.75977001,-0.99989190266904338,142567169.77511004,1,193512412.13205007,0.99933009719507726,null,null,"SKUPINA 3 – služby pro obyvatelstvo",null,null,null,{"$f":"X15+X77+X80+X86+X89","v":227306725.55330002},{"$f":"X14/X105","v":0.99949002167155843},{"$f":"SUM(Z15,Z77,Z80,Z86,Z89)","v":-160435668.79191998},{"$f":"-Z14/Z105","v":-0.99827820200673045},{"$f":"SUM(AB15,AB77,AB80,AB86,AB89)","v":223952702.14613998},{"$f":"AB14/AB105","v":0.99931678276241853},{"$f":"SUM(AD15,AD77,AD80,AD86,AD89)","v":290823758.90752},{"$f":"AD14/AD105","v":1.00002620436127}]
[{"$f":"IF(COUNTBLANK(C15:IE15)=254,\"odstr\",IF(AND($A$1=\"TISK\",SUM(J15:Q15)=0),\"odstr\",\"OK\"))","v":{"$error":"#REF!"}},"OK",null,null,null,null,"31–32 – vzdělávání ",null,null,145784199.86241001,0.9255467402246198,-106254453.26749,-0.99828984387986064,140246463.74781004,0.98372201656972813,179776210.34273005,0.92839407961370746,null,null,null,null,"31–32 – vzdělávání a školské služby",null,{"$f":"SUM(X16,X25,X35,X40,X50,X52,X57,X60,X65,X69,X71)","v":213379184.38672003},{"$f":"X15/X105","v":0.93824925376848811},{"$f":"SUM(Z16,Z25,Z35,Z40,Z50,Z52,Z57,Z60,Z65,Z71)","v":-160294732.04872999},{"$f":"-Z15/Z105","v":-0.99740125188929196},206665472.26345998,{"$f":"AB15/AB105","v":0.92217808881640362},{"$f":"SUM(AD16,AD25,AD35,AD40,AD50,AD52,AD57,AD60,AD65,AD69,AD71)","v":259749924.60145003},{"$f":"AD15/AD105","v":0.89317575757252698}]
[null,null,null,null,null,null,null,null,null,null,null,null,null,null,null,null,null,null,null,311,null,"Předškolní a základní vzdělávání",null,2308082.6910800003,{"$f":"X16/X105","v":1.0148866529628327E-2},{"$f":"SUM(Z17:Z24)","v":-892278.27019999991},{"$f":"-Z16/Z105","v":-5.5520194104728407E-3},134999793.30577001,{"$f":"AB16/AB105","v":0.60239308491075871},{"$f":"X16+Z16+AB16","v":136415597.72665},{"$f":"AD16/AD105","v":0.46907849937265977}]
[{"$f":"IF(COUNTBLANK(C17:IE17)=254,\"odstr\",IF(AND($A$1=\"TISK\",SUM(J17:Q17)=0),\"odstr\",\"OK\"))","v":{"$error":"#REF!"}},"OK",null,null,3111,null," Mateřské školy",null,null,632221.16760000004,4.0138111079626136E-3,-515762.89839999995,-4.8457344373752965E-3,20961534.794509999,0.14702918510324212,21077993.06371,0.10885024182666277,null,null,3111,null," Mateřské školy",null,410473.66,{"$f":"X17/X105","v":1.8048930419034303E-3},-257750.62100000001,{"$f":"-Z17/Z105","v":-1.6038006288471743E-3},29678743.910489999,{"$f":"AB17/AB105","v":0.13243183313638698},{"$f":"X17+Z17+AB17","v":29831466.94949},{"$f":"AD17/AD105","v":0.10257844398989978}]
[{"$f":"IF(COUNTBLANK(C18:IE18)=254,\"odstr\",IF(AND($A$1=\"TISK\",SUM(J18:Q18)=0),\"odstr\",\"OK\"))","v":{"$error":"#REF!"}},"OK",null,null,3112,null," Mateřské školy pro děti se speciálními vzdělávacími  potřebami",null,null,36864.961000000003,2.3404624447820934E-4,-3858.2812000000004,-3.6249614188839617E-5,397377.55135000002,2.78730055437613E-3,430384.23115000001,2.2225753418487022E-3,null,null,3112,null," Mateřské školy pro děti se speciálními vzdělávacími  potřebami",null,56787.231,{"$f":"X18/X105","v":2.4969903818155539E-4},-3796.9430000000002,{"$f":"-Z18/Z105","v":-2.36257028110007E-5},520954.25485000003,{"$f":"AB18/AB105","v":2.3245905270809345E-3},573944.54285000009,{"$f":"AD18/AD105","v":1.97356496888779E-3}]
[{"$f":"IF(COUNTBLANK(C19:IE19)=254,\"odstr\",IF(AND($A$1=\"TISK\",SUM(J19:Q19)=0),\"odstr\",\"OK\"))","v":{"$error":"#REF!"}},"OK",null,null,3113,null," Základní školy",null,null,2087243.0524300002,1.325137432627355E-2,-1701039.8774000001,-1.5981738001776814E-2,57584891.64446,0.40391411104882163,57971094.819490001,0.29937232026715604,null,null,3113,null," Základní školy",null,1148489.25,{"$f":"X19/X105","v":5.050020154827692E-3},-612089.0293099999,{"$f":"-Z19/Z105","v":-3.8085990493805029E-3},88302297.628519997,{"$f":"AB19/AB105","v":0.39402055492538768},88838697.849209994,{"$f":"AD19/AD105","v":0.3054806324774656}]
[{"$f":"IF(COUNTBLANK(C20:IE20)=254,\"odstr\",IF(AND($A$1=\"TISK\",SUM(J20:Q20)=0),\"odstr\",\"OK\"))","v":{"$error":"#REF!"}},"OK",null,null,3114,null," Základní školy pro žáky se speciálními vzdělávacími potřebami",null,null,487601.70549000002,3.0956589909617526E-3,-44914.827490000003,-4.2198717083420146E-4,4616960.1050199997,3.2384455076880175E-2,5059646.9830200002,2.6128853728844222E-2,null,null,3114,null," Základní školy pro žáky se speciálními vzdělávacími potřebami",null,692332.50488999998,{"$f":"X20/X105","v":3.0442540960107737E-3},-18641.676889999999,{"$f":"-Z20/Z105","v":-1.1599402943416316E-4},6810053.2003199998,{"$f":"AB20/AB105","v":3.0387668420021299E-2},7483744.0283199996,{"$f":"AD20/AD105","v":2.5733592616936127E-2}]
[{"$f":"IF(COUNTBLANK(C21:IE21)=254,\"odstr\",IF(AND($A$1=\"TISK\",SUM(J21:Q21)=0),\"odstr\",\"OK\"))","v":{"$error":"#REF!"}},null,null,null,3115,null," Ostatní záležitosti předškolního vzdělávání",null,null,0,0,0,0,20956.479620000002,1.4699372690821748E-4,20956.479620000002,1.0822272630879325E-4,null,null,3115,null," Ostatní záležitosti předškolního vzdělávání",null,0,{"$f":"X21/X105","v":0},0,{"$f":"-Z21/Z105","v":0},40298.068219999994,{"$f":"AB21/AB105","v":1.7981714665301238E-4},40298.068219999994,{"$f":"AD21/AD105","v":1.3856888569394003E-4}]
[{"$f":"IF(COUNTBLANK(C22:IE22)=254,\"odstr\",IF(AND($A$1=\"TISK\",SUM(J22:Q22)=0),\"odstr\",\"OK\"))","v":{"$error":"#REF!"}},"OK",null,null,3117,null," První stupeň základních škol",null,null,0,0,0,0,5788360.4238700001,4.0600935215314597E-2,5788360.4238700001,2.9892050443973063E-2,null,null,3117,null," První stupeň základních škol",null,0,0,0,{"$f":"-Z22/Z105","v":0},8766322.7233300004,{"$f":"AB22/AB105","v":3.9116890917523635E-2},8766322.7233300004,{"$f":"AD22/AD105","v":3.0143866072528676E-2}]
[{"$f":"IF(COUNTBLANK(C23:IE23)=254,\"odstr\",IF(AND($A$1=\"TISK\",SUM(J23:Q23)=0),\"odstr\",\"OK\"))","v":{"$error":"#REF!"}},"OK",null,null,3118,null," Druhý stupeň základních škol",null,null,0,0,0,0,20365.93075,1.4285147683106751E-4,20365.93075,1.0517303428566435E-4,null,null,3118,null," Druhý stupeň základních škol",null,0,0,0,{"$f":"-Z23/Z105","v":0},51019.266020000003,{"$f":"AB23/AB105","v":2.2765703780049318E-4},51019.266020000003,{"$f":"AD23/AD105","v":1.754347826977325E-4}]
[{"$f":"IF(COUNTBLANK(C24:IE24)=254,\"odstr\",IF(AND($A$1=\"TISK\",SUM(J24:Q24)=0),\"odstr\",\"OK\"))","v":{"$error":"#REF!"}},"OK",null,null,3119,null," Ostatní záležitosti základního vzdělávání",null,null,0,0,0,0,557875.32002000033,3.9130700349877924E-3,557875.32002000033,2.8809604078413879E-3,null,null,3119,null," Ostatní záležitosti základního vzdělávání",null,0,0,0,{"$f":"-Z24/Z105","v":0},830104.25401999988,{"$f":"AB24/AB105","v":3.7040727999046448E-3},830104.25401999988,{"$f":"AD24/AD105","v":2.8543954231598336E-3}]
[null,null,null,null,null,null,null,null,null,null,null,null,null,null,null,null,null,null,null,312,null,"Střední vzdělávání a vzdělávání v konzervatořích",null,1765552.39931,{"$f":"X25/X105","v":7.76330749366604E-3},{"$f":"SUM(Z26:Z34)","v":-529684.77078999998},{"$f":"-Z25/Z105","v":-3.2958553705435042E-3},48433153.018339999,{"$f":"AB25/AB105","v":0.2161173416954088},49669020.646859996,{"$f":"AD25/AD105","v":0.17079183068951315}]
[{"$f":"IF(COUNTBLANK(C26:IE26)=254,\"odstr\",IF(AND($A$1=\"TISK\",SUM(J26:Q26)=0),\"odstr\",\"OK\"))","v":{"$error":"#REF!"}},"OK",null,null,3121,null," Gymnázia",null,null,514593.04879999999,3.2670201524486052E-3,-120566.098,-1.1327516866198937E-3,7927899.258249999,5.5608168912630575E-2,8321926.2090499988,4.2975803131766237E-2,null,null,3121,null," Gymnázia",null,685398.34847000008,{"$f":"X26/X105","v":3.0137639284469699E-3},-172055.02046999999,{"$f":"-Z26/Z105","v":-1.0705772461595715E-3},10673998.20073,{"$f":"AB26/AB105","v":4.7629278141974839E-2},11187341.528729999,{"$f":"AD26/AD105","v":3.846877823151533E-2}]
[{"$f":"IF(COUNTBLANK(C27:IE27)=254,\"odstr\",IF(AND($A$1=\"TISK\",SUM(J27:Q27)=0),\"odstr\",\"OK\"))","v":{"$error":"#REF!"}},"OK",null,null,3122,null," Střední odborné školy",null,null,335334.96978999994,2.1289562824049445E-3,-156222.06840000002,-1.467749345818162E-3,12204566.654460004,8.5605730082962808E-2,12383679.555850003,6.395136910254362E-2,null,null,3122,null," Střední odborné školy",null,459152.42573000002,{"$f":"X27/X105","v":2.0189383610465009E-3},-200330.11321000001,{"$f":"-Z27/Z105","v":-1.2465132394122286E-3},14707260.048390001,{"$f":"AB27/AB105","v":6.5626409746182501E-2},14966082.36091,{"$f":"AD27/AD105","v":5.1462351610338061E-2}]
[{"$f":"IF(COUNTBLANK(C28:IE28)=254,\"odstr\",IF(AND($A$1=\"TISK\",SUM(J28:Q28)=0),\"odstr\",\"OK\"))","v":{"$error":"#REF!"}},"OK",null,null,3123,null," Střední školy poskytující střední vzdělání s výučním listem",null,null,114483.54172999998,7.2682683691082306E-4,-87766.103129999989,-8.2458670387228607E-4,7985768.2222899999,5.6014075574951819E-2,8012485.6608899999,4.1377800969208241E-2,null,null,3123,null," Střední školy poskytující střední vzdělání s výučním listem",null,158459.53291000001,{"$f":"X28/X105","v":6.9676214637627825E-4},-132874.51290999999,{"$f":"-Z28/Z105","v":-8.2678453512948066E-4},8329874.6734600002,{"$f":"AB28/AB105","v":3.7169382104906536E-2},8355459.6934600007,{"$f":"AD28/AD105","v":2.8731072985001316E-2}]
[{"$f":"IF(COUNTBLANK(C29:IE29)=254,\"odstr\",IF(AND($A$1=\"TISK\",SUM(J29:Q29)=0),\"odstr\",\"OK\"))","v":{"$error":"#REF!"}},"OK",null,null,3124,null," Střední školy a konzervatoře pro žáky se speciálními  vzdělávacími potřebami",null,null,309763.25818,1.9666080008700661E-3,-5215.5815999999995,-4.9001825157381172E-5,1111936.31219,7.799385468225283E-3,1416483.9887699999,7.31495756048379E-3,null,null,3124,null," Střední školy a konzervatoře pro žáky se speciálními  vzdělávacími potřebami",null,401812.46220000001,{"$f":"X29/X105","v":1.7668089035843741E-3},-20099.639199999998,{"$f":"-Z29/Z105","v":-1.2506590231866526E-4},1185230.43105,{"$f":"AB29/AB105","v":5.2887089543403173E-3},1566943.2540500001,{"$f":"AD29/AD105","v":5.3880890635740978E-3}]
[{"$f":"IF(COUNTBLANK(C30:IE30)=254,\"odstr\",IF(AND($A$1=\"TISK\",SUM(J30:Q30)=0),\"odstr\",\"OK\"))","v":{"$error":"#REF!"}},"OK",null,null,3125,null," Střediska praktického vyučování a školní hospodářství",null,null,0,0,0,0,89728.669620000001,6.2937820650813816E-4,89728.669620000001,4.6337368825391441E-4,null,null,3125,null," Střediska praktického vyučování a školní hospodářství",null,0,{"$f":"X30/X105","v":0},0,{"$f":"-Z30/Z105","v":0},168295.07643000002,{"$f":"AB30/AB105","v":7.5096255915250033E-4},168295.07643000002,{"$f":"AD30/AD105","v":5.786992339525494E-4}]
[{"$f":"IF(COUNTBLANK(C31:IE31)=254,\"odstr\",IF(AND($A$1=\"TISK\",SUM(J31:Q31)=0),\"odstr\",\"OK\"))","v":{"$error":"#REF!"}},"OK",null,null,3126,null," Konzervatoře",null,null,37237.4666,2.3641118762102458E-4,-462.33840000000004,-4.3437965653424655E-6,707354.55203000002,4.9615528816753778E-3,744129.68023000006,3.8428087246545435E-3,null,null,3126,null," Konzervatoře",null,58692.364999999998,{"$f":"X31/X105","v":2.5807609969749688E-4},-2288.2199999999998,{"$f":"-Z31/Z105","v":-1.4237981893904653E-5},1167250.5127000001,{"$f":"AB31/AB105","v":5.208479361271473E-3},1223654.6577000001,{"$f":"AD31/AD105","v":4.2076573364758837E-3}]
[{"$f":"IF(COUNTBLANK(C32:IE32)=254,\"odstr\",IF(AND($A$1=\"TISK\",SUM(J32:Q32)=0),\"odstr\",\"OK\"))","v":{"$error":"#REF!"}},null,null,null,3127,null," Střední školy",null,null,0,0,0,0,3893086.0096899997,2.7307030193775166E-2,3893086.0096899997,2.0104539949600219E-2,null,null,3127,null," Střední školy",null,0,{"$f":"X32/X105","v":0},0,{"$f":"-Z32/Z105","v":0},12054559.454399999,{"$f":"AB32/AB105","v":5.3789587962767657E-2},12054559.454399999,{"$f":"AD32/AD105","v":4.1450792678407893E-2}]
[{"$f":"IF(COUNTBLANK(C33:IE33)=254,\"odstr\",IF(AND($A$1=\"TISK\",SUM(J33:Q33)=0),\"odstr\",\"OK\"))","v":{"$error":"#REF!"}},"OK",null,null,3128,null," Sportovní školy - gymnázia",null,null,82999.92,5.2694534433365644E-4,-82999.92,-7.7980710107509869E-4,97972.336939999994,6.8720124762625687E-4,97972.336939999994,5.0594534954103581E-4,null,null,3128,null," Sportovní školy - gymnázia",null,2037.2650000000001,{"$f":"X33/X105","v":8.9580545144197385E-6},-2037.2650000000001,{"$f":"-Z33/Z105","v":-1.2676465629653472E-5},146101.53318,{"$f":"AB33/AB105","v":6.5193102246572201E-4},146101.53318,{"$f":"AD33/AD105","v":5.0238454459911595E-4}]
[{"$f":"IF(COUNTBLANK(C34:IE34)=254,\"odstr\",IF(AND($A$1=\"TISK\",SUM(J34:Q34)=0),\"odstr\",\"OK\"))","v":{"$error":"#REF!"}},"OK",null,null,3129,null," Ostatní zařízení středního vzdělávání",null,null,0,0,0,0,82.269100000000009,5.7705501294424154E-7,82.269100000000009,4.248512371550095E-7,null,null,3129,null," Ostatní zařízení středního vzdělávání",null,0,{"$f":"X34/X105","v":0},0,{"$f":"Z34/Z105","v":0},583.08800000000008,{"$f":"AB34/AB105","v":2.6018423472610748E-6},583.08800000000008,{"$f":"AD34/AD105","v":2.0050056489161437E-6}]
[null,null,null,null,null,null,null,null,null,null,null,null,null,null,null,null,null,null,null,313,null,"Školská zařízení pro výkon ústavní a ochranné výchovy",null,1804107.0829999999,{"$f":"X35/X105","v":7.9328362286520265E-3},{"$f":"SUM(Z36:Z39)","v":0},{"$f":"-Z35/Z105","v":0},2653129.0779400002,{"$f":"AB35/AB105","v":1.1838733754997565E-2},4457236.1609399999,{"$f":"AD35/AD105","v":1.5326646546041085E-2}]
[{"$f":"IF(COUNTBLANK(C36:IE36)=254,\"odstr\",IF(AND($A$1=\"TISK\",SUM(J36:Q36)=0),\"odstr\",\"OK\"))","v":{"$error":"#REF!"}},"OK",null,null,3131,null," Výchovné ústavy a dětské domovy se školou",null,null,890553.34366000001,5.6538962727001154E-3,-280.04640000000001,-2.6311130342115695E-6,62.672599999999996,4.3960050619551286E-7,890335.96986000007,4.5978421822850408E-3,null,null,3131,null," Výchovné ústavy a dětské domovy se školou",null,1201003.58,{"$f":"X36/X105","v":5.2809308271890339E-3},0,{"$f":"-Z36/Z105","v":0},186.24516,{"$f":"AB36/AB105","v":8.31059024127429E-7},1201189.82516,{"$f":"AD36/AD105","v":4.1304097921178182E-3}]
[{"$f":"IF(COUNTBLANK(C37:IE37)=254,\"odstr\",IF(AND($A$1=\"TISK\",SUM(J37:Q37)=0),\"odstr\",\"OK\"))","v":{"$error":"#REF!"}},"OK",null,null,3132,null," Diagnostické ústavy",null,null,331675.31220000004,2.1057220488188665E-3,0,0,0,0,331675.31220000004,1.7128261610002298E-3,null,null,3132,null," Diagnostické ústavy",null,401603.94,{"$f":"X37/X105","v":1.7658920109685061E-3},0,{"$f":"-Z37/Z105","v":0},25,{"$f":"AB37/AB105","v":1.1155444578095734E-7},401628.94,{"$f":"AD37/AD105","v":1.3810407579442601E-3}]
[{"$f":"IF(COUNTBLANK(C38:IE38)=254,\"odstr\",IF(AND($A$1=\"TISK\",SUM(J38:Q38)=0),\"odstr\",\"OK\"))","v":{"$error":"#REF!"}},null,null,null,3133,null," Dětské domovy",null,null,32072.404999999999,2.0361952754091188E-4,0,0,1834610.65194,1.2868394980653491E-2,1866683.05694,9.6398599974626426E-3,null,null,3133,null," Dětské domovy",null,26914.856,{"$f":"X38/X105","v":1.1834726817363335E-4},0,{"$f":"-Z38/Z105","v":0},2652907.8327800003,{"$f":"AB38/AB105","v":1.1837746519749344E-2},2679822.6887800004,{"$f":"AD38/AD105","v":9.2148348604285269E-3}]
[{"$f":"IF(COUNTBLANK(C39:IE39)=254,\"odstr\",IF(AND($A$1=\"TISK\",SUM(J39:Q39)=0),\"odstr\",\"OK\"))","v":{"$error":"#REF!"}},"OK",null,null,3139,null," Ostatní školská zařízení pro výkon ústavní a ochranné výchovy",null,null,127843.736,8.1164730625548883E-4,0,0,10,7.0142375806255515E-8,127853.736,6.6025783574258097E-4,null,null,3139,null," Ostatní školská zařízení pro výkon ústavní a ochranné výchovy",null,174584.799,{"$f":"X39/X105","v":7.6766652685390086E-4},0,{"$f":"-Z39/Z105","v":0},10,{"$f":"AB39/AB105","v":4.4621778312382941E-8},174594.799,{"$f":"AD39/AD105","v":6.0036145190156304E-4}]
[null,null,null,null,null,null,null,null,null,null,null,null,null,null,null,null,null,null,null,314,null,"Ostatní zařízení související s výchovou a vzděláváním mládeže",null,994492.24004000006,{"$f":"X40/X105","v":4.3728801606299226E-3},{"$f":"SUM(Z41:Z49)","v":-9147.7090499999995},{"$f":"-Z40/Z105","v":-5.6919752394703197E-5},10021254.527660001,{"$f":"AB40/AB105","v":4.4716619794520837E-2},11006599.058650002,{"$f":"AD40/AD105","v":3.7847277405723252E-2}]
[{"$f":"IF(COUNTBLANK(C41:IE41)=254,\"odstr\",IF(AND($A$1=\"TISK\",SUM(J41:Q41)=0),\"odstr\",\"OK\"))","v":{"$error":"#REF!"}},"OK",null,null,3141,null," Školní stravování ",null,null,199275.97099999999,1.265152365882024E-3,0,0,3561487.8456299994,2.4981121889759074E-2,3760763.8166299993,1.9421206262655727E-2,null,null,3141,null," Školní stravování ",null,265371.49,{"$f":"X41/X105","v":1.1668645335745679E-3},0,{"$f":"-Z41/Z105","v":0},5075510.71894,{"$f":"AB41/AB105","v":2.2647831412266402E-2},5340882.2089400003,{"$f":"AD41/AD105","v":1.8365150713306449E-2}]
[null,null,null,null,null,null,null,null,null,null,null,null,null,null,null,null,null,null,null,3142,null,"Ostatní školní stravování",null,0,{"$f":"X42/X105","v":0},0,{"$f":"-Z42/Z105","v":0},"x","x","x","x"]
[{"$f":"IF(COUNTBLANK(C43:IE43)=254,\"odstr\",IF(AND($A$1=\"TISK\",SUM(J43:Q43)=0),\"odstr\",\"OK\"))","v":{"$error":"#REF!"}},"OK",null,null,3143,null," Školní družiny a kluby",null,null,108720.727,6.9024019451127726E-4,0,0,1643294.6001500001,1.1526458740411168E-2,1752015.32715,9.047696878344556E-3,null,null,3143,null," Školní družiny a kluby",null,152791.701,{"$f":"X43/X105","v":6.7184013219140403E-4},0,{"$f":"-Z43/Z105","v":0},2449492.7377599999,{"$f":"AB43/AB105","v":1.0930072192211867E-2},2602284.4387599998,{"$f":"AD43/AD105","v":8.9482119333623312E-3}]
[{"$f":"IF(COUNTBLANK(C44:IE44)=254,\"odstr\",IF(AND($A$1=\"TISK\",SUM(J44:Q44)=0),\"odstr\",\"OK\"))","v":{"$error":"#REF!"}},"OK",null,null,3144,null," Školy v přírodě",null,null,0,0,0,0,19011.332999999999,1.3335000638638669E-4,19011.332999999999,9.8177667496251406E-5,null,null,3144,null," Školy v přírodě",null,0,{"$f":"X44/X105","v":0},0,{"$f":"-Z44/Z105","v":0},21623.574659999998,{"$f":"AB44/AB105","v":9.6488235479978116E-5},21623.574659999998,{"$f":"AD44/AD105","v":7.4354796090915899E-5}]
[{"$f":"IF(COUNTBLANK(C45:IE45)=254,\"odstr\",IF(AND($A$1=\"TISK\",SUM(J45:Q45)=0),\"odstr\",\"OK\"))","v":{"$error":"#REF!"}},"OK",null,null,3145,null," Internáty",null,null,66352.792000000001,4.2125697022285665E-4,0,0,72203.767779999995,5.0645438142523627E-4,138556.55978000001,7.1552898765727378E-4,null,null,3145,null," Internáty",null,80353.31,{"$f":"X45/X105","v":3.533214046253524E-4},-119.627,{"$f":"-Z45/Z105","v":-7.44354590040351E-7},88445.604999999996,{"$f":"AB45/AB105","v":3.9466001790145876E-4},168679.288,{"$f":"AD45/AD105","v":5.8002038336435154E-4}]
[{"$f":"IF(COUNTBLANK(C46:IE46)=254,\"odstr\",IF(AND($A$1=\"TISK\",SUM(J46:Q46)=0),\"odstr\",\"OK\"))","v":{"$error":"#REF!"}},"OK",null,null,3146,null," Zařízení výchovného poradenství ",null,null,50637.398999999998,3.2148394422808777E-4,0,0,856048.89003999997,6.0045302953713577E-3,906686.28903999995,4.6822779343657396E-3,null,null,3146,null," Zařízení výchovného poradenství ",null,79695.530989999999,{"$f":"X46/X105","v":3.504290856437663E-4},0,{"$f":"-Z46/Z105","v":0},1201946.43353,{"$f":"AB46/AB105","v":5.3632987300334979E-3},1281641.9645199999,{"$f":"AD46/AD105","v":4.4070524153311044E-3}]
[{"$f":"IF(COUNTBLANK(C47:IE47)=254,\"odstr\",IF(AND($A$1=\"TISK\",SUM(J47:Q47)=0),\"odstr\",\"OK\"))","v":{"$error":"#REF!"}},"OK",null,null,3147,null," Domovy mládeže",null,null,48663.65,3.0895311472327368E-4,0,0,634976.99353999994,4.4538794909208951E-3,683640.64353999996,3.5304333361786599E-3,null,null,3147,null," Domovy mládeže",null,78113.876999999993,{"$f":"X47/X105","v":3.4347439753722663E-4},-1678.809,{"$f":"-Z47/Z105","v":-1.0446046335284272E-5},850638.80226999987,{"$f":"AB47/AB105","v":3.7957016058802881E-3},927073.87026999984,{"$f":"AD47/AD105","v":3.1878350212213276E-3}]
[{"$f":"IF(COUNTBLANK(C48:IE48)=254,\"odstr\",IF(AND($A$1=\"TISK\",SUM(J48:Q48)=0),\"odstr\",\"OK\"))","v":{"$error":"#REF!"}},"OK",null,null,3148,null," Střediska výchovné péče",null,null,249092.18700000001,1.5814228284742749E-3,0,0,18846.084999999999,1.3219091765466349E-4,267938.272,1.3836775452797639E-3,null,null,3148,null," Střediska výchovné péče",null,330817.05800000002,{"$f":"X48/X105","v":1.4546351308562981E-3},0,{"$f":"-Z48/Z105","v":0},41966.879500000003,{"$f":"AB48/AB105","v":1.8726367935114883E-4},372783.9375,{"$f":"AD48/AD105","v":1.2818543693451118E-3}]
[{"$f":"IF(COUNTBLANK(C49:IE49)=254,\"odstr\",IF(AND($A$1=\"TISK\",SUM(J49:Q49)=0),\"odstr\",\"OK\"))","v":{"$error":"#REF!"}},"OK",null,null,3149,null," Ostatní zařízení související s výchovou a vzděláváním mládeže",null,null,0,0,0,0,612358.95675999997,4.2952312073386489E-3,612358.95675999997,3.1623229178687614E-3,null,null,3149,null," Ostatní zařízení související s výchovou a vzděláváním mládeže",null,7349.2730499999998,{"$f":"X49/X105","v":3.231547620130705E-5},-7349.2730499999998,{"$f":"-Z49/Z105","v":-4.5729351469378573E-5},291629.77599999995,{"$f":"AB49/AB105","v":1.3013039213961893E-3},291629.77599999995,{"$f":"AD49/AD105","v":1.002797773701653E-3}]
[null,null,null,null,null,null,null,null,null,null,null,null,null,null,null,null,null,null,null,315,null,"Vyšší odborné vzdělávání",null,186479.87023999999,{"$f":"X50/X105","v":8.1997032465184387E-4},{"$f":"Z51","v":-35291.199420000004},{"$f":"-Z50/Z105","v":-2.1959228498839208E-4},517818.95326999994,{"$f":"AB50/AB105","v":2.310600253876412E-3},669007.62408999994,{"$f":"AD50/AD105","v":2.3004487581092694E-3}]
[{"$f":"IF(COUNTBLANK(C51:IE51)=254,\"odstr\",IF(AND($A$1=\"TISK\",SUM(J51:Q51)=0),\"odstr\",\"OK\"))","v":{"$error":"#REF!"}},"OK",null,null,3150,null," Vyšší odborné školy",null,null,105887.0906,6.7225015899661188E-4,-37848.165000000001,-3.5559393105031922E-4,414761.68334999995,2.9092369863570845E-3,482800.60894999991,2.4932621848494682E-3,null,null,3150,null," Vyšší odborné školy",null,186479.87023999999,{"$f":"X51/X105","v":8.1997032465184387E-4},-35291.199420000004,{"$f":"-Z51/Z105","v":-2.1959228498839208E-4},517818.95326999994,{"$f":"AB51/AB105","v":2.310600253876412E-3},669007.62408999994,{"$f":"AD51/AD105","v":2.3004487581092694E-3}]
[null,null,null,null,null,null,null,null,null,null,null,null,null,null,null,null,null,null,null,321,null,"Vysokoškolské vzdělávání",null,43754485.311759993,{"$f":"X52/X105","v":0.192392773975464},{"$f":"SUM(Z53:Z56)","v":0},{"$f":"-Z52/Z105","v":0},20429.613000000001,{"$f":"AB52/AB105","v":9.1160566229377664E-5},43774914.924759991,{"$f":"AD52/AD105","v":0.15052436631343361}]
[{"$f":"IF(COUNTBLANK(C53:IE53)=254,\"odstr\",IF(AND($A$1=\"TISK\",SUM(J53:Q53)=0),\"odstr\",\"OK\"))","v":{"$error":"#REF!"}},"OK",null,null,3211,null," Vysoké školy",null,null,22625790.358630002,0.14364537810818864,0,0,6834.8329999999996,4.7941142485899673E-5,22632625.191630002,0.11687861922313042,null,null,3211,null," Vysoké školy",null,29013139.93,{"$f":"X53/X105","v":0.12757362892280977},0,{"$f":"-Z53/Z105","v":0},17213.613000000001,{"$f":"AB53/AB105","v":7.6810202324115311E-5},29030353.543000001,{"$f":"AD53/AD105","v":9.9823736457872181E-2}]
[{"$f":"IF(COUNTBLANK(C54:IE54)=254,\"odstr\",IF(AND($A$1=\"TISK\",SUM(J54:Q54)=0),\"odstr\",\"OK\"))","v":{"$error":"#REF!"}},"OK",null,null,3212,null," Výzkum, vývoj a inovace na vysokých školách",null,null,9852317.9520100001,6.2549856381868482E-2,0,0,3920.7,2.7500721282358596E-5,9856238.6520099994,5.0899246314855408E-2,null,null,3212,null," Výzkum, vývoj a inovace na vysokých školách",null,14741345.300000001,{"$f":"X54/X105","v":6.4819144693147521E-2},0,{"$f":"-Z54/Z105","v":0},3000,{"$f":"AB54/AB105","v":1.3386533493714881E-5},14744345.300000001,{"$f":"AD54/AD105","v":5.0699886837098668E-2}]
[{"$f":"IF(COUNTBLANK(C55:IE55)=254,\"odstr\",IF(AND($A$1=\"TISK\",SUM(J55:Q55)=0),\"odstr\",\"OK\"))","v":{"$error":"#REF!"}},"OK",null,null,3213,null," Bakalářské studium",null,null,0,0,0,0,604,4.2365994986978331E-6,604,3.1191558828481862E-6,null,null,3213,null," Bakalářské studium",null,0,{"$f":"X55/X105","v":0},0,{"$f":"-Z55/Z105","v":0},56,{"$f":"AB55/AB105","v":2.4988195854934446E-7},56,{"$f":"AD55/AD105","v":1.9256152817294135E-7}]
[{"$f":"IF(COUNTBLANK(C56:IE56)=254,\"odstr\",IF(AND($A$1=\"TISK\",SUM(J56:Q56)=0),\"odstr\",\"OK\"))","v":{"$error":"#REF!"}},"OK",null,null,3214,null," Magisterské a doktorské studium",null,null,0,0,0,0,50,3.5071187903127757E-7,50,2.5820826844769752E-7,null,null,3214,null," Magisterské a doktorské studium",null,0,{"$f":"X56/X105","v":0},0,{"$f":"-Z56/Z105","v":0},160,{"$f":"AB56/AB105","v":7.1394845299812706E-7},160,{"$f":"AD56/AD105","v":5.5017579477983243E-7}]
[null,null,null,null,null,null,null,null,null,null,null,null,null,null,null,null,null,null,null,322,null,"Zařízení související s vysokoškolským vzděláváním ",null,107145.55971,{"$f":"X57/X105","v":4.7112956088687284E-4},{"$f":"SUM(Z58:Z59)","v":0},{"$f":"-Z57/Z105","v":0},2442,{"$f":"AB57/AB105","v":1.0896638263883913E-5},109587.55971,{"$f":"AD57/AD105","v":3.7682764225894746E-4}]
[{"$f":"IF(COUNTBLANK(C58:IE58)=254,\"odstr\",IF(AND($A$1=\"TISK\",SUM(J58:Q58)=0),\"odstr\",\"OK\"))","v":{"$error":"#REF!"}},"OK",null,null,3221,null," Vysokoškolské koleje a menzy",null,null,129947,8.2500039349586902E-4,0,0,0,0,129947,6.7106779719945902E-4,null,null,3221,null," Vysokoškolské koleje a menzy",null,107145.55971,{"$f":"X58/X105","v":4.7112956088687284E-4},0,{"$f":"-Z58/Z105","v":0},10,{"$f":"AB58/AB105","v":4.4621778312382941E-8},107155.55971,{"$f":"AD58/AD105","v":3.6846497017829403E-4}]
[{"$f":"IF(COUNTBLANK(C59:IE59)=254,\"odstr\",IF(AND($A$1=\"TISK\",SUM(J59:Q59)=0),\"odstr\",\"OK\"))","v":{"$error":"#REF!"}},"OK",null,null,3229,null," Ostatní zařízení související s vysokoškolským vzděláváním",null,null,0,0,0,0,3027.9810000000002,2.123897812362014E-5,3027.9810000000002,1.5636994618050553E-5,null,null,3229,null," Ostatní zařízení související s vysokoškolským vzděláváním",null,null,{"$f":"X59/X105","v":0},0,{"$f":"-Z59/Z105","v":0},2432,{"$f":"AB59/AB105","v":1.0852016485571531E-5},2432,{"$f":"AD59/AD105","v":8.3626720806534528E-6}]
[null,null,null,null,null,null,null,null,null,null,null,null,null,null,null,null,null,null,null,323,null,"Základní umělecké, jazykové a zájmové vzdělávání",null,198379.7175,{"$f":"X60/X105","v":8.7229512307931815E-4},{"$f":"SUM(Z61:Z64)","v":-22659.842500000002},{"$f":"-Z60/Z105","v":-1.4099624478141579E-4},8511943.9291200005,{"$f":"AB60/AB105","v":3.7981807501262649E-2},8687663.8041200005,{"$f":"AD60/AD105","v":2.9873389613823149E-2}]
[{"$f":"IF(COUNTBLANK(C61:IE61)=254,\"odstr\",IF(AND($A$1=\"TISK\",SUM(J61:Q61)=0),\"odstr\",\"OK\"))","v":{"$error":"#REF!"}},"OK",null,null,3231,null," Základní umělecké školy",null,null,18015.726999999999,1.143772604532167E-4,0,0,4957731.7971099997,3.4774708685951207E-2,4975747.5241099996,2.5695583048667221E-2,null,null,3231,null," Základní umělecké školy",null,32439.282999999999,{"$f":"X61/X105","v":1.4263871686927789E-4},-1688.826,{"$f":"-Z61/Z105","v":-1.0508375073181521E-5},7294207.7547599999,{"$f":"AB61/AB105","v":3.2548052139736522E-2},7324958.2117600003,{"$f":"AD61/AD105","v":2.518759191177574E-2}]
[{"$f":"IF(COUNTBLANK(C62:IE62)=254,\"odstr\",IF(AND($A$1=\"TISK\",SUM(J62:Q62)=0),\"odstr\",\"OK\"))","v":{"$error":"#REF!"}},null,null,null,3232,null," Jazykové školy s právem státní jazykové zkoušky",null,null,0,0,0,0,1104.9000000000001,7.7500311028331711E-6,1104.9000000000001,5.7058863161572201E-6,null,null,3232,null," Jazykové školy s právem státní jazykové zkoušky",null,0,{"$f":"X62/X105","v":0},0,{"$f":"-Z62/Z105","v":0},26635.036059999999,{"$f":"AB62/AB105","v":1.1885026744116454E-4},26635.036059999999,{"$f":"AD62/AD105","v":9.1587200833124967E-5}]
[{"$f":"IF(COUNTBLANK(C63:IE63)=254,\"odstr\",IF(AND($A$1=\"TISK\",SUM(J63:Q63)=0),\"odstr\",\"OK\"))","v":{"$error":"#REF!"}},null,null,null,3233,null," Střediska volného času",null,null,106034.5122,6.7318610117311306E-4,-4472.5731999999998,-4.202105666412904E-5,854459.2476,5.9933801656289528E-3,956021.18660000002,4.9370515038259823E-3,null,null,3233,null," Střediska volného času",null,165940.4345,{"$f":"X63/X105","v":7.2965640621004029E-4},-20971.016500000002,{"$f":"-Z63/Z105","v":-1.3048786970823426E-4},1185677.6825699999,{"$f":"AB63/AB105","v":5.2907046701578487E-3},1330647.10057,{"$f":"AD63/AD105","v":4.5755614132973708E-3}]
[{"$f":"IF(COUNTBLANK(C64:IE64)=254,\"odstr\",IF(AND($A$1=\"TISK\",SUM(J64:Q64)=0),\"odstr\",\"OK\"))","v":{"$error":"#REF!"}},"OK",null,null,3239,null," Záležitosti zájmového vzdělávání jinde nezařazené",null,null,0,0,0,0,4863.23387,3.4111877774325033E-5,4863.23387,2.5114543932577897E-5,null,null,3239,null," Záležitosti zájmového vzdělávání jinde nezařazené",null,0,{"$f":"X64/X105","v":0},0,{"$f":"-Z64/Z105","v":0},5423.4557299999988,{"$f":"AB64/AB105","v":2.4200423927108294E-5},5423.4557299999988,{"$f":"AD64/AD105","v":1.8649087916912408E-5}]
[null,null,null,null,null,null,null,null,null,null,null,null,null,null,null,null,null,null,null,326,null,"Správa ve vzdělávání",null,1027377.85614,{"$f":"X65/X105","v":4.5174814480245813E-3},{"$f":"SUM(Z66:Z68)","v":0},{"$f":"-Z65/Z105","v":0},62882.252339999985,{"$f":"AB65/AB105","v":2.8059179236988028E-4},1090260.1084799999,{"$f":"AD65/AD105","v":3.7489670106233145E-3}]
[{"$f":"IF(COUNTBLANK(C66:IE66)=254,\"odstr\",IF(AND($A$1=\"TISK\",SUM(J66:Q66)=0),\"odstr\",\"OK\"))","v":{"$error":"#REF!"}},"OK",null,null,3261,null," Činnost ústředního orgánu státní správy ve vzdělávání",null,null,471826.32829999994,2.9955051406281869E-3,0,0,0,0,471826.32829999994,2.436589184767557E-3,null,null,3261,null," Činnost ústředního orgánu státní správy ve vzdělávání",null,550576.06518000003,{"$f":"X66/X105","v":2.420937092728317E-3},0,{"$f":"-Z66/Z105","v":0},"x","x","x","x"]
[{"$f":"IF(COUNTBLANK(C67:IE67)=254,\"odstr\",IF(AND($A$1=\"TISK\",SUM(J67:Q67)=0),\"odstr\",\"OK\"))","v":{"$error":"#REF!"}},"OK",null,null,3262,null," Činnost ostatních orgánů státní správy ve vzdělávání",null,null,378274.29704000003,2.40156713050223E-3,0,0,0,0,378274.29704000003,1.9534710247393681E-3,null,null,3262,null," Činnost ostatních orgánů státní správy ve vzdělávání",null,476801.76,{"$f":"X67/X105","v":2.0965442191621005E-3},0,{"$f":"-Z67/Z105","v":0},"x","x","x","x"]
[{"$f":"IF(COUNTBLANK(C68:IE68)=254,\"odstr\",IF(AND($A$1=\"TISK\",SUM(J68:Q68)=0),\"odstr\",\"OK\"))","v":{"$error":"#REF!"}},"OK",null,null,3269,null," Ostatní správa ve vzdělávání jinde nezařazená",null,null,0,0,0,0,21444.638200000001,1.5041778716535828E-4,21444.638200000001,1.1074365794218699E-4,null,null,3269,null," Ostatní správa ve vzdělávání jinde nezařazená",null,0,{"$f":"X68/X105","v":0},0,{"$f":"-Z68/Z105","v":0},62882.252339999985,{"$f":"AB68/AB105","v":2.8059179236988028E-4},62882.252339999985,{"$f":"AD68/AD105","v":2.1622683224190918E-4}]
[null,null,null,null,null,null,null,null,null,null,null,null,null,null,null,null,null,null,null,328,null,"Výzkum školství a vzdělávání",null,0,{"$f":"X69/X105","v":0},{"$f":"Z70","v":0},{"$f":"-Z69/Z105","v":0},1912.82134,{"$f":"AB69/AB105","v":8.5353489784675264E-6},1912.82134,{"$f":"AD69/AD105","v":6.5774250062895254E-6}]
[{"$f":"IF(COUNTBLANK(C70:IE70)=254,\"odstr\",IF(AND($A$1=\"TISK\",SUM(J70:Q70)=0),\"odstr\",\"OK\"))","v":{"$error":"#REF!"}},"OK",null,null,3280,null," Výzkum školství a vzdělávání",null,null,0,0,0,0,834.69065999999987,5.8547185955691433E-6,834.69065999999987,4.3104806001613153E-6,null,null,3280,null," Výzkum školství a vzdělávání",null,0,{"$f":"X70/X105","v":0},0,{"$f":"-Z70/Z105","v":0},1912.82134,{"$f":"AB70/AB105","v":8.5353489784675264E-6},1912.82134,{"$f":"AD70/AD105","v":6.5774250062895254E-6}]
[null,null,null,null,null,null,null,null,null,null,null,null,null,null,null,null,null,null,null,329,null,"Ostatní činnost a nespecifikované výdaje",null,161233081.65794003,{"$f":"X71/X105","v":0.70895771292380516},{"$f":"SUM(Z72:Z76)","v":-158805670.25676998},{"$f":"-Z71/Z105","v":-0.98813586882611115},1440712.7646799996,{"$f":"AB71/AB105","v":6.4287165597371266E-3},3868124.1658500447,{"$f":"AD71/AD105","v":1.3300926795335155E-2}]
[{"$f":"IF(COUNTBLANK(C72:IE72)=254,\"odstr\",IF(AND($A$1=\"TISK\",SUM(J72:Q72)=0),\"odstr\",\"OK\"))","v":{"$error":"#REF!"}},"OK",null,null,3291,null," Mezinárodní spolupráce ve vzdělávání",null,null,17503.67021,1.1112634236166992E-4,0,0,3505.7649200000001,2.4590268050702728E-5,21009.435130000002,1.0849619731963055E-4,null,null,3291,null," Mezinárodní spolupráce ve vzdělávání",null,12639.51678,{"$f":"X72/X105","v":5.5577198033227403E-5},0,{"$f":"-Z72/Z105","v":0},1268.3290199999999,{"$f":"AB72/AB105","v":5.6595096357601901E-6},13907.845799999999,{"$f":"AD72/AD105","v":4.7823500729314714E-5}]
[{"$f":"IF(COUNTBLANK(C73:IE73)=254,\"odstr\",IF(AND($A$1=\"TISK\",SUM(J73:Q73)=0),\"odstr\",\"OK\"))","v":{"$error":"#REF!"}},"OK",null,null,3292,null," Vzdělávání národnostních menšin a multikulturní výchova",null,null,10200.973,6.4763378446910938E-5,-878.26700000000005,-8.2515602815029666E-6,6181.7025100000001,4.3359930057889295E-5,15504.408510000001,8.0067329493456924E-5,null,null,3292,null," Vzdělávání národnostních menšin a multikulturní výchova",null,9312.6730000000007,{"$f":"X73/X105","v":4.0948738828264758E-5},0,{"$f":"-Z73/Z105","v":0},5347.39995,{"$f":"AB73/AB105","v":2.3861049511654759E-5},14660.072950000002,{"$f":"AD73/AD105","v":5.0410108042478583E-5}]
[{"$f":"IF(COUNTBLANK(C74:IE74)=254,\"odstr\",IF(AND($A$1=\"TISK\",SUM(J74:Q74)=0),\"odstr\",\"OK\"))","v":{"$error":"#REF!"}},"OK",null,null,3293,null," Vzdělávací akce k integraci Romů",null,null,14328.255999999999,9.0966446613692856E-5,-4364.62,-4.1006806626975026E-5,1086.8230000000001,7.6232347300882038E-6,11050.458999999999,5.7066397678845494E-5,null,null,3293,null," Vzdělávací akce k integraci Romů",null,13469.814,{"$f":"X74/X105","v":5.9228096546641785E-5},-1627.547,{"$f":"-Z74/Z105","v":-1.0127079003539362E-5},3832.7883300000003,{"$f":"AB74/AB105","v":1.7102583117954845E-5},15675.055329999999,{"$f":"AD74/AD105","v":5.390022515250374E-5}]
[{"$f":"IF(COUNTBLANK(C75:IE75)=254,\"odstr\",IF(AND($A$1=\"TISK\",SUM(J75:Q75)=0),\"odstr\",\"OK\"))","v":{"$error":"#REF!"}},null,null,null,3294,null," Zařízení pro další vzdělávání pedagogických pracovníků",null,null,181720.49931000001,1.1536971491224561E-3,-5100,-4.7915904201871557E-5,35245.263740000002,2.4721865346416706E-4,211865.76305000001,1.0941098364098136E-3,null,null,3294,null," Zařízení pro další vzdělávání pedagogických pracovníků",null,377406.38799000002,{"$f":"X75/X105","v":1.6594929956116001E-3},0,{"$f":"-Z75/Z105","v":0},50741.097899999993,{"$f":"AB75/AB105","v":2.2641580218207193E-4},428147.48589000001,{"$f":"AD75/AD105","v":1.4722273958282365E-3}]
[{"$f":"IF(COUNTBLANK(C76:IE76)=254,\"odstr\",IF(AND($A$1=\"TISK\",SUM(J76:Q76)=0),\"odstr\",\"OK\"))","v":{"$error":"#REF!"}},"OK",null,null,3299,null," Ostatní záležitosti vzdělávání",null,null,105129122.58363001,0.66743801318514628,-103482701.60187,-0.97224847382471835,711178.15824000002,4.9883725640470734E-3,2357599.1400000099,1.2175031832663667E-2,null,null,3299,null," Ostatní záležitosti vzdělávání",null,160820253.26617002,{"$f":"X76/X105","v":0.70714246589478535},-158804042.70976999,{"$f":"-Z76/Z105","v":-0.98812574174710766},1379523.1494799997,{"$f":"AB76/AB105","v":6.1556776152896855E-3},3395733.7058800305,{"$f":"AD76/AD105","v":1.1676565565582572E-2}]
[{"$f":"IF(COUNTBLANK(C77:IE77)=254,\"odstr\",IF(AND($A$1=\"TISK\",SUM(J77:Q77)=0),\"odstr\",\"OK\"))","v":{"$error":"#REF!"}},"OK",null,null,null,null,"33 – kultura, církve a sdělovací prostředky",null,null,201678.92905999999,1.2804081343495844E-3,0,0,0,0,201678.92905999999,1.0415033410993725E-3,null,null,null,null,"33 – kultura, církve a sdělovací prostředky",null,237952.20799999998,{"$f":"X77/X105","v":1.0462992546824022E-3},{"$f":"SUM(Z78:Z79)","v":0},{"$f":"-Z77/Z105","v":0},{"$f":"SUM(AB78:AB79)","v":8748085.549970001},{"$f":"AB77/AB105","v":3.9035513406852199E-2},8986037.7579700015,{"$f":"AD77/AD105","v":3.0899377908829555E-2}]
[{"$f":"IF(COUNTBLANK(C78:IE78)=254,\"odstr\",IF(AND($A$1=\"TISK\",SUM(J78:Q78)=0),\"odstr\",\"OK\"))","v":{"$error":"#REF!"}},"OK",null,null,3314,null,"činnosti knihovnické",null,null,159061.82399999999,1.0098429928368539E-3,0,0,0,0,159061.82399999999,8.2142156302344831E-4,null,null,3314,null,"činnosti knihovnické",null,194968.58799999999,{"$f":"X78/X105","v":8.5729605127631491E-4},0,{"$f":"-Z78/Z105","v":0},4028279.3999399999,{"$f":"AB78/AB105","v":1.7974899036446165E-2},4223247.9879400004,{"$f":"AD78/AD105","v":1.4522055114482612E-2}]
[{"$f":"IF(COUNTBLANK(C79:IE79)=254,\"odstr\",IF(AND($A$1=\"TISK\",SUM(J79:Q79)=0),\"odstr\",\"OK\"))","v":{"$error":"#REF!"}},"OK",null,null,3315,null,"činnosti muzeí a galerií",null,null,42617.105060000002,2.7056514151273053E-4,0,0,0,0,42617.105060000002,2.2008177807592417E-4,null,null,3315,null,"činnosti muzeí a galerií",null,42983.62,{"$f":"X79/X105","v":1.8900320340608734E-4},0,{"$f":"-Z79/Z105","v":0},4719806.1500300001,{"$f":"AB79/AB105","v":2.1060614370406027E-2},4762789.7700300002,{"$f":"AD79/AD105","v":1.6377322794346942E-2}]
[{"$f":"IF(COUNTBLANK(C80:IE80)=254,\"odstr\",IF(AND($A$1=\"TISK\",SUM(J80:Q80)=0),\"odstr\",\"OK\"))","v":{"$error":"#REF!"}},"OK",null,null,null,null,"34 – tělovýchova a zájmová činnost",null,null,4533931.0726199998,2.8784773169020041E-2,-64910.576000000001,-6.0985273358907905E-4,2095480.25107,1.469819632651386E-2,6564500.7476899996,3.3900167425693011E-2,null,null,null,null,"34 – tělovýchova a zájmová činnost",null,{"$f":"SUM(X81,X84)","v":7222655.8985799998},{"$f":"X80/X105","v":3.1758728137171607E-2},0,{"$f":"-Z80/Z105","v":0},{"$f":"SUM(AB81,AB84)","v":8215144.7094300017},{"$f":"AB80/AB105","v":3.6657436602833111E-2},15437800.608010001,{"$f":"AD80/AD105","v":5.3084401369778017E-2}]
[null,null,null,null,null,null,null,null,null,null,null,null,null,null,null,null,null,null,null,341,null,"Tělovýchova",null,{"$f":"SUM(X82:X83)","v":6968173.4685800001},{"$f":"X81/X105","v":3.0639743871058948E-2},{"$f":"SUM(Z82:Z83)","v":-255322.76828999998},{"$f":"-Z81/Z105","v":-1.5886938109161851E-3},{"$f":"SUM(AB82:AB83)","v":5706553.3228600016},{"$f":"AB81/AB105","v":2.546365573004512E-2},{"$f":"X81+Z81+AB81","v":12419404.023150001},{"$f":"AD81/AD105","v":4.2705346744552501E-2}]
[{"$f":"IF(COUNTBLANK(C82:IE82)=254,\"odstr\",IF(AND($A$1=\"TISK\",SUM(J82:Q82)=0),\"odstr\",\"OK\"))","v":{"$error":"#REF!"}},"OK",null,null,3411,null,"státní sportovní reprezentace",null,null,1342501.1238299999,8.5231975761533262E-3,0,0,0,0,1342501.1238299999,6.932897811464645E-3,null,null,3411,null,"státní sportovní reprezentace",null,2129249.02,{"$f":"X82/X105","v":9.3625172944780382E-3},0,{"$f":"-Z82/Z105","v":0},1,{"$f":"AB82/AB105","v":4.462177831238294E-9},2129250.02,{"$f":"AD82/AD105","v":7.3216363877404633E-3}]
[{"$f":"IF(COUNTBLANK(C83:IE83)=254,\"odstr\",IF(AND($A$1=\"TISK\",SUM(J83:Q83)=0),\"odstr\",\"OK\"))","v":{"$error":"#REF!"}},"OK",null,null,3419,null,"ostatní tělovýchovná činnost",null,null,2910807.4336800002,1.8479974744909086E-2,-20000,-1.8790550667400612E-4,0,0,2890807.4336800002,1.4928607637324901E-2,null,null,3419,null,"ostatní tělovýchovná činnost",null,4838924.4485799996,{"$f":"X83/X105","v":2.1277226576580908E-2},-255322.76828999998,{"$f":"-Z83/Z105","v":-1.5886938109161851E-3},5706552.3228600016,{"$f":"AB83/AB105","v":2.5463651267867291E-2},10290154.003150001,{"$f":"AD83/AD105","v":3.5383710356812037E-2}]
[null,null,null,null,null,null,null,null,null,null,null,null,null,null,null,null,null,null,null,342,null,"Zájmová činnost a rekreace",null,254482.43,{"$f":"X84/X105","v":1.1189842661126583E-3},{"$f":"Z85","v":-19818.996340000002},{"$f":"-Z84/Z105","v":-1.2331965940525066E-4},2508591.3865699996,{"$f":"AB84/AB105","v":1.1193780872787985E-2},2743254.8202299997,{"$f":"AD84/AD105","v":9.4329525062727907E-3}]
[{"$f":"IF(COUNTBLANK(C85:IE85)=254,\"odstr\",IF(AND($A$1=\"TISK\",SUM(J85:Q85)=0),\"odstr\",\"OK\"))","v":{"$error":"#REF!"}},"OK",null,null,3421,null,"využití volného času dětí a mládeže",{"$error":"#N/A"},null,280622.51511000004,1.7816008479576326E-3,-44910.576000000001,-4.2194722691507293E-4,2095480.25107,1.469819632651386E-2,2331192.1901799999,1.2038661976903467E-2,null,null,3421,null,"využití volného času dětí a mládeže",null,254482.43,{"$f":"X85/X105","v":1.1189842661126583E-3},-19818.996340000002,{"$f":"-Z85/Z105","v":-1.2331965940525066E-4},2508591.3865699996,{"$f":"AB85/AB105","v":1.1193780872787985E-2},2743254.8202299997,{"$f":"AD85/AD105","v":9.4329525062727907E-3}]
[{"$f":"IF(COUNTBLANK(C86:IE86)=254,\"odstr\",IF(AND($A$1=\"TISK\",SUM(J86:Q86)=0),\"odstr\",\"OK\"))","v":{"$error":"#REF!"}},"OK",null,null,null,null,"35 – zdravotnictví",null,null,12058.397999999999,7.6555696514192704E-5,-1194.259,-1.1220392124749593E-5,0,0,10864.138999999999,5.6104210387301998E-5,null,null,null,null,"35 – zdravotnictví",null,{"$f":"X87","v":3542.2},{"$f":"X86/X105","v":1.5575401678710227E-5},{"$f":"Z87","v":-1206.1559999999999},{"$f":"-Z86/Z105","v":-7.5050595175395997E-6},{"$f":"AB87","v":132779.29752999998},{"$f":"AB86/AB105","v":5.9248483788575947E-4},135115.34152999998,{"$f":"AD86/AD105","v":4.6460744008260146E-4}]
[null,null,null,null,null,null,null,null,null,null,null,null,null,null,null,null,null,null,null,354,null,"Zdravotnické programy",null,3542.2,{"$f":"X87/X105","v":1.5575401678710227E-5},{"$f":"Z88","v":-1206.1559999999999},{"$f":"-Z87/Z105","v":-7.5050595175395997E-6},{"$f":"AB88","v":132779.29752999998},{"$f":"AB87/AB105","v":5.9248483788575947E-4},135115.34152999998,{"$f":"AD87/AD105","v":4.6460744008260146E-4}]
[{"$f":"IF(COUNTBLANK(C88:IE88)=254,\"odstr\",IF(AND($A$1=\"TISK\",SUM(J88:Q88)=0),\"odstr\",\"OK\"))","v":{"$error":"#REF!"}},"OK",null,null,3541,null,"prevence před drogami, alkoholem, nikotinem a jinými návykovými látkami",null,null,12058.397999999999,7.6555696514192704E-5,-1194.259,-1.1220392124749593E-5,null,0,10864.138999999999,5.6104210387301998E-5,null,null,3541,null,"prevence před drogami, alkoholem, nikotinem a jinými návykovými látkami",null,3542.2,{"$f":"X88/X105","v":1.5575401678710227E-5},-1206.1559999999999,{"$f":"-Z88/Z105","v":-7.5050595175395997E-6},132779.29752999998,{"$f":"AB88/AB105","v":5.9248483788575947E-4},135115.34152999998,{"$f":"AD88/AD105","v":4.6460744008260146E-4}]
[{"$f":"IF(COUNTBLANK(C89:IE89)=254,\"odstr\",IF(AND($A$1=\"TISK\",SUM(J89:Q89)=0),\"odstr\",\"OK\"))","v":{"$error":"#REF!"}},"OK",null,null,null,null,"38 – výzkum a vývoj odvětvově nespecifikovaný",null,null,6838344.8546199985,4.3414909123888588E-2,-104412.65728,-9.8098566346888766E-4,225225.77622999999,1.5797871037580269E-3,6959157.9735699985,3.5938242604189936E-2,null,null,null,null,"38 – výzkum a vývoj odvětvově nespecifikovaný",null,6463390.8600000003,{"$f":"X89/X105","v":2.8420165109537675E-2},{"$f":"Z90","v":-139730.58718999999},{"$f":"-Z89/Z105","v":-8.6944505792095411E-4},{"$f":"AB90","v":191220.32574999999},{"$f":"AB89/AB105","v":8.5325909844381504E-4},6514880.5985599998,{"$f":"AD89/AD105","v":2.2402060070052864E-2}]
[{"$f":"IF(COUNTBLANK(C90:IE90)=254,\"odstr\",IF(AND($A$1=\"TISK\",SUM(J90:Q90)=0),\"odstr\",\"OK\"))","v":{"$error":"#REF!"}},"OK",null,null,3809,null,"ostatní  výzkum a vývoj odvětvově nespecifikovaný",{"$error":"#N/A"},null,6838344.8546199985,4.3414909123888588E-2,-104412.65728,-9.8098566346888766E-4,225225.77622999999,1.5797871037580269E-3,6959157.9735699985,3.5938242604189936E-2,null,null,3809,null,"ostatní  výzkum a vývoj odvětvově nespecifikovaný",null,6463390.8600000003,{"$f":"X90/X105","v":2.8420165109537675E-2},-139730.58718999999,{"$f":"-Z90/Z105","v":-8.6944505792095411E-4},191220.32574999999,{"$f":"AB90/AB105","v":8.5325909844381504E-4},6514880.5985599998,{"$f":"AD90/AD105","v":2.2402060070052864E-2}]
[{"$f":"IF(COUNTBLANK(C91:IE91)=254,\"odstr\",IF(AND($A$1=\"TISK\",SUM(J91:Q91)=0),\"odstr\",\"OK\"))","v":{"$error":"#REF!"}},"OK",null,null,"SKUPINA 4 – sociální věci a politika zaměstnanosti",null,null,null,null,0,0,0,0,0,0,0,0,null,null,"SKUPINA 4 – sociální věci a politika zaměstnanosti",null,null,null,"x","x","x","x","x","x","x","x"]
[{"$f":"IF(COUNTBLANK(C92:IE92)=254,\"odstr\",IF(AND($A$1=\"TISK\",SUM(J92:Q92)=0),\"odstr\",\"OK\"))","v":{"$error":"#REF!"}},"OK",null,null,null,null,"43 – sociální služby a společné činnosti v sociálním zabezpečení a politice zaměstnanosti",null,null,0,0,0,0,0,0,0,0,null,null,null,null,"43 – sociální služby a společné činnosti v sociálním zabezpečení a politice zaměstnanosti",null,"x","x","x","x","x","x","x","x"]
[{"$f":"IF(COUNTBLANK(C93:IE93)=254,\"odstr\",IF(AND($A$1=\"TISK\",SUM(J93:Q93)=0),\"odstr\",\"OK\"))","v":{"$error":"#REF!"}},"OK",null,null,4322,null,"ústavy péče pro mládež",null,null,0,0,0,0,null,0,0,0,null,null,4322,null,"zrušen",null,"x","x","x","x","x","x","x","x"]
[{"$f":"IF(COUNTBLANK(C94:IE94)=254,\"odstr\",IF(AND($A$1=\"TISK\",SUM(J94:Q94)=0),\"odstr\",\"OK\"))","v":{"$error":"#REF!"}},"OK",null,null,"SKUPINA 5 – bezpečnost státu a právní ochrana",null,null,null,null,17728.292009999997,1.1255240893794907E-4,-11505.499,-1.0809733095661353E-4,". ",null,6222.7930099999976,3.2135532160410698E-5,null,null,"SKUPINA 5 – bezpečnost státu a právní ochrana",null,null,null,{"$f":"SUM(X95,X98)","v":12342.72156},{"$f":"X94/X105","v":5.4272160269176482E-5},{"$f":"SUM(Z95,Z98)","v":-1572.4939999999999},{"$f":"-Z94/Z105","v":-9.7845229480879041E-6},{"$f":"SUM(AB95,AB98)","v":150100.50573999999},{"$f":"AB94/AB105","v":6.6977514917068422E-4},160870.73329999999,{"$f":"AD94/AD105","v":5.5316989718838722E-4}]
[{"$f":"IF(COUNTBLANK(C95:IE95)=254,\"odstr\",IF(AND($A$1=\"TISK\",SUM(J95:Q95)=0),\"odstr\",\"OK\"))","v":{"$error":"#REF!"}},"OK",null,null,null,null,"52 – civilní připravenost na krizové stavy",null,null,52.42501,3.3283303099744411E-7,0,0,". ",null,52.42501,2.7073142110906455E-7,null,null,null,null,"52 – civilní připravenost na krizové stavy",null,{"$f":"SUM(X96:X97)","v":3349.7815599999999},{"$f":"X95/X105","v":1.4729318878927381E-5},{"$f":"SUM(Z96:Z97)","v":0},{"$f":"-Z95/Z105","v":0},{"$f":"SUM(AB96:AB97)","v":96553.753549999994},{"$f":"AB95/AB105","v":4.3084001861365569E-4},99903.535109999997,{"$f":"AD95/AD105","v":3.4352816769036963E-4}]
[null,null,null,null,null,null,null,null,null,null,null,null,null,null,null,null,null,null,null,5273,null,"ostatní správa v oblasti krizového řízení",null,3349.7815599999999,{"$f":"X96/X105","v":1.4729318878927381E-5},0,null,79879.347379999992,{"$f":"AB96/AB105","v":3.5643585305281865E-4},83229.128939999995]
[{"$f":"IF(COUNTBLANK(C97:IE97)=254,\"odstr\",IF(AND($A$1=\"TISK\",SUM(J97:Q97)=0),\"odstr\",\"OK\"))","v":{"$error":"#REF!"}},"OK",null,null,5299,null,"ostatní záležitosti civilní připravenosti na krizové stavy",null,null,52.42501,3.3283303099744411E-7,0,0,". ",null,52.42501,2.7073142110906455E-7,null,null,5299,null,"ostatní záležitosti civilní připravenosti na krizové stavy",null,0,{"$f":"X97/X105","v":0},0,{"$f":"-Z97/Z105","v":0},16674.406170000002,{"$f":"AB97/AB105","v":7.4404165560837041E-5},16674.406170000002,{"$f":"AD97/AD105","v":5.7336591669134329E-5}]
[{"$f":"IF(COUNTBLANK(C98:IE98)=254,\"odstr\",IF(AND($A$1=\"TISK\",SUM(J98:Q98)=0),\"odstr\",\"OK\"))","v":{"$error":"#REF!"}},"OK",null,null,null,null,"53 – bezpečnost a veřejný pořádek",null,null,17675.866999999998,1.1221957590695163E-4,-11505.499,-1.0809733095661353E-4,". ",null,6170.3679999999986,3.1864800739301639E-5,null,null,null,null,"53 – bezpečnost a veřejný pořádek",null,8992.94,{"$f":"X98/X105","v":3.9542841390249101E-5},{"$f":"Z99","v":-1572.4939999999999},{"$f":"-Z98/Z105","v":-9.7845229480879041E-6},{"$f":"AB99","v":53546.752189999992},{"$f":"AB98/AB105","v":2.3893513055702853E-4},60967.198189999996,{"$f":"AD98/AD105","v":2.0964172949801754E-4}]
[{"$f":"IF(COUNTBLANK(C99:IE99)=254,\"odstr\",IF(AND($A$1=\"TISK\",SUM(J99:Q99)=0),\"odstr\",\"OK\"))","v":{"$error":"#REF!"}},"OK",null,null,5399,null,"ostatní záležitosti bezpečnosti, veřejného pořádku",null,null,17675.866999999998,1.1221957590695163E-4,-11505.499,-1.0809733095661353E-4,". ",null,6170.3679999999986,3.1864800739301639E-5,null,null,5399,null,"ostatní záležitosti bezpečnosti, veřejného pořádku",null,8992.94,{"$f":"X99/X105","v":3.9542841390249101E-5},-1572.4939999999999,{"$f":"-Z99/Z105","v":-9.7845229480879041E-6},53546.752189999992,{"$f":"AB99/AB105","v":2.3893513055702853E-4},60967.198189999996,{"$f":"AD99/AD105","v":2.0964172949801754E-4}]
[{"$f":"IF(COUNTBLANK(C100:IE100)=254,\"odstr\",IF(AND($A$1=\"TISK\",SUM(J100:Q100)=0),\"odstr\",\"OK\"))","v":{"$error":"#REF!"}},"OK",null,null,"SKUPINA 6 – všeobecná veřejná správa a služby",null,null,null,null,123498.61540000001,7.8406124266966535E-4,0,0,". ",null,123498.61540000001,6.3776727276244308E-4,null,null,"SKUPINA 6 – všeobecná veřejná správa a služby",null,null,null,{"$f":"X101","v":103637.93},{"$f":"X100/X105","v":4.5570616817233728E-4},{"$f":"Z101","v":0},{"$f":"-Z100/Z105","v":0},{"$f":"AB101","v":3012.4501800000003},{"$f":"AB100/AB105","v":1.344208841090581E-5},106650.38017999999,{"$f":"AD100/AD105","v":3.6672786049439239E-4}]
[{"$f":"IF(COUNTBLANK(C101:IE101)=254,\"odstr\",IF(AND($A$1=\"TISK\",SUM(J101:Q101)=0),\"odstr\",\"OK\"))","v":{"$error":"#REF!"}},"OK",null,null,null,null,"62 – jiné veřejné služby a činnosti",null,null,123498.61540000001,7.8406124266966535E-4,0,0,". ",null,123498.61540000001,6.3776727276244308E-4,null,null,null,null,"62 – jiné veřejné služby a činnosti",null,103637.93,{"$f":"X101/X105","v":4.5570616817233728E-4},{"$f":"SUM(Z102:Z104)","v":0},{"$f":"-Z101/Z105","v":0},{"$f":"SUM(AB102:AB104)","v":3012.4501800000003},{"$f":"AB101/AB105","v":1.344208841090581E-5},106650.38017999999,{"$f":"AD101/AD105","v":3.6672786049439239E-4}]
[{"$f":"IF(COUNTBLANK(C102:IE102)=254,\"odstr\",IF(AND($A$1=\"TISK\",SUM(J102:Q102)=0),\"odstr\",\"OK\"))","v":{"$error":"#REF!"}},"OK",null,null,6221,null,"humanitární zahraniční pomoc",null,null,7431.1220000000003,4.7178300184812345E-5,0,0,". ",null,7431.1220000000003,3.837554288487182E-5,null,null,6221,null,"humanitární zahraniční pomoc přímá",null,0,{"$f":"X102/X105","v":0},0,{"$f":"-Z102/Z105","v":0},2456.8961800000002,{"$f":"AB102/AB105","v":1.096310766805005E-5},2456.8961800000002,{"$f":"AD102/AD105","v":8.4482800532689639E-6}]
[{"$f":"IF(COUNTBLANK(C103:IE103)=254,\"odstr\",IF(AND($A$1=\"TISK\",SUM(J103:Q103)=0),\"odstr\",\"OK\"))","v":{"$error":"#REF!"}},"OK",null,null,6222,null,"rozvojová zahraniční pomoc",null,null,115277.51640000001,7.3186757979196518E-4,0,0,". ",null,115277.51640000001,5.9531215801190106E-4,null,null,6222,null,"rozvojová zahraniční pomoc",null,103637.93,{"$f":"X103/X105","v":4.5570616817233728E-4},0,{"$f":"-Z103/Z105","v":0},3.2240000000000002,{"$f":"AB103/AB105","v":1.438606132791226E-8},103641.15399999999,{"$f":"AD103/AD105","v":3.563803392115563E-4}]
[{"$f":"IF(COUNTBLANK(C104:IE104)=254,\"odstr\",IF(AND($A$1=\"TISK\",SUM(J104:Q104)=0),\"odstr\",\"OK\"))","v":{"$error":"#REF!"}},"OK",null,null,6229,null,"ostatní zahraniční pomoc",null,null,789.97699999999998,5.0153626928877626E-6,0,0,". ",null,789.97699999999998,4.079571865670135E-6,null,null,6229,null,"ostatní zahraniční pomoc",null,0,{"$f":"X104/X105","v":0},0,{"$f":"-Z104/Z105","v":0},552.33000000000004,{"$f":"AB104/AB105","v":2.464594681527847E-6},552.33000000000004,{"$f":"AD104/AD105","v":1.8992412295671554E-6}]
["konst","stop",null,null,"Celkem výdaje",null,null,null,null,157511440.02412003,1,-106436476.25877,-1,142567169.77511004,1,193642133.54046005,1,null,null,"Celkem výdaje",null,null,null,{"$f":"X14+X94+X100","v":227422706.20486003},{"$f":"X105/X105","v":1},{"$f":"SUM(Z15,,Z77,Z81,Z84,Z86,Z89,Z94,Z100)","v":-160712383.05054998},{"$f":"-Z105/Z105","v":-1},{"$f":"SUM(AB14,AB95,AB98,AB100)","v":224105815.10205996},{"$f":"AB105/AB105","v":1},290816138.25637001,{"$f":"AD105/AD105","v":1}]
[{"$f":"IF(COUNTBLANK(D106:E106)=2,\"odstr\",\"OK\")","v":"OK"},null,null,"Komentáře:",null,null,null,null,null,null,null,null,null,null,null,null,"Zdroj: Závěrečný účet – kapitola 333-MŠMT, 700-Obce a DSO; KÚ, (část: vzdělávání)",null,"Komentáře:",null,null,"Zdroj: Závěrečný účet – kapitola 333-MŠMT, 700-Obce a DSO; KÚ, (část: vzdělávání); monitor.statnipokladna.cz"]
[{"$f":"IF(COUNTBLANK(D107:E107)=2,\"odstr\",\"OK\")","v":"OK"},null,null,"1)","Tabulka neobsahuje z daných tříd následující položky: 5321, 5323, 5329, 5344, 5345, 5349, 5366, 5367, 5641, 5642, 5649, 6341, 6342, 6349, 6441, 6442, 6449.",null,null,null,null,null,null,null,null,null,null,null,null,null,"1)","Tabulka neobsahuje z daných tříd následující položky: 5321, 5323, 5329, 5344, 5345, 5349, 5366, 5367, 5641, 5642, 5649, 6341, 6342, 6349, 6441, 6442, 6449."]
["stop",null,null,"2)","V tabulce jsou za kapitolu 700-Obce a DSO;KÚ jsou započteny také paragrafy 3421, 3809 a 4322, které tabulkách B7 a B9 neuvádíme.",null,null,null,null,null,null,null,null,null,null,null,null,null,"2)","V tabulce jsou za kapitolu 700-Obce a DSO;KÚ jsou započteny také paragrafy 3421, 3809 a 4322, které tabulkách B7 a B9 neuvádíme."]

{"sheet":"B11","index":11,"n_rows":38,"n_cols":32,"rows_kept":38,"cut":false,"hidden":false,"merged":[[8,3,12,4],[8,6,12,7],[8,9,12,9],[8,13,12,14],[8,20,12,20],[8,16,12,17],[8,18,12,18],[8,19,12,19],[35,25,35,31],[36,25,36,31],[37,25,37,31],[2,16,2,19],[8,10,12,10],[34,14,34,19],[8,31,12,31],[2,27,2,30],[8,24,12,25],[8,27,12,28],[8,29,12,29],[8,30,12,30],[33,29,33,31],[34,25,34,31]]}
[{"$f":"IF(#REF!=\"\",\"ŠABLONA\",IF(#REF!=\"T\",\"TISK\",\"ELEKTRO\"))","v":{"$error":"#REF!"}},0,{"$f":"CONCATENATE(D1,F1,IF(G1<>\"\",\".\",\"\"),G1,IF(H1<>\"\",\".\",\"\"),H1,IF(I1<>\"\",\".\",\"\"),I1,\"\")","v":{"$error":"#REF!"}},{"$f":"IF(#REF!=\"\",\" ?\",#REF!)","v":{"$error":"#REF!"}},{"$f":"CONCATENATE(C1,K1)","v":{"$error":"#REF!"}},11]
["konst"]
["konst","24x2",null,"Tab. B11:",null,null,null,"Poskytnuté dotace církevním školám – podle paragrafů",null,null,null,null,null,"Tab. B11:",null,null,"Poskytnuté dotace církevním školám – podle paragrafů",null,null,null,null,null,null,null,"Tab. B11:",null,null,"Poskytnuté dotace církevním školám – podle paragrafů"]
["konst",{"$f":"COUNTA(Datova_oblast)","v":40},null,{"$f":"IF(D1=\" ?\",\"\",CONCATENATE(\"Tab. \",E1,\":\"))","v":{"$error":"#REF!"}},null,null,null,{"$f":"IF(H3=\"Zadejte název tabulky\",\"\",H3)","v":"Poskytnuté dotace církevním školám – podle paragrafů"},null,null,null,null,null,{"$f":"IF(N1=\" ?\",\"\",CONCATENATE(\"Tab. \",O1,\":\"))","v":"Tab. :"},null,null,null,{"$f":"IF(Q3=\"Zadejte název tabulky\",\"\",Q3)","v":"Poskytnuté dotace církevním školám – podle paragrafů"},null,null,null,null,null,null,{"$f":"IF(Y1=\" ?\",\"\",CONCATENATE(\"Tab. \",Z1,\":\"))","v":"Tab. :"},null,null,null,{"$f":"IF(AB3=\"Zadejte název tabulky\",\"\",AB3)","v":"Poskytnuté dotace církevním školám – podle paragrafů"}]
[{"$f":"IF(D5=\"\",\"odstr\",\"OK\")","v":"odstr"},0]
[{"$f":"IF(COUNTBLANK(C6:IV6)=254,\"odstr\",\"OK\")","v":"odstr"},"Řádky pro"]
[{"$f":"IF(COUNTBLANK(C7:IV7)=254,\"odstr\",\"OK\")","v":"odstr"},"ročenku PaM"]
["konst",null,null,"(podle stavu k: 31. 12. 2017)",null,null,null,null,null,null,"v tis. Kč",null,null,"(podle stavu k: 31. 12. 2019)",null,null,null,null,null,null,"v tis. Kč",null,null,null,"(podle stavu k: 31. 12. 2020)",null,null,null,null,null,null,"v tis. Kč"]
["konst",null,null,"Paragraf",null,null,"Název",null,null,"Uvolněno","Čerpáno",null,null,"Paragraf",null,null,"Název",null,"Uvolněno 1)","Čerpáno 2)","Skutečnost 4)",null,null,null,"Paragraf",null,null,"Název",null,"Uvolněno 1)","Čerpáno 2)","Skutečnost 4)"]
["konst"]
["konst"]
["konst"]
["konst"]
[{"$f":"IF(COUNTBLANK(C14:IV14)=254,\"odstr\",IF(AND($A$1=\"TISK\",SUM(J14:K14)=0),\"odstr\",\"OK\"))","v":{"$error":"#REF!"}},"OK",null,null,3111,null," Mateřské školy",null,null,84531.373000000007,84496.402000000002,null,null,null,3111,null," Mateřské školy",null,107127.52899999999,106255.73832999999,106255.73832999999,null,null,null,null,3111,null," Mateřské školy",null,131088.07800000001,131051.758,131028.32399999999]
[{"$error":"#REF!"},"OK",null,null,3112,null," Mateřské školy pro děti se speciálními vzdělávacími  potřebami",null,{"$error":"#N/A"},10474.316999999999,10474.316999999999,null,null,null,3112,null," Mateřské školy pro děti se speciálními vzdělávacími  potřebami",null,15724.797,15724.797,15724.797,null,null,null,null,3112,null," Mateřské školy pro děti se speciálními vzdělávacími  potřebami",null,17318.662,17318.662,17318.662]
[{"$error":"#REF!"},"OK",null,null,3113,null," Základní školy",null,{"$error":"#N/A"},333558.84899999999,333142.42700000003,null,null,null,3113,null," Základní školy",null,430323.13799999998,428133.24027000001,428133.24027000001,null,null,null,null,3113,null," Základní školy",null,498098.397,497299.45199999999,496604.30102000001]
[{"$error":"#REF!"},"OK",null,null,3114,null," Základní školy pro žáky se speciálními vzdělávacími potřebami",null,{"$error":"#N/A"},99125.804999999993,98844.206000000006,null,null,null,3114,null," Základní školy pro žáky se speciálními vzdělávacími potřebami",null,156626.09099999999,156283.49799999999,156283.49799999999,null,null,null,null,3114,null," Základní školy pro žáky se speciálními vzdělávacími potřebami",null,179937.682,179937.682,179937.682]
[{"$error":"#REF!"},"OK",null,null,3121,null," Gymnázia",null,{"$error":"#N/A"},360065.11300000001,359657.84299999999,null,null,null,3121,null," Gymnázia",null,426861.61300000001,426819.32,426819.32,null,null,null,null,3121,null," Gymnázia",null,479647.07400000002,479278.01299999998,479256.95]
[{"$error":"#REF!"},"OK",null,null,3122,null," Střední odborné školy",null,{"$error":"#N/A"},124135.734,124134.65300000001,null,null,null,3122,null," Střední odborné školy",null,142648.125,142450.49799999999,142450.49799999999,null,null,null,null,3122,null," Střední odborné školy",null,172094.48,171872.587,171872.587]
[{"$error":"#REF!"},"OK",null,null,3123,null," Střední školy poskytující střední vzdělání s výučním listem",null,{"$error":"#N/A"},14653.138999999999,14653.138999999999,null,null,null,3123,null," Střední školy poskytující střední vzdělání s výučním listem",null,17161.024000000001,17161.024000000001,17161.024000000001,null,null,null,null,3123,null," Střední školy poskytující střední vzdělání s výučním listem",null,21219.883999999998,21219.883999999998,21219.883999999998]
[{"$error":"#REF!"},"OK",null,null,3124,null," Střední školy a konzervatoře pro žáky se speciálními  vzdělávacími potřebami",null,{"$error":"#N/A"},36211.017999999996,36069.750999999997,null,null,null,3124,null," Střední školy a konzervatoře pro žáky se speciálními  vzdělávacími potřebami",null,47717.635999999999,47717.635999999999,47717.635999999999,null,null,null,null,3124,null," Střední školy a konzervatoře pro žáky se speciálními  vzdělávacími potřebami",null,50084.864999999998,49484.445,49484.445]
[{"$error":"#REF!"},"OK",null,null,3126,null," Konzervatoře",null,{"$error":"#N/A"},36487.271000000001,36487.271000000001,null,null,null,3126,null," Konzervatoře",null,47379.023999999998,47344.76483,47344.76483,null,null,null,null,3126,null," Konzervatoře",null,55912.434000000001,55805.694000000003,55805.694000000003]
[{"$error":"#REF!"},"OK",null,null,3133,null," Dětské domovy",null,{"$error":"#N/A"},14410,14410,null,null,null,3133,null," Dětské domovy",null,17245.990000000002,17245.990000000002,17245.990000000002,null,null,null,null,3133,null," Dětské domovy",null,18944.495999999999,18944.495999999999,18807.593000000001]
[{"$error":"#REF!"},"OK",null,null,3141,null," Školní stravování při předškolním a základním vzdělávání",null,{"$error":"#N/A"},64859.248,64859.248,null,null,null,3141,null," Školní stravování při předškolním a základním vzdělávání",null,78182.682000000001,78182.682000000001,78182.682000000001,null,null,null,null,3141,null," Školní stravování při předškolním a základním vzdělávání",null,84161.634000000005,84160.365000000005,84160.365000000005]
[{"$error":"#REF!"},"OK",null,null,3143,null," Školní družiny a kluby",null,{"$error":"#N/A"},91142.206999999995,91142.206999999995,null,null,null,3143,null," Školní družiny a kluby",null,115803.44899999999,115803.44899999999,115803.44899999999,null,null,null,null,3143,null," Školní družiny a kluby",null,126058.856,125969.067,125969.067]
[{"$error":"#REF!"},"OK",null,null,3145,null," Internáty",null,{"$error":"#N/A"},4889.7439999999997,4889.7439999999997,null,null,null,3145,null," Internáty",null,6929.085,6929.085,6929.085,null,null,null,null,3145,null," Internáty",null,7597.1670000000004,7597.1670000000004,7597.1670000000004]
[{"$error":"#REF!"},"OK",null,null,3146,null," Zařízení výchovného poradenství a preventivně výchovné péče",null,{"$error":"#N/A"},9953,9953,null,null,null,3146,null," Zařízení výchovného poradenství a preventivně výchovné péče",null,14241.588,14241.588,14241.588,null,null,null,null,3146,null," Zařízení výchovného poradenství a preventivně výchovné péče",null,18947.588,18947.588,18947.588]
[{"$error":"#REF!"},"OK",null,null,3147,null," Domovy mládeže",null,null,48663.65,48663.65,null,null,null,3147,null," Domovy mládeže",null,58557.347000000002,58523.087670000001,58523.087670000001,null,null,null,null,3147,null," Domovy mládeže",null,66874.929999999993,66874.929999999993,66874.929999999993]
[{"$error":"#REF!"},"OK",null,null,3150,null," Vyšší odborné školy",null,{"$error":"#N/A"},62055.887000000002,62055.887000000002,null,null,null,3150,null," Vyšší odborné školy",null,56945.120000000003,56944.245999999999,56944.245999999999,null,null,null,null,3150,null," Vyšší odborné školy",null,77149.817999999999,77149.817999999999,77149.817999999999]
[{"$error":"#REF!"},"OK",null,null,3231,null," Základní umělecké školy",null,{"$error":"#N/A"},15346.963,15346.963,null,null,null,3231,null," Základní umělecké školy",null,22633.384999999998,22633.384999999998,22633.384999999998,null,null,null,null,3231,null," Základní umělecké školy",null,28217.511999999999,28217.511999999999,28217.511999999999]
[{"$error":"#REF!"},"OK",null,null,3392,null," Střediska volného času",null,{"$error":"#N/A"},100304.394,100304.394,null,null,null,3233,null," Střediska volného času",null,114123.579,114123.579,114123.579,null,null,null,null,3233,null," Střediska volného času",null,142022.872,140992.872,140992.872]
[{"$error":"#REF!"},"OK",null,null,3299,null," Ostatní záležitosti vzdělávání",null,null,39950.334000000003,36397.362959999999,null,null,null,3299,null," Ostatní záležitosti vzdělávání 3)",null,3532.4,3441.5,2421.3287999999998,null,null,null,null,3299,null," Ostatní záležitosti vzdělávání 3)",null,3624,3624,3624]
[{"$error":"#REF!"},"OK",null,null,"Dotace celkem",null,null,null,null,1550818.0459999999,1545982.4649599998,null,null,null,"Dotace celkem",null,null,null,1879763.602,1875959.1080999998,{"$f":"SUM(U14:U32)","v":1874938.9368999999},null,null,null,null,"Dotace celkem",null,null,null,{"$f":"SUM(AD14:AD32)","v":2179000.429},{"$f":"SUM(AE14:AE32)","v":2175745.9920000001},{"$f":"SUM(AF14:AF32)","v":2174869.4410200003}]
["konst","stop",null,"Komentáře:",null,null,null,null,null,null,"Zdroj: Centrální registr dotací MF",null,null,"Komentáře:",null,null,null,null,null,"Zdroj: Centrální registr dotací MF",null,null,null,null,"Komentáře:",null,null,null,null,"Zdroj: Centrální registr dotací MF"]
["stop",null,null,null,null,null,null,null,null,null,null,null,null,"1)","Údaje odpovídající hodnotám, na co bylo příjemcům dotačních prostředků vystavena rozhodnutí o poskytnutí dotace a co příjemcům dotačních prostředků skutečně v součtu za všechna rozhodnutí o poskytnutí dotace v příslušném roce odešlo.",null,null,null,null,null,null,null,null,null,"1)","Údaje odpovídající hodnotám, na co bylo příjemcům dotačních prostředků vystavena rozhodnutí o poskytnutí dotace a co příjemcům dotačních prostředků skutečně v součtu za všechna rozhodnutí o poskytnutí dotace v příslušném roce odešlo."]
[null,null,null,null,null,null,null,null,null,null,null,null,null,"2) ","Údaje představující rozdíl mezi poskytnutými dotačními prostředky a vratkami před koncem roku a nezahrnující vratky z finančního vypořádání.",null,null,null,null,null,null,null,null,null,"2) ","Údaje představující rozdíl mezi poskytnutými dotačními prostředky a vratkami před koncem roku a nezahrnující vratky z finančního vypořádání."]
[null,null,null,null,null,null,null,null,null,null,null,null,null,"3)","Zahrnuty rozvojové programy.",null,null,null,null,null,null,null,null,null,"3)","Zahrnuty rozvojové programy."]
[null,null,null,null,null,null,null,null,null,null,null,null,null,"4)","Údaje představují spotřebované dotace církevními školami dle paragrafů (oddíl 31 - 32 rozpočtové skladby).",null,null,null,null,null,null,null,null,null,"4)","Údaje představují spotřebované dotace církevními školami dle paragrafů (oddíl 31 - 32 rozpočtové skladby)."]

{"sheet":"B12","index":12,"n_rows":39,"n_cols":35,"rows_kept":39,"cut":false,"hidden":false,"merged":[[20,16,20,18],[21,16,21,19],[38,15,38,22],[23,15,23,19],[24,16,24,19],[25,15,25,19],[26,15,30,15],[33,15,34,15],[33,16,33,19],[34,16,34,19],[8,9,10,11],[8,3,12,8],[30,4,30,11],[11,11,12,11],[29,4,29,11],[16,4,18,4],[18,5,18,7],[38,27,38,34],[23,27,23,31],[24,28,24,31],[25,27,25,31],[26,27,30,27],[33,27,34,27],[33,28,33,31],[34,28,34,31],[20,28,20,30],[21,28,21,31],[22,16,22,19],[13,15,14,15],[2,30,2,34],[7,26,11,31],[7,32,9,34],[10,34,11,34],[13,27,14,27],[18,27,22,27],[10,32,10,33],[22,28,22,31],[7,14,11,19],[7,20,9,22],[10,22,11,22],[18,15,22,15]]}
[{"$error":"#REF!"},0,{"$error":"#REF!"},{"$error":"#REF!"},{"$error":"#REF!"},12]
["konst"]
["konst","15x3",null,"Tab. B12:",null,null,null,"Porovnání dotací církevním školám v letech",null,null,null,null,null,null,"Tab. B12:",null,null,null,"Porovnání čerpaných dotací církevním školám v letech 2018 a 2019 - vybrané oblasti",null,null,null,null,null,null,null,"Tab. B12:",null,null,null,"Porovnání čerpaných dotací církevním školám v letech 2019 a 2020 - vybrané oblasti"]
["konst",45,null,{"$error":"#REF!"},null,null,null,"Porovnání dotací církevním školám v letech",null,null,null,null,null,null,{"$error":"#REF!"},null,null,null,"Porovnání dotací církevním školám v letech"]
[{"$error":"#REF!"},0,null,{"$error":"#REF!"},"2016 a 2017 – vybrané oblasti",null,null,null,null,null,null,null,null,null,"(podle stavu k: 31. 12. 2019)",null,null,null,null,null,null,null,"v tis. Kč",null,null,null,"(podle stavu k: 31. 12. 2020)",null,null,null,null,null,null,null,"v tis. Kč"]
["odstr","Řádky pro"]
["odstr","ročenku PaM"]
["konst",null,null,"(podle stavu k: 31. 12. 2017)",null,null,null,null,null,null,null,"v tis. Kč",null,null,null,null,null,null,null,null,"Dotace církevním školám",null,null,null,null,null,null,null,null,null,null,null,"Dotace církevním školám"]
["konst",null,null,null,null,null,null,null,null,"Dotace církevním školám"]
["konst"]
["konst",null,null,null,null,null,null,null,null,null,null,null,null,null,null,null,null,null,null,null,"čerpáno1)",null,"Index 2019/2018",null,null,null,null,null,null,null,null,null,"čerpáno1)",null,"Index 2020/2019"]
["konst","Označte",null,null,null,null,null,null,null,"skutečnost1)",null,"Index 2017/2016",null,null,null,null,null,null,null,null,2018,2019,null,null,null,null,null,null,null,null,null,null,2019,2020]
["konst","nebo odstr",null,null,null,null,null,null,null,2016,2017,null,null,null,null,"Předškolní vzdělávání",null,null,null,null,{"$f":"SUM(U14:U17)","v":620837.1716},{"$f":"SUM(V14:V17)","v":706397.27360000007},{"$f":"V13/U13","v":1.1378140773683019},null,null,null,null,"Předškolní vzdělávání",null,null,null,null,706397.27360000007,{"$f":"SUM(AH14:AH15)","v":148370.42000000001},{"$f":"AH13/AG13","v":0.21003821156310873}]
[{"$error":"#REF!"},"OK",null,null,"Předškolní vzdělávání",null,null,null,null,82856,94775.91399999999,1.1438630153519358,null,null,null,"z toho"," Mateřské školy",null,null,null,97130.933000000005,106255.73832999999,{"$f":"V14/U14","v":1.0939433509817102},null,null,null,null,"z toho"," Mateřské školy",null,null,null,106255.73832999999,131051.758,1.2333616994217351]
[{"$error":"#REF!"},"OK",null,null,"Základní vzdělávání včetně školních družin a klubů",null,null,null,null,449704,523110.41499999998,1.1632327375340223,null,null,null,null," Mateřské školy pro děti se speciálními vzdělávacími  potřebami",null,null,null,15040.062,15724.797,1.0455274054056427,null,null,null,null,null," Mateřské školy pro děti se speciálními vzdělávacími  potřebami",null,null,null,15724.797,17318.662,1.1013599730413053]
[{"$error":"#REF!"},"OK",null,null,"Střední vzdělávání",null,null,null,null,490323,534515.38599999994,1.0901291312053483,null,null,null,"Základní školy",null,null,null,null,385867.39760000003,428133.24027000001,1.1095346301161568,null,null,null,null,"Základní školy",null,null,null,null,428133.24027000001,497299.45199999999,1.1615530055231886]
[{"$error":"#REF!"},"OK",null,null,"z toho","gymnázia2)",null,null,null,334503,359657.84299999999,1.0752006499194326,null,null,null,"Základní školy pro žáky se speciáními vzdělávacími potřebami",null,null,null,null,122798.77899999999,156283.49799999999,1.2726795760729837,null,null,null,null,"Základní školy pro žáky se speciáními vzdělávacími potřebami",null,null,null,null,156283.49799999999,179937.682,1.1513543291691617]
[{"$error":"#REF!"},"OK",null,null,null,"střední odborné školy2)",null,null,null,113681,124134.65300000001,1.0919560260729586,null,null,null,"Střední vzdělávání a vzdělávání v konzervatořích",null,null,null,null,{"$f":"SUM(U19:U23)","v":632976.13600000006},{"$f":"SUM(V19:V23)","v":681493.24282999989},1.076649187971914,null,null,null,null,"Střední vzdělávání a vzdělávání v konzervatořích",null,null,null,null,681493.24282999989,{"$f":"SUM(AH19:AH23)","v":777660.62299999991},1.1411127420290346]
[{"$error":"#REF!"},"OK",null,null,null," střední školy poskytující střední vzdělání s výučním listem 2)",null,null,null,13504,14653.138999999999,1.0850961937203791,null,null,null,"z toho","Gymnázia",null,";",null,391202.79499999998,426819.32,1.0910436363318929,null,null,null,null,"z toho","Gymnázia",null,null,null,426819.32,479278.01299999998,1.1229060882248723]
[null,null,null,null,"Konzervatoře",null,null,null,null,38817,36487.271000000001,0.93998173480691449,null,null,null,null,"Střední odborné školy",null,null,null,137923.87899999999,142450.49799999999,1.0328196903452811,null,null,null,null,null,"Střední odborné školy",null,null,null,142450.49799999999,171872.587,1.2065425492580588]
[{"$error":"#REF!"},"OK",null,null,"Vyšší odborné školy",null,null,null,null,66136,62055.887000000002,0.93830723055521958,null,null,null,null,"Střední školy poskytující střední vzdělání s výučním listem ",null,null,null,16146.198,17161.024000000001,1.062852319784509,null,null,null,null,null,"Střední školy poskytující střední vzdělání s výučním listem ",null,null,null,17161.024000000001,21219.883999999998,1.2365161892437186]
[{"$error":"#REF!"},"OK",null,null,"Školní stravování",null,null,null,null,63747,64859.248,1.0174478485262051,null,null,null,null,"Střední školy a konzervatoře pro žáky se speciálními  vzdělávacími potřebami",null,null,null,46267.089,47717.635999999999,1.0313515942185167,null,null,null,null,null,"Střední školy a konzervatoře pro žáky se speciálními  vzdělávacími potřebami",null,null,null,47717.635999999999,49484.445,1.0370263313128085]
[{"$error":"#REF!"},"OK",null,null,"Ubytovací zařízení",null,null,null,null,51498,53553.394,1.0399121130917706,null,null,null,null," Konzervatoře",null,null,null,41436.175000000003,47344.76483,1.1425949627348566,null,null,null,null,null," Konzervatoře",null,null,null,47344.76483,55805.694000000003,1.1787088646523118]
[{"$error":"#REF!"},"OK",null,null,"Ústavní a ochranná výchova",null,null,null,null,12344,14410,1.1673687621516526,null,null,null,"Školská zařízení pro výkon ústavní a ochranné výchovy",null,null,null,null,{"$f":"SUM(U25)","v":16085.375},{"$f":"SUM(V25)","v":17245.990000000002},1.0721534313001719,null,null,null,null,"Školská zařízení pro výkon ústavní a ochranné výchovy",null,null,null,null,17245.990000000002,{"$f":"AH25","v":18944.495999999999},1.0984870106036242]
[{"$error":"#REF!"},"OK",null,null,"Zařízení pro zájmové studium (ZUŠ)",null,null,null,null,12888,15346.963,1.1907947703289883,null,null,null,"z toho","Dětské domovy",null,null,null,16085.375,17245.990000000002,1.0721534313001719,null,null,null,null,"z toho","Dětské domovy",null,null,null,17245.990000000002,18944.495999999999,1.0984870106036242]
[{"$error":"#REF!"},"OK",null,null,"Domy a stanice dětí a mládeže",null,null,null,null,90826,100304.394,1.1043577169532952,null,null,null,"Ostatní zařízení související s výchovou a vzděláváním mládeže",null,null,null,null,{"$f":"SUM(U27:U31)","v":252582.32499999995},{"$f":"SUM(V27:V31)","v":273679.89166999998},1.0835274862166229,null,null,null,null,"Ostatní zařízení související s výchovou a vzděláváním mládeže",null,null,null,null,273679.89166999998,{"$f":"SUM(AH27:AH31)","v":303549.11699999997},1.109139276355809]
[{"$error":"#REF!"},"OK",null,null,"Zařízení výchovného poradenství",null,null,null,null,8004,9953,1.2435032483758122,null,null,null,"z toho"," Školní stravování",null,null,null,73199.343999999997,78182.682000000001,1.0680789980850103,null,null,null,null,"z toho"," Školní stravování",null,null,null,78182.682000000001,84160.365000000005,1.0764578912757177]
[{"$error":"#REF!"},"OK",null,null,"Provozní dotace celkem",null,null,null,null,1367143,{"$f":"SUM(K14:K27)","v":2007817.5069999998},1.4686228924114009,null,null,null,null," Školní družiny a kluby",null,null,null,107478.978,115803.44899999999,1.0774520855603966,null,null,null,null,null," Školní družiny a kluby",null,null,null,115803.44899999999,125969.067,1.0877833785416875]
["konst","stop",null,"Komentáře:",null,null,null,null,null,null,null,"Zdroj: Centrální registr dotací MF",null,null,null,null," Internáty",null,null,null,6448.7920000000004,6929.085,1.0744779797518667,null,null,null,null,null," Internáty",null,null,null,6929.085,7597.1670000000004,1.0964170593952882]
["OK",null,null,"1)","Tabulka uvádí pouze spotřebované finanční prostředky, to znamená dotace zmenšené o vratky.",null,null,null,null,null,null,null,null,null,null,null," Zařízení výchovného poradenství. Školská poradenská zařízení.",null,null,null,12622.974,14241.588,1.1282276268651112,null,null,null,null,null," Zařízení výchovného poradenství. Školská poradenská zařízení.",null,null,null,14241.588,18947.588,1.3304406783850229]
["OK",null,null,"2)","Bez škol pro děti, žáky, studenty se speciálními vzdělávacími potřebami.",null,null,null,null,null,null,null,null,null,null,null," Domovy mládeže",null,null,null,52832.237000000001,58523.087670000001,1.107715497074258,null,null,null,null,null," Domovy mládeže",null,null,null,58523.087670000001,66874.929999999993,1.1427102133963669]
["stop",null,null,null,null,null,null,null,null,null,null,null,null,null,null,"Vyšší odborné školy",null,null,null,null,62546.879249999998,56944.245999999999,0.91042505529962159,null,null,null,null,"Vyšší odborné školy",null,null,null,null,56944.245999999999,77149.817999999999,1.3548307936152144]
[null,null,null,null,null,null,null,null,null,null,null,null,null,null,null,"Základní umělecké, jazykové a zájmové vzdělávání",null,null,null,null,{"$f":"SUM(U34:U35)","v":130467.57399999999},{"$f":"SUM(V34:V35)","v":136756.96400000001},1.0482065375109988,null,null,null,null,"Základní umělecké, jazykové a zájmové vzdělávání",null,null,null,null,136756.96400000001,{"$f":"SUM(AH34:AH35)","v":169210.38399999999},1.2373072569818089]
[null,null,null,null,null,null,null,null,null,null,null,null,null,null,null,"z toho"," Základní umělecké školy",null,null,null,19749.494999999999,22633.384999999998,1.1460234806003899,null,null,null,null,"z toho"," Základní umělecké školy",null,null,null,22633.384999999998,28217.511999999999,1.2467208064547128]
[null,null,null,null,null,null,null,null,null,null,null,null,null,null,null,null," Střediska volného času",null,null,null,110718.079,114123.579,1.0307583009997852,null,null,null,null,null," Střediska volného času",null,null,null,114123.579,140992.872,1.2354403291190159]
[null,null,null,null,null,null,null,null,null,null,null,null,null,null,null,"Ostatní záležitosti vzdělávání",null,null,null,null,7535.5,3441.5,0.45670492999800943,null,null,null,null,"Ostatní záležitosti vzdělávání",null,null,null,null,3441.5,3624,1.0530292023826819]
[null,null,null,null,null,null,null,null,null,null,null,null,null,null,null,"Dotace celkem",null,null,null,null,1723030.9608499999,1875959.1080999998,1.0887553101045602,null,null,null,null,"Dotace celkem",null,null,null,null,1875959.1080999998,2175745.9920000001,1.1598045941436479]
[null,null,null,null,null,null,null,null,null,null,null,null,null,null,"Komentáře:",null,null,null,null,null,null,null,"Zdroj: Centrální registr dotací MF",null,null,null,"Komentáře:",null,null,null,null,null,null,null,"Zdroj: Centrální registr dotací MF"]
[null,null,null,null,null,null,null,null,null,null,null,null,null,null,"1)","Údaje představující rozdíl mezi poskytnutými dotačními prostředky a vratkami před koncem roku a nezahrnující vratky z finančního vypořádání.",null,null,null,null,null,null,null,null,null,null,"1)","Údaje představující rozdíl mezi poskytnutými dotačními prostředky a vratkami před koncem roku a nezahrnující vratky z finančního vypořádání."]

{"sheet":"Paragrafy","index":13,"n_rows":74,"n_cols":2,"rows_kept":74,"cut":false,"hidden":true,"merged":[]}
["SKUPINA 3 – služby pro obyvatelstvo"]
[null,"31–32 – vzdělávání"]
[3111,"předškolní zařízení "]
[3112,"speciální předškolní zařízení"]
[3113,"základní školy"]
[3114,"speciální základní školy"]
[3115,"internátní speciální mateřské školy"]
[3116,"internátní speciální základní školy"]
[3117,"první stupeň základních škol"]
[3118,"druhý stupeň základních škol"]
[3119,"ostatní záležitosti předškolní výchovy a základního vzdělávání"]
[3121,"gymnázia"]
[3122,"střední odborné školy"]
[3123,"střední odborná učiliště a učiliště"]
[3124,"speciální střední školy"]
[3125,"střediska praktického vyučování a školní hospodářství"]
[3126,"konzervatoře"]
[3127,"internátní speciální střední odborná učiliště a odborná učiliště"]
[3128,"sportovní školy – gymnázia"]
[3129,"ostatní zařízení středního vzdělávání "]
[3131,"výchovné ústavy a dětské domovy se školou"]
[3132,"diagnostické ústavy"]
[3139,"ostatní školská zařízení pro výkon ústavní a ochranné výchovy"]
[3141,"školní stravování při předškolním a základním vzdělávání"]
[3142,"ostatní školní stravování"]
[3143,"školní družiny a kluby"]
[3144,"školy v přírodě"]
[3145,"internáty"]
[3146,"zařízení výchovného poradenství a preventivně výchovné péče"]
[3147,"domovy mládeže"]
[3149,"ostatní zařízení související s výchovou a vzděláváním mládeže"]
[3150,"vyšší odborné školy"]
[3211,"činnost vysokých škol"]
[3212,"výzkum a vývoj na vysokých školách"]
[3213,"bakalářské studium"]
[3214,"magisterské a doktorské studium"]
[3221,"vysokoškolské koleje a menzy"]
[3229,"ostatní zařízení související s vysokoškolským vzděláváním"]
[3231,"základní umělecké školy"]
[3239,"záležitosti zájmového studia jinde nezařazené"]
[3261,"činnost ústředního orgánu státní správy ve vzdělávání (MŠMT)"]
[3262,"činnost ostatních orgánů státní správy ve vzdělávání"]
[3269,"ostatní správa ve vzdělávání jinde nezařazená"]
[3280,"výzkum školství a vzdělávání"]
[3291,"mezinárodní spolupráce ve vzdělávání "]
[3292,"vzdělávání národnostních menšin a multikulturní výchova"]
[3293,"vzdělávací akce k integraci Romů"]
[3299,"ostatní záležitosti vzdělávání "]
[null,"33 – kultura, církve a sdělovací prostředky"]
[3314,"činnosti knihovnické"]
[3315,"činnosti muzeí a galerií"]
[null,"34 – tělovýchova a zájmová činnost"]
[3411,"státní sportovní reprezentace"]
[3419,"ostatní tělovýchovná činnost"]
[3421,"využití volného času dětí a mládeže"]
[null,"35 – zdravotnictví"]
[3541,"prevence před drogami, alkoholem, nikotinem a jinými návykovými látkami"]
[null,"37 – ochrana životního prostředí"]
[3745,"péče o vzhled obcí a veřejnou zeleň"]
[null,"38 – ostatní výzkum a vývoj "]
[3809,"ostatní  výzkum a vývoj odvětvově nespecifikovaný"]
["SKUPINA 4 – sociální věci a politika zaměstnanosti"]
[null,"43 – sociální služby a společné činnosti v sociálním zabezpečení a politice zaměstnanosti"]
[4313,"soc. ústavy pro zdr. postiž. mládež včetně diag. ústavů"]
[4322,"ústavy péče pro mládež"]
["SKUPINA 5 – bezpečnost státu a právní ochrana"]
[null,"52 – civilní připravenost na krizové stavy"]
[5299,"ostatní záležitosti civilní připravenosti na krizové stavy"]
[null,"53 – bezpečnost a veřejný pořádek"]
[5399,"ostatní záležitosti bezpečnosti, veřejného pořádku"]
["SKUPINA 6 – všeobecná veřejná správa a služby"]
[null,"62 – jiné veřejné služby a činnosti"]
[6221,"humanitární zahraniční pomoc"]
[6222,"rozvojová zahraniční pomoc"]

{"sheet":"Komentáře","index":14,"n_rows":103,"n_cols":5,"rows_kept":103,"cut":false,"hidden":true,"merged":[]}
[]
[]
[null,null,"KOMENTÁŘE K TABULKÁM V SEŠITU - texty delší než 255 znaků zkraťte, nebo rozdělte do 2 řádků.",null,"   21.5.2004 12:52:48"]
[null,null,null,"Počet znaků","   Použití komentářů"]
[null,null,"Výdaje z rozpočtu kapitol 333-MŠMT, 700-obce a DSO a KÚ (část: vzdělávání).",{"$f":"LEN(C5)","v":75}]
[null,null,"Uváděné výdaje neobsahují z daných tříd rozpočtové skladby následující položky: 5321; 5323; 5329; 5344; 5345; 5349; 5366; 5367; 5641; 5642; 5649; 6341; 6342; 6349; 6441; 6442; 6449. ",182,"   B1"]
[null,null,"Vzhledem k transformaci veřejné správy došlo k podstatným změnám v metodice financování vzdělávání - údaje v letech 2000 a 2001 nelze u kapitoly 333-MŠMT porovnávat.",165]
[null,null,"Údaje za soukromé a církevní školy z registru CEDR ze dne 10. 6. 2002.",70]
[null,null,"Tabulka neobsahuje z daných tříd následující položky: 5321, 5323, 5329, 5344, 5345, 5349, 5366, 5367, 5641, 5642, 5649, 6341, 6342, 6349, 6441, 6442, 6449.",155,"   B7   B9   B10"]
[null,null,"Tabulka neobsahuje z daných tříd následující položky: 2223, 2441, 2442, 2449, 4121, 4122, 4129, 4133, 4134, 4139, 4221, 4222, 4229.",131,"   B5"]
[null,null,"Poskytnuté finanční prostředky k 31. 12. 2012.",46,"   B11"]
[null,null,"Tabulka uvádí pouze spotřebované finanční prostředky, to znamená dotace zmenšené o vratky.",90,"   B13"]
[null,null,"Uvedené údaje zahrnují pouze dotace rozdělené konkrétním subjektům. ",68,"   B12"]
[null,null,"Přijaté dotace (skutečnost) zahrnují převody z vlastních fondů (především z rezervního).",88,"   B4"]
[null,null,"Vysoké plnění příjmů kapitoly 333 v roce 2006 bylo ovlivněno operacemi spojenými s rezervním fondem.",100,"   B1   B2   B4"]
[null,null,"Bez škol pro děti, žáky, studenty se speciálními vzdělávacími potřebami.",72]
[null,null,"V roce 2007 bylo vykázáno nulové naplnění (skutečnost) příjmů z rozpočtu Evropské unie bez SZP na programovací období  2007 až 2013.",132]
[null,null,"Překročení rozpočtu bylo kryto použitím prostředků rezervního fondu.",68]
[null,null,"Jsou zahrnuty finanční prostředky nerozdělené krajským úřadem či magistrátem jednotlivým školám/školským zařízením a dále pak finanční prostředky určené pro rozvojové programy zaslané pod účelovým znakem 33155.",210]
[null,null,null,0]
[null,null,null,0]
[null,null,null,0]
[null,null,null,0]
[null,null,null,0]
[null,null,null,0]
[null,null,null,0]
[null,null,null,0]
[null,null,null,0]
[null,null,null,0]
[null,null,null,0]
[null,null,null,0]
[null,null,null,0]
[null,null,null,0]
[null,null,null,0]
[null,null,null,0]
[null,null,null,0]
[null,null,null,{"$f":"LEN(C37)","v":0}]
[null,null,null,0]
[null,null,null,0]
[null,null,null,0]
[null,null,null,0]
[null,null,null,0]
[null,null,null,0]
[null,null,null,0]
[null,null,null,0]
[null,null,null,0]
[null,null,null,0]
[null,null,null,0]
[null,null,null,0]
[null,null,null,0]
[null,null,null,0]
[null,null,null,0]
[null,null,null,0]
[null,null,null,0]
[null,null,null,0]
[null,null,null,0]
[null,null,null,0]
[null,null,null,0]
[null,null,null,0]
[null,null,null,0]
[null,null,null,0]
[null,null,null,0]
[null,null,null,0]
[null,null,null,0]
[null,null,null,0]
[null,null,null,0]
[null,null,null,0]
[null,null,null,0]
[null,null,null,{"$f":"LEN(C69)","v":0}]
[null,null,null,0]
[null,null,null,0]
[null,null,null,0]
[null,null,null,0]
[null,null,null,0]
[null,null,null,0]
[null,null,null,0]
[null,null,null,0]
[null,null,null,0]
[null,null,null,0]
[null,null,null,0]
[null,null,null,0]
[null,null,null,0]
[null,null,null,0]
[null,null,null,0]
[null,null,null,0]
[null,null,null,0]
[null,null,null,0]
[null,null,null,0]
[null,null,null,0]
[null,null,null,0]
[null,null,null,0]
[null,null,null,0]
[null,null,null,0]
[null,null,null,0]
[null,null,null,0]
[null,null,null,0]
[null,null,null,0]
[null,null,null,0]
[null,null,null,0]
[null,null,null,0]
[null,null,null,{"$f":"LEN(C101)","v":0}]
[null,null,null,{"$f":"LEN(C102)","v":0}]
[null,null,null,{"$f":"LEN(C103)","v":0}]